%YAML 1.1
%TAG !u! tag:unity3d.com,2011:
--- !u!74 &7400000
AnimationClip:
  m_ObjectHideFlags: 0
  m_CorrespondingSourceObject: {fileID: 0}
  m_PrefabInstance: {fileID: 0}
  m_PrefabAsset: {fileID: 0}
  m_Name: ballAnimV2
  serializedVersion: 6
  m_Legacy: 0
  m_Compressed: 0
  m_UseHighQualityCurve: 1
  m_RotationCurves: []
  m_CompressedRotationCurves: []
  m_EulerCurves: []
  m_PositionCurves: []
  m_ScaleCurves: []
  m_FloatCurves: []
  m_PPtrCurves:
  - curve:
    - time: 0
      value: {fileID: 1671770725798053870, guid: e09ef985a63be4a2288541055dc272fb,
        type: 3}
    - time: 0.025
      value: {fileID: -2571703326008928016, guid: e09ef985a63be4a2288541055dc272fb,
        type: 3}
    - time: 0.05
      value: {fileID: 8707339702653550022, guid: e09ef985a63be4a2288541055dc272fb,
        type: 3}
    - time: 0.075
      value: {fileID: -4105908463169971880, guid: e09ef985a63be4a2288541055dc272fb,
        type: 3}
    - time: 0.1
      value: {fileID: 1873316696889913204, guid: e09ef985a63be4a2288541055dc272fb,
        type: 3}
    - time: 0.125
      value: {fileID: 533674627197565247, guid: e09ef985a63be4a2288541055dc272fb,
        type: 3}
    - time: 0.15
      value: {fileID: -7914020412649660948, guid: e09ef985a63be4a2288541055dc272fb,
        type: 3}
    - time: 0.175
      value: {fileID: 4874565263537308328, guid: e09ef985a63be4a2288541055dc272fb,
        type: 3}
    - time: 0.2
      value: {fileID: -233958235776944899, guid: e09ef985a63be4a2288541055dc272fb,
        type: 3}
    - time: 0.225
      value: {fileID: -7414667843090280231, guid: e09ef985a63be4a2288541055dc272fb,
        type: 3}
    - time: 0.25
      value: {fileID: 2967044943816370627, guid: e09ef985a63be4a2288541055dc272fb,
        type: 3}
    - time: 0.275
      value: {fileID: 749397808116943186, guid: e09ef985a63be4a2288541055dc272fb,
        type: 3}
    - time: 0.3
      value: {fileID: -2263225282760916124, guid: e09ef985a63be4a2288541055dc272fb,
        type: 3}
    - time: 0.325
      value: {fileID: -808394862905467263, guid: e09ef985a63be4a2288541055dc272fb,
        type: 3}
    - time: 0.35
      value: {fileID: -1228040958981064676, guid: e09ef985a63be4a2288541055dc272fb,
        type: 3}
    - time: 0.375
      value: {fileID: -1026552251710002934, guid: e09ef985a63be4a2288541055dc272fb,
        type: 3}
    - time: 0.4
      value: {fileID: -292032465961154669, guid: e09ef985a63be4a2288541055dc272fb,
        type: 3}
    - time: 0.425
      value: {fileID: -5129393112881412983, guid: e09ef985a63be4a2288541055dc272fb,
        type: 3}
    - time: 0.45
      value: {fileID: -5502571527559923873, guid: e09ef985a63be4a2288541055dc272fb,
        type: 3}
    - time: 0.475
      value: {fileID: -8146783104273346721, guid: e09ef985a63be4a2288541055dc272fb,
        type: 3}
    - time: 0.5
      value: {fileID: -8916177659237897463, guid: e09ef985a63be4a2288541055dc272fb,
        type: 3}
    - time: 0.525
      value: {fileID: 165310619056794003, guid: e09ef985a63be4a2288541055dc272fb,
        type: 3}
    - time: 0.55
      value: {fileID: -3196592094613433785, guid: e09ef985a63be4a2288541055dc272fb,
        type: 3}
    - time: 0.575
      value: {fileID: -5463222951953349432, guid: e09ef985a63be4a2288541055dc272fb,
        type: 3}
    - time: 0.6
      value: {fileID: -1790292366656800777, guid: e09ef985a63be4a2288541055dc272fb,
        type: 3}
    - time: 0.625
      value: {fileID: 6719378427139547790, guid: e09ef985a63be4a2288541055dc272fb,
        type: 3}
    - time: 0.65
      value: {fileID: -4315489186915009424, guid: e09ef985a63be4a2288541055dc272fb,
        type: 3}
    - time: 0.675
      value: {fileID: -4836157366753357692, guid: e09ef985a63be4a2288541055dc272fb,
        type: 3}
    - time: 0.7
      value: {fileID: -5663632971883141810, guid: e09ef985a63be4a2288541055dc272fb,
        type: 3}
    - time: 0.725
      value: {fileID: 137115183512468488, guid: e09ef985a63be4a2288541055dc272fb,
        type: 3}
    - time: 0.75
      value: {fileID: -6101257221465214923, guid: e09ef985a63be4a2288541055dc272fb,
        type: 3}
    - time: 0.775
      value: {fileID: -4319567964639533858, guid: e09ef985a63be4a2288541055dc272fb,
        type: 3}
    - time: 0.8
      value: {fileID: -2801496193106301454, guid: e09ef985a63be4a2288541055dc272fb,
        type: 3}
    - time: 0.825
      value: {fileID: -6846492737709763229, guid: e09ef985a63be4a2288541055dc272fb,
        type: 3}
    - time: 0.85
      value: {fileID: 1965226135115181423, guid: e09ef985a63be4a2288541055dc272fb,
        type: 3}
    - time: 0.875
      value: {fileID: 4613113020391726707, guid: e09ef985a63be4a2288541055dc272fb,
        type: 3}
    - time: 0.9
      value: {fileID: -8830653782956157210, guid: e09ef985a63be4a2288541055dc272fb,
        type: 3}
    - time: 0.925
      value: {fileID: 4658871818470937432, guid: e09ef985a63be4a2288541055dc272fb,
        type: 3}
    - time: 0.95
      value: {fileID: 2531537191089451894, guid: e09ef985a63be4a2288541055dc272fb,
        type: 3}
    - time: 0.975
      value: {fileID: 4314469055084779995, guid: e09ef985a63be4a2288541055dc272fb,
        type: 3}
    - time: 1
      value: {fileID: 3740482633158089807, guid: e09ef985a63be4a2288541055dc272fb,
        type: 3}
    - time: 1.025
      value: {fileID: -7967667448772314908, guid: e09ef985a63be4a2288541055dc272fb,
        type: 3}
    - time: 1.05
      value: {fileID: 6216422859625907959, guid: e09ef985a63be4a2288541055dc272fb,
        type: 3}
    - time: 1.075
      value: {fileID: -9155522960400811475, guid: e09ef985a63be4a2288541055dc272fb,
        type: 3}
    - time: 1.1
      value: {fileID: 3003423310083790736, guid: e09ef985a63be4a2288541055dc272fb,
        type: 3}
    - time: 1.125
      value: {fileID: 8949937600393488381, guid: e09ef985a63be4a2288541055dc272fb,
        type: 3}
    - time: 1.15
      value: {fileID: 2126160739351903664, guid: e09ef985a63be4a2288541055dc272fb,
        type: 3}
    - time: 1.175
      value: {fileID: -5754699410306293963, guid: e09ef985a63be4a2288541055dc272fb,
        type: 3}
    - time: 1.2
      value: {fileID: -4289896844393890106, guid: e09ef985a63be4a2288541055dc272fb,
        type: 3}
    - time: 1.225
      value: {fileID: 2693372251019031802, guid: e09ef985a63be4a2288541055dc272fb,
        type: 3}
    - time: 1.25
      value: {fileID: 785313288655044020, guid: e09ef985a63be4a2288541055dc272fb,
        type: 3}
    - time: 1.275
      value: {fileID: -192946325650041012, guid: e09ef985a63be4a2288541055dc272fb,
        type: 3}
    - time: 1.3
      value: {fileID: -9131895930855323696, guid: e09ef985a63be4a2288541055dc272fb,
        type: 3}
    - time: 1.325
      value: {fileID: -215392658262871144, guid: e09ef985a63be4a2288541055dc272fb,
        type: 3}
    - time: 1.35
      value: {fileID: -4780670987684559610, guid: e09ef985a63be4a2288541055dc272fb,
        type: 3}
    - time: 1.375
      value: {fileID: -2241847416847891519, guid: e09ef985a63be4a2288541055dc272fb,
        type: 3}
    - time: 1.4
      value: {fileID: 8040582371837998155, guid: e09ef985a63be4a2288541055dc272fb,
        type: 3}
    - time: 1.425
      value: {fileID: -2480404066512225666, guid: e09ef985a63be4a2288541055dc272fb,
        type: 3}
    - time: 1.45
      value: {fileID: 1958746015792844097, guid: e09ef985a63be4a2288541055dc272fb,
        type: 3}
    - time: 1.475
      value: {fileID: -6733961436098124499, guid: e09ef985a63be4a2288541055dc272fb,
        type: 3}
    - time: 1.5
      value: {fileID: 7534163268811486931, guid: e09ef985a63be4a2288541055dc272fb,
        type: 3}
    - time: 1.525
      value: {fileID: 1554282852552911522, guid: e09ef985a63be4a2288541055dc272fb,
        type: 3}
    - time: 1.55
      value: {fileID: -5281825019023212541, guid: e09ef985a63be4a2288541055dc272fb,
        type: 3}
    - time: 1.575
      value: {fileID: 3252372606147659522, guid: e09ef985a63be4a2288541055dc272fb,
        type: 3}
    - time: 1.6
      value: {fileID: 4031602925534188236, guid: e09ef985a63be4a2288541055dc272fb,
        type: 3}
    - time: 1.625
      value: {fileID: -4920800029541619738, guid: e09ef985a63be4a2288541055dc272fb,
        type: 3}
    - time: 1.65
      value: {fileID: 6489662528690728773, guid: e09ef985a63be4a2288541055dc272fb,
        type: 3}
    - time: 1.675
      value: {fileID: -4289077048124014316, guid: e09ef985a63be4a2288541055dc272fb,
        type: 3}
    - time: 1.7
      value: {fileID: -3515597480675131285, guid: e09ef985a63be4a2288541055dc272fb,
        type: 3}
    - time: 1.725
      value: {fileID: 3180045661013702791, guid: e09ef985a63be4a2288541055dc272fb,
        type: 3}
    - time: 1.75
      value: {fileID: 1890584319697617519, guid: e09ef985a63be4a2288541055dc272fb,
        type: 3}
    - time: 1.775
      value: {fileID: -4032013114621381543, guid: e09ef985a63be4a2288541055dc272fb,
        type: 3}
    - time: 1.8
      value: {fileID: -530824780763482991, guid: e09ef985a63be4a2288541055dc272fb,
        type: 3}
    - time: 1.825
      value: {fileID: 6948785943010196364, guid: e09ef985a63be4a2288541055dc272fb,
        type: 3}
    - time: 1.85
      value: {fileID: -2527062602743807751, guid: e09ef985a63be4a2288541055dc272fb,
        type: 3}
    - time: 1.875
      value: {fileID: -6425978765668876427, guid: e09ef985a63be4a2288541055dc272fb,
        type: 3}
    - time: 1.9
      value: {fileID: -6924626542799172568, guid: e09ef985a63be4a2288541055dc272fb,
        type: 3}
    attribute: m_Sprite
    path: 
    classID: 212
    script: {fileID: 0}
  m_SampleRate: 40
  m_WrapMode: 0
  m_Bounds:
    m_Center: {x: 0, y: 0, z: 0}
    m_Extent: {x: 0, y: 0, z: 0}
  m_ClipBindingConstant:
    genericBindings:
    - serializedVersion: 2
      path: 0
      attribute: 0
      script: {fileID: 0}
      typeID: 212
      customType: 23
      isPPtrCurve: 1
    pptrCurveMapping:
    - {fileID: 1671770725798053870, guid: e09ef985a63be4a2288541055dc272fb, type: 3}
    - {fileID: -2571703326008928016, guid: e09ef985a63be4a2288541055dc272fb, type: 3}
    - {fileID: 8707339702653550022, guid: e09ef985a63be4a2288541055dc272fb, type: 3}
    - {fileID: -4105908463169971880, guid: e09ef985a63be4a2288541055dc272fb, type: 3}
    - {fileID: 1873316696889913204, guid: e09ef985a63be4a2288541055dc272fb, type: 3}
    - {fileID: 533674627197565247, guid: e09ef985a63be4a2288541055dc272fb, type: 3}
    - {fileID: -7914020412649660948, guid: e09ef985a63be4a2288541055dc272fb, type: 3}
    - {fileID: 4874565263537308328, guid: e09ef985a63be4a2288541055dc272fb, type: 3}
    - {fileID: -233958235776944899, guid: e09ef985a63be4a2288541055dc272fb, type: 3}
    - {fileID: -7414667843090280231, guid: e09ef985a63be4a2288541055dc272fb, type: 3}
    - {fileID: 2967044943816370627, guid: e09ef985a63be4a2288541055dc272fb, type: 3}
    - {fileID: 749397808116943186, guid: e09ef985a63be4a2288541055dc272fb, type: 3}
    - {fileID: -2263225282760916124, guid: e09ef985a63be4a2288541055dc272fb, type: 3}
    - {fileID: -808394862905467263, guid: e09ef985a63be4a2288541055dc272fb, type: 3}
    - {fileID: -1228040958981064676, guid: e09ef985a63be4a2288541055dc272fb, type: 3}
    - {fileID: -1026552251710002934, guid: e09ef985a63be4a2288541055dc272fb, type: 3}
    - {fileID: -292032465961154669, guid: e09ef985a63be4a2288541055dc272fb, type: 3}
    - {fileID: -5129393112881412983, guid: e09ef985a63be4a2288541055dc272fb, type: 3}
    - {fileID: -5502571527559923873, guid: e09ef985a63be4a2288541055dc272fb, type: 3}
    - {fileID: -8146783104273346721, guid: e09ef985a63be4a2288541055dc272fb, type: 3}
    - {fileID: -8916177659237897463, guid: e09ef985a63be4a2288541055dc272fb, type: 3}
    - {fileID: 165310619056794003, guid: e09ef985a63be4a2288541055dc272fb, type: 3}
    - {fileID: -3196592094613433785, guid: e09ef985a63be4a2288541055dc272fb, type: 3}
    - {fileID: -5463222951953349432, guid: e09ef985a63be4a2288541055dc272fb, type: 3}
    - {fileID: -1790292366656800777, guid: e09ef985a63be4a2288541055dc272fb, type: 3}
    - {fileID: 6719378427139547790, guid: e09ef985a63be4a2288541055dc272fb, type: 3}
    - {fileID: -4315489186915009424, guid: e09ef985a63be4a2288541055dc272fb, type: 3}
    - {fileID: -4836157366753357692, guid: e09ef985a63be4a2288541055dc272fb, type: 3}
    - {fileID: -5663632971883141810, guid: e09ef985a63be4a2288541055dc272fb, type: 3}
    - {fileID: 137115183512468488, guid: e09ef985a63be4a2288541055dc272fb, type: 3}
    - {fileID: -6101257221465214923, guid: e09ef985a63be4a2288541055dc272fb, type: 3}
    - {fileID: -4319567964639533858, guid: e09ef985a63be4a2288541055dc272fb, type: 3}
    - {fileID: -2801496193106301454, guid: e09ef985a63be4a2288541055dc272fb, type: 3}
    - {fileID: -6846492737709763229, guid: e09ef985a63be4a2288541055dc272fb, type: 3}
    - {fileID: 1965226135115181423, guid: e09ef985a63be4a2288541055dc272fb, type: 3}
    - {fileID: 4613113020391726707, guid: e09ef985a63be4a2288541055dc272fb, type: 3}
    - {fileID: -8830653782956157210, guid: e09ef985a63be4a2288541055dc272fb, type: 3}
    - {fileID: 4658871818470937432, guid: e09ef985a63be4a2288541055dc272fb, type: 3}
    - {fileID: 2531537191089451894, guid: e09ef985a63be4a2288541055dc272fb, type: 3}
    - {fileID: 4314469055084779995, guid: e09ef985a63be4a2288541055dc272fb, type: 3}
    - {fileID: 3740482633158089807, guid: e09ef985a63be4a2288541055dc272fb, type: 3}
    - {fileID: -7967667448772314908, guid: e09ef985a63be4a2288541055dc272fb, type: 3}
    - {fileID: 6216422859625907959, guid: e09ef985a63be4a2288541055dc272fb, type: 3}
    - {fileID: -9155522960400811475, guid: e09ef985a63be4a2288541055dc272fb, type: 3}
    - {fileID: 3003423310083790736, guid: e09ef985a63be4a2288541055dc272fb, type: 3}
    - {fileID: 8949937600393488381, guid: e09ef985a63be4a2288541055dc272fb, type: 3}
    - {fileID: 2126160739351903664, guid: e09ef985a63be4a2288541055dc272fb, type: 3}
    - {fileID: -5754699410306293963, guid: e09ef985a63be4a2288541055dc272fb, type: 3}
    - {fileID: -4289896844393890106, guid: e09ef985a63be4a2288541055dc272fb, type: 3}
    - {fileID: 2693372251019031802, guid: e09ef985a63be4a2288541055dc272fb, type: 3}
    - {fileID: 785313288655044020, guid: e09ef985a63be4a2288541055dc272fb, type: 3}
    - {fileID: -192946325650041012, guid: e09ef985a63be4a2288541055dc272fb, type: 3}
    - {fileID: -9131895930855323696, guid: e09ef985a63be4a2288541055dc272fb, type: 3}
    - {fileID: -215392658262871144, guid: e09ef985a63be4a2288541055dc272fb, type: 3}
    - {fileID: -4780670987684559610, guid: e09ef985a63be4a2288541055dc272fb, type: 3}
    - {fileID: -2241847416847891519, guid: e09ef985a63be4a2288541055dc272fb, type: 3}
    - {fileID: 8040582371837998155, guid: e09ef985a63be4a2288541055dc272fb, type: 3}
    - {fileID: -2480404066512225666, guid: e09ef985a63be4a2288541055dc272fb, type: 3}
    - {fileID: 1958746015792844097, guid: e09ef985a63be4a2288541055dc272fb, type: 3}
    - {fileID: -6733961436098124499, guid: e09ef985a63be4a2288541055dc272fb, type: 3}
    - {fileID: 7534163268811486931, guid: e09ef985a63be4a2288541055dc272fb, type: 3}
    - {fileID: 1554282852552911522, guid: e09ef985a63be4a2288541055dc272fb, type: 3}
    - {fileID: -5281825019023212541, guid: e09ef985a63be4a2288541055dc272fb, type: 3}
    - {fileID: 3252372606147659522, guid: e09ef985a63be4a2288541055dc272fb, type: 3}
    - {fileID: 4031602925534188236, guid: e09ef985a63be4a2288541055dc272fb, type: 3}
    - {fileID: -4920800029541619738, guid: e09ef985a63be4a2288541055dc272fb, type: 3}
    - {fileID: 6489662528690728773, guid: e09ef985a63be4a2288541055dc272fb, type: 3}
    - {fileID: -4289077048124014316, guid: e09ef985a63be4a2288541055dc272fb, type: 3}
    - {fileID: -3515597480675131285, guid: e09ef985a63be4a2288541055dc272fb, type: 3}
    - {fileID: 3180045661013702791, guid: e09ef985a63be4a2288541055dc272fb, type: 3}
    - {fileID: 1890584319697617519, guid: e09ef985a63be4a2288541055dc272fb, type: 3}
    - {fileID: -4032013114621381543, guid: e09ef985a63be4a2288541055dc272fb, type: 3}
    - {fileID: -530824780763482991, guid: e09ef985a63be4a2288541055dc272fb, type: 3}
    - {fileID: 6948785943010196364, guid: e09ef985a63be4a2288541055dc272fb, type: 3}
    - {fileID: -2527062602743807751, guid: e09ef985a63be4a2288541055dc272fb, type: 3}
    - {fileID: -6425978765668876427, guid: e09ef985a63be4a2288541055dc272fb, type: 3}
    - {fileID: -6924626542799172568, guid: e09ef985a63be4a2288541055dc272fb, type: 3}
  m_AnimationClipSettings:
    serializedVersion: 2
    m_AdditiveReferencePoseClip: {fileID: 0}
    m_AdditiveReferencePoseTime: 0
    m_StartTime: 0
    m_StopTime: 1.925
    m_OrientationOffsetY: 0
    m_Level: 0
    m_CycleOffset: 0
    m_HasAdditiveReferencePose: 0
    m_LoopTime: 1
    m_LoopBlend: 0
    m_LoopBlendOrientation: 0
    m_LoopBlendPositionY: 0
    m_LoopBlendPositionXZ: 0
    m_KeepOriginalOrientation: 0
    m_KeepOriginalPositionY: 1
    m_KeepOriginalPositionXZ: 0
    m_HeightFromFeet: 0
    m_Mirror: 0
  m_EditorCurves: []
  m_EulerEditorCurves: []
  m_HasGenericRootTransform: 0
  m_HasMotionFloatCurves: 0
  m_Events: []
