(kicad_symbol_lib
	(version 20231120)
	(generator "kicad_symbol_editor")
	(generator_version "8.0")
	(symbol "ATSAMA5D21"
		(exclude_from_sim no)
		(in_bom yes)
		(on_board yes)
		(property "Reference" "U"
			(at 0 63.5 0)
			(effects
				(font
					(size 1.27 1.27)
				)
			)
		)
		(property "Value" "ATSAMA5D21"
			(at 0 60.96 0)
			(effects
				(font
					(size 1.27 1.27)
				)
			)
		)
		(property "Footprint" "Package_BGA:Microchip_TFBGA-196_11x11mm_Layout14x14_P0.75mm_SMD"
			(at 0 -2.54 0)
			(effects
				(font
					(size 1.27 1.27)
				)
				(hide yes)
			)
		)
		(property "Datasheet" "http://ww1.microchip.com/downloads/en/DeviceDoc/SAMA5D2-Series-Data-Sheet-DS60001476C.pdf"
			(at -11.43 22.86 0)
			(effects
				(font
					(size 1.27 1.27)
				)
				(hide yes)
			)
		)
		(property "Description" "ARM Cortex-A5 MPU, 500 MHz max, 1x SDIO/SD-CARD/eMMC/QSPI memory, 128 kB SRAM, 16-bit bus DDR2/DDR3 RAM, 1.1-1.32 V, 72 GPIO, TFBGA-196"
			(at 0 0 0)
			(effects
				(font
					(size 1.27 1.27)
				)
				(hide yes)
			)
		)
		(property "ki_locked" ""
			(at 0 0 0)
			(effects
				(font
					(size 1.27 1.27)
				)
			)
		)
		(property "ki_keywords" "MPU Cortex-A5 Cortex A5 Linux DDR DRAM BGA"
			(at 0 0 0)
			(effects
				(font
					(size 1.27 1.27)
				)
				(hide yes)
			)
		)
		(property "ki_fp_filters" "Microchip*TFBGA*11x11mm*P0.75mm*"
			(at 0 0 0)
			(effects
				(font
					(size 1.27 1.27)
				)
				(hide yes)
			)
		)
		(symbol "ATSAMA5D21_1_1"
			(rectangle
				(start 1.27 20.32)
				(end -5.08 -17.78)
				(stroke
					(width 0)
					(type default)
				)
				(fill
					(type background)
				)
			)
			(pin bidirectional line
				(at 5.08 0 180)
				(length 3.81)
				(name "PA25"
					(effects
						(font
							(size 1.27 1.27)
						)
					)
				)
				(number "L10"
					(effects
						(font
							(size 1.27 1.27)
						)
					)
				)
			)
			(pin bidirectional line
				(at 5.08 17.78 180)
				(length 3.81)
				(name "PA18"
					(effects
						(font
							(size 1.27 1.27)
						)
					)
				)
				(number "L9"
					(effects
						(font
							(size 1.27 1.27)
						)
					)
				)
			)
			(pin bidirectional line
				(at 5.08 10.16 180)
				(length 3.81)
				(name "PA21"
					(effects
						(font
							(size 1.27 1.27)
						)
					)
				)
				(number "M10"
					(effects
						(font
							(size 1.27 1.27)
						)
					)
				)
			)
			(pin bidirectional line
				(at 5.08 -7.62 180)
				(length 3.81)
				(name "PA28"
					(effects
						(font
							(size 1.27 1.27)
						)
					)
				)
				(number "M11"
					(effects
						(font
							(size 1.27 1.27)
						)
					)
				)
			)
			(pin bidirectional line
				(at 5.08 -15.24 180)
				(length 3.81)
				(name "PA31"
					(effects
						(font
							(size 1.27 1.27)
						)
					)
				)
				(number "M12"
					(effects
						(font
							(size 1.27 1.27)
						)
					)
				)
			)
			(pin bidirectional line
				(at 5.08 12.7 180)
				(length 3.81)
				(name "PA20"
					(effects
						(font
							(size 1.27 1.27)
						)
					)
				)
				(number "M9"
					(effects
						(font
							(size 1.27 1.27)
						)
					)
				)
			)
			(pin bidirectional line
				(at 5.08 2.54 180)
				(length 3.81)
				(name "PA24"
					(effects
						(font
							(size 1.27 1.27)
						)
					)
				)
				(number "N10"
					(effects
						(font
							(size 1.27 1.27)
						)
					)
				)
			)
			(pin bidirectional line
				(at 5.08 -10.16 180)
				(length 3.81)
				(name "PA29"
					(effects
						(font
							(size 1.27 1.27)
						)
					)
				)
				(number "N11"
					(effects
						(font
							(size 1.27 1.27)
						)
					)
				)
			)
			(pin bidirectional line
				(at 5.08 -12.7 180)
				(length 3.81)
				(name "PA30"
					(effects
						(font
							(size 1.27 1.27)
						)
					)
				)
				(number "N12"
					(effects
						(font
							(size 1.27 1.27)
						)
					)
				)
			)
			(pin bidirectional line
				(at 5.08 15.24 180)
				(length 3.81)
				(name "PA19"
					(effects
						(font
							(size 1.27 1.27)
						)
					)
				)
				(number "N9"
					(effects
						(font
							(size 1.27 1.27)
						)
					)
				)
			)
			(pin bidirectional line
				(at 5.08 5.08 180)
				(length 3.81)
				(name "PA23"
					(effects
						(font
							(size 1.27 1.27)
						)
					)
				)
				(number "P10"
					(effects
						(font
							(size 1.27 1.27)
						)
					)
				)
			)
			(pin bidirectional line
				(at 5.08 -2.54 180)
				(length 3.81)
				(name "PA26"
					(effects
						(font
							(size 1.27 1.27)
						)
					)
				)
				(number "P11"
					(effects
						(font
							(size 1.27 1.27)
						)
					)
				)
			)
			(pin bidirectional line
				(at 5.08 -5.08 180)
				(length 3.81)
				(name "PA27"
					(effects
						(font
							(size 1.27 1.27)
						)
					)
				)
				(number "P12"
					(effects
						(font
							(size 1.27 1.27)
						)
					)
				)
			)
			(pin bidirectional line
				(at 5.08 7.62 180)
				(length 3.81)
				(name "PA22"
					(effects
						(font
							(size 1.27 1.27)
						)
					)
				)
				(number "P9"
					(effects
						(font
							(size 1.27 1.27)
						)
					)
				)
			)
		)
		(symbol "ATSAMA5D21_2_1"
			(rectangle
				(start -5.08 43.18)
				(end 1.27 -40.64)
				(stroke
					(width 0.254)
					(type default)
				)
				(fill
					(type background)
				)
			)
			(pin bidirectional line
				(at 5.08 15.24 180)
				(length 3.81)
				(name "PB10"
					(effects
						(font
							(size 1.27 1.27)
						)
					)
				)
				(number "A1"
					(effects
						(font
							(size 1.27 1.27)
						)
					)
				)
			)
			(pin bidirectional line
				(at 5.08 20.32 180)
				(length 3.81)
				(name "PB8"
					(effects
						(font
							(size 1.27 1.27)
						)
					)
				)
				(number "A2"
					(effects
						(font
							(size 1.27 1.27)
						)
					)
				)
			)
			(pin bidirectional line
				(at 5.08 25.4 180)
				(length 3.81)
				(name "PB6"
					(effects
						(font
							(size 1.27 1.27)
						)
					)
				)
				(number "A3"
					(effects
						(font
							(size 1.27 1.27)
						)
					)
				)
			)
			(pin bidirectional line
				(at 5.08 30.48 180)
				(length 3.81)
				(name "PB4"
					(effects
						(font
							(size 1.27 1.27)
						)
					)
				)
				(number "A4"
					(effects
						(font
							(size 1.27 1.27)
						)
					)
				)
			)
			(pin bidirectional line
				(at 5.08 38.1 180)
				(length 3.81)
				(name "PB1"
					(effects
						(font
							(size 1.27 1.27)
						)
					)
				)
				(number "A5"
					(effects
						(font
							(size 1.27 1.27)
						)
					)
				)
			)
			(pin bidirectional line
				(at 5.08 40.64 180)
				(length 3.81)
				(name "PB0"
					(effects
						(font
							(size 1.27 1.27)
						)
					)
				)
				(number "A6"
					(effects
						(font
							(size 1.27 1.27)
						)
					)
				)
			)
			(pin bidirectional line
				(at 5.08 12.7 180)
				(length 3.81)
				(name "PB11"
					(effects
						(font
							(size 1.27 1.27)
						)
					)
				)
				(number "B1"
					(effects
						(font
							(size 1.27 1.27)
						)
					)
				)
			)
			(pin bidirectional line
				(at 5.08 10.16 180)
				(length 3.81)
				(name "PB12"
					(effects
						(font
							(size 1.27 1.27)
						)
					)
				)
				(number "B2"
					(effects
						(font
							(size 1.27 1.27)
						)
					)
				)
			)
			(pin bidirectional line
				(at 5.08 17.78 180)
				(length 3.81)
				(name "PB9"
					(effects
						(font
							(size 1.27 1.27)
						)
					)
				)
				(number "B3"
					(effects
						(font
							(size 1.27 1.27)
						)
					)
				)
			)
			(pin bidirectional line
				(at 5.08 22.86 180)
				(length 3.81)
				(name "PB7"
					(effects
						(font
							(size 1.27 1.27)
						)
					)
				)
				(number "B4"
					(effects
						(font
							(size 1.27 1.27)
						)
					)
				)
			)
			(pin bidirectional line
				(at 5.08 33.02 180)
				(length 3.81)
				(name "PB3"
					(effects
						(font
							(size 1.27 1.27)
						)
					)
				)
				(number "B5"
					(effects
						(font
							(size 1.27 1.27)
						)
					)
				)
			)
			(pin bidirectional line
				(at 5.08 35.56 180)
				(length 3.81)
				(name "PB2"
					(effects
						(font
							(size 1.27 1.27)
						)
					)
				)
				(number "B6"
					(effects
						(font
							(size 1.27 1.27)
						)
					)
				)
			)
			(pin bidirectional line
				(at 5.08 7.62 180)
				(length 3.81)
				(name "PB13"
					(effects
						(font
							(size 1.27 1.27)
						)
					)
				)
				(number "C1"
					(effects
						(font
							(size 1.27 1.27)
						)
					)
				)
			)
			(pin bidirectional line
				(at 5.08 -2.54 180)
				(length 3.81)
				(name "PB17"
					(effects
						(font
							(size 1.27 1.27)
						)
					)
				)
				(number "C2"
					(effects
						(font
							(size 1.27 1.27)
						)
					)
				)
			)
			(pin bidirectional line
				(at 5.08 -10.16 180)
				(length 3.81)
				(name "PB20"
					(effects
						(font
							(size 1.27 1.27)
						)
					)
				)
				(number "C3"
					(effects
						(font
							(size 1.27 1.27)
						)
					)
				)
			)
			(pin bidirectional line
				(at 5.08 -7.62 180)
				(length 3.81)
				(name "PB19"
					(effects
						(font
							(size 1.27 1.27)
						)
					)
				)
				(number "C4"
					(effects
						(font
							(size 1.27 1.27)
						)
					)
				)
			)
			(pin bidirectional line
				(at 5.08 0 180)
				(length 3.81)
				(name "PB16"
					(effects
						(font
							(size 1.27 1.27)
						)
					)
				)
				(number "C5"
					(effects
						(font
							(size 1.27 1.27)
						)
					)
				)
			)
			(pin bidirectional line
				(at 5.08 -12.7 180)
				(length 3.81)
				(name "PB21"
					(effects
						(font
							(size 1.27 1.27)
						)
					)
				)
				(number "D1"
					(effects
						(font
							(size 1.27 1.27)
						)
					)
				)
			)
			(pin bidirectional line
				(at 5.08 -15.24 180)
				(length 3.81)
				(name "PB22"
					(effects
						(font
							(size 1.27 1.27)
						)
					)
				)
				(number "D2"
					(effects
						(font
							(size 1.27 1.27)
						)
					)
				)
			)
			(pin bidirectional line
				(at 5.08 -20.32 180)
				(length 3.81)
				(name "PB24"
					(effects
						(font
							(size 1.27 1.27)
						)
					)
				)
				(number "D3"
					(effects
						(font
							(size 1.27 1.27)
						)
					)
				)
			)
			(pin bidirectional line
				(at 5.08 -5.08 180)
				(length 3.81)
				(name "PB18"
					(effects
						(font
							(size 1.27 1.27)
						)
					)
				)
				(number "D4"
					(effects
						(font
							(size 1.27 1.27)
						)
					)
				)
			)
			(pin bidirectional line
				(at 5.08 5.08 180)
				(length 3.81)
				(name "PB14"
					(effects
						(font
							(size 1.27 1.27)
						)
					)
				)
				(number "D5"
					(effects
						(font
							(size 1.27 1.27)
						)
					)
				)
			)
			(pin bidirectional line
				(at 5.08 27.94 180)
				(length 3.81)
				(name "PB5"
					(effects
						(font
							(size 1.27 1.27)
						)
					)
				)
				(number "D6"
					(effects
						(font
							(size 1.27 1.27)
						)
					)
				)
			)
			(pin bidirectional line
				(at 5.08 -17.78 180)
				(length 3.81)
				(name "PB23"
					(effects
						(font
							(size 1.27 1.27)
						)
					)
				)
				(number "E1"
					(effects
						(font
							(size 1.27 1.27)
						)
					)
				)
			)
			(pin bidirectional line
				(at 5.08 -25.4 180)
				(length 3.81)
				(name "PB26"
					(effects
						(font
							(size 1.27 1.27)
						)
					)
				)
				(number "E2"
					(effects
						(font
							(size 1.27 1.27)
						)
					)
				)
			)
			(pin bidirectional line
				(at 5.08 -22.86 180)
				(length 3.81)
				(name "PB25"
					(effects
						(font
							(size 1.27 1.27)
						)
					)
				)
				(number "E3"
					(effects
						(font
							(size 1.27 1.27)
						)
					)
				)
			)
			(pin bidirectional line
				(at 5.08 2.54 180)
				(length 3.81)
				(name "PB15"
					(effects
						(font
							(size 1.27 1.27)
						)
					)
				)
				(number "E5"
					(effects
						(font
							(size 1.27 1.27)
						)
					)
				)
			)
			(pin bidirectional line
				(at 5.08 -27.94 180)
				(length 3.81)
				(name "PB27"
					(effects
						(font
							(size 1.27 1.27)
						)
					)
				)
				(number "E6"
					(effects
						(font
							(size 1.27 1.27)
						)
					)
				)
			)
			(pin bidirectional line
				(at 5.08 -30.48 180)
				(length 3.81)
				(name "PB28"
					(effects
						(font
							(size 1.27 1.27)
						)
					)
				)
				(number "F1"
					(effects
						(font
							(size 1.27 1.27)
						)
					)
				)
			)
			(pin bidirectional line
				(at 5.08 -35.56 180)
				(length 3.81)
				(name "PB30"
					(effects
						(font
							(size 1.27 1.27)
						)
					)
				)
				(number "F2"
					(effects
						(font
							(size 1.27 1.27)
						)
					)
				)
			)
			(pin bidirectional line
				(at 5.08 -33.02 180)
				(length 3.81)
				(name "PB29"
					(effects
						(font
							(size 1.27 1.27)
						)
					)
				)
				(number "F6"
					(effects
						(font
							(size 1.27 1.27)
						)
					)
				)
			)
			(pin bidirectional line
				(at 5.08 -38.1 180)
				(length 3.81)
				(name "PB31"
					(effects
						(font
							(size 1.27 1.27)
						)
					)
				)
				(number "F7"
					(effects
						(font
							(size 1.27 1.27)
						)
					)
				)
			)
		)
		(symbol "ATSAMA5D21_3_1"
			(rectangle
				(start -5.08 -12.7)
				(end 1.27 12.7)
				(stroke
					(width 0.254)
					(type default)
				)
				(fill
					(type background)
				)
			)
			(pin bidirectional line
				(at 5.08 -2.54 180)
				(length 3.81)
				(name "PC5"
					(effects
						(font
							(size 1.27 1.27)
						)
					)
				)
				(number "J8"
					(effects
						(font
							(size 1.27 1.27)
						)
					)
				)
			)
			(pin bidirectional line
				(at 5.08 -10.16 180)
				(length 3.81)
				(name "PC8"
					(effects
						(font
							(size 1.27 1.27)
						)
					)
				)
				(number "J9"
					(effects
						(font
							(size 1.27 1.27)
						)
					)
				)
			)
			(pin bidirectional line
				(at 5.08 2.54 180)
				(length 3.81)
				(name "PC3"
					(effects
						(font
							(size 1.27 1.27)
						)
					)
				)
				(number "K10"
					(effects
						(font
							(size 1.27 1.27)
						)
					)
				)
			)
			(pin bidirectional line
				(at 5.08 10.16 180)
				(length 3.81)
				(name "PC0"
					(effects
						(font
							(size 1.27 1.27)
						)
					)
				)
				(number "M13"
					(effects
						(font
							(size 1.27 1.27)
						)
					)
				)
			)
			(pin bidirectional line
				(at 5.08 -7.62 180)
				(length 3.81)
				(name "PC7"
					(effects
						(font
							(size 1.27 1.27)
						)
					)
				)
				(number "M14"
					(effects
						(font
							(size 1.27 1.27)
						)
					)
				)
			)
			(pin bidirectional line
				(at 5.08 5.08 180)
				(length 3.81)
				(name "PC2"
					(effects
						(font
							(size 1.27 1.27)
						)
					)
				)
				(number "N13"
					(effects
						(font
							(size 1.27 1.27)
						)
					)
				)
			)
			(pin bidirectional line
				(at 5.08 -5.08 180)
				(length 3.81)
				(name "PC6"
					(effects
						(font
							(size 1.27 1.27)
						)
					)
				)
				(number "N14"
					(effects
						(font
							(size 1.27 1.27)
						)
					)
				)
			)
			(pin bidirectional line
				(at 5.08 7.62 180)
				(length 3.81)
				(name "PC1"
					(effects
						(font
							(size 1.27 1.27)
						)
					)
				)
				(number "P13"
					(effects
						(font
							(size 1.27 1.27)
						)
					)
				)
			)
			(pin bidirectional line
				(at 5.08 0 180)
				(length 3.81)
				(name "PC4"
					(effects
						(font
							(size 1.27 1.27)
						)
					)
				)
				(number "P14"
					(effects
						(font
							(size 1.27 1.27)
						)
					)
				)
			)
		)
		(symbol "ATSAMA5D21_4_1"
			(rectangle
				(start -5.08 22.86)
				(end 1.27 -22.86)
				(stroke
					(width 0.254)
					(type default)
				)
				(fill
					(type background)
				)
			)
			(pin bidirectional line
				(at 5.08 17.78 180)
				(length 3.81)
				(name "PD8"
					(effects
						(font
							(size 1.27 1.27)
						)
					)
				)
				(number "F3"
					(effects
						(font
							(size 1.27 1.27)
						)
					)
				)
			)
			(pin bidirectional line
				(at 5.08 20.32 180)
				(length 3.81)
				(name "PD7"
					(effects
						(font
							(size 1.27 1.27)
						)
					)
				)
				(number "F5"
					(effects
						(font
							(size 1.27 1.27)
						)
					)
				)
			)
			(pin bidirectional line
				(at 5.08 -2.54 180)
				(length 3.81)
				(name "PD16"
					(effects
						(font
							(size 1.27 1.27)
						)
					)
				)
				(number "G1"
					(effects
						(font
							(size 1.27 1.27)
						)
					)
				)
			)
			(pin bidirectional line
				(at 5.08 -5.08 180)
				(length 3.81)
				(name "PD17"
					(effects
						(font
							(size 1.27 1.27)
						)
					)
				)
				(number "G2"
					(effects
						(font
							(size 1.27 1.27)
						)
					)
				)
			)
			(pin bidirectional line
				(at 5.08 -7.62 180)
				(length 3.81)
				(name "PD18"
					(effects
						(font
							(size 1.27 1.27)
						)
					)
				)
				(number "G3"
					(effects
						(font
							(size 1.27 1.27)
						)
					)
				)
			)
			(pin bidirectional line
				(at 5.08 12.7 180)
				(length 3.81)
				(name "PD10"
					(effects
						(font
							(size 1.27 1.27)
						)
					)
				)
				(number "G4"
					(effects
						(font
							(size 1.27 1.27)
						)
					)
				)
			)
			(pin bidirectional line
				(at 5.08 15.24 180)
				(length 3.81)
				(name "PD9"
					(effects
						(font
							(size 1.27 1.27)
						)
					)
				)
				(number "G5"
					(effects
						(font
							(size 1.27 1.27)
						)
					)
				)
			)
			(pin bidirectional line
				(at 5.08 2.54 180)
				(length 3.81)
				(name "PD14"
					(effects
						(font
							(size 1.27 1.27)
						)
					)
				)
				(number "G6"
					(effects
						(font
							(size 1.27 1.27)
						)
					)
				)
			)
			(pin bidirectional line
				(at 5.08 10.16 180)
				(length 3.81)
				(name "PD11"
					(effects
						(font
							(size 1.27 1.27)
						)
					)
				)
				(number "H1"
					(effects
						(font
							(size 1.27 1.27)
						)
					)
				)
			)
			(pin bidirectional line
				(at 5.08 5.08 180)
				(length 3.81)
				(name "PD13"
					(effects
						(font
							(size 1.27 1.27)
						)
					)
				)
				(number "H3"
					(effects
						(font
							(size 1.27 1.27)
						)
					)
				)
			)
			(pin bidirectional line
				(at 5.08 -10.16 180)
				(length 3.81)
				(name "PD19"
					(effects
						(font
							(size 1.27 1.27)
						)
					)
				)
				(number "H4"
					(effects
						(font
							(size 1.27 1.27)
						)
					)
				)
			)
			(pin bidirectional line
				(at 5.08 0 180)
				(length 3.81)
				(name "PD15"
					(effects
						(font
							(size 1.27 1.27)
						)
					)
				)
				(number "H5"
					(effects
						(font
							(size 1.27 1.27)
						)
					)
				)
			)
			(pin bidirectional line
				(at 5.08 7.62 180)
				(length 3.81)
				(name "PD12"
					(effects
						(font
							(size 1.27 1.27)
						)
					)
				)
				(number "H6"
					(effects
						(font
							(size 1.27 1.27)
						)
					)
				)
			)
			(pin bidirectional line
				(at 5.08 -12.7 180)
				(length 3.81)
				(name "PD20"
					(effects
						(font
							(size 1.27 1.27)
						)
					)
				)
				(number "J1"
					(effects
						(font
							(size 1.27 1.27)
						)
					)
				)
			)
			(pin bidirectional line
				(at 5.08 -17.78 180)
				(length 3.81)
				(name "PD22"
					(effects
						(font
							(size 1.27 1.27)
						)
					)
				)
				(number "J3"
					(effects
						(font
							(size 1.27 1.27)
						)
					)
				)
			)
			(pin bidirectional line
				(at 5.08 -15.24 180)
				(length 3.81)
				(name "PD21"
					(effects
						(font
							(size 1.27 1.27)
						)
					)
				)
				(number "K1"
					(effects
						(font
							(size 1.27 1.27)
						)
					)
				)
			)
			(pin bidirectional line
				(at 5.08 -20.32 180)
				(length 3.81)
				(name "PD23"
					(effects
						(font
							(size 1.27 1.27)
						)
					)
				)
				(number "K2"
					(effects
						(font
							(size 1.27 1.27)
						)
					)
				)
			)
		)
		(symbol "ATSAMA5D21_5_1"
			(rectangle
				(start -13.97 11.43)
				(end 11.43 -8.89)
				(stroke
					(width 0)
					(type default)
				)
				(fill
					(type background)
				)
			)
			(pin power_in line
				(at -7.62 15.24 270)
				(length 3.81)
				(name "VDDIOP0"
					(effects
						(font
							(size 1.27 1.27)
						)
					)
				)
				(number "D7"
					(effects
						(font
							(size 1.27 1.27)
						)
					)
				)
			)
			(pin power_in line
				(at -7.62 -12.7 90)
				(length 3.81)
				(name "GNDIOP0"
					(effects
						(font
							(size 1.27 1.27)
						)
					)
				)
				(number "E4"
					(effects
						(font
							(size 1.27 1.27)
						)
					)
				)
			)
			(pin passive line
				(at -7.62 -12.7 90)
				(length 3.81) hide
				(name "GNDIOP0"
					(effects
						(font
							(size 1.27 1.27)
						)
					)
				)
				(number "E7"
					(effects
						(font
							(size 1.27 1.27)
						)
					)
				)
			)
			(pin power_in line
				(at -10.16 15.24 270)
				(length 3.81)
				(name "VDDCORE"
					(effects
						(font
							(size 1.27 1.27)
						)
					)
				)
				(number "E8"
					(effects
						(font
							(size 1.27 1.27)
						)
					)
				)
			)
			(pin passive line
				(at -7.62 15.24 270)
				(length 3.81) hide
				(name "VDDIOP0"
					(effects
						(font
							(size 1.27 1.27)
						)
					)
				)
				(number "F4"
					(effects
						(font
							(size 1.27 1.27)
						)
					)
				)
			)
			(pin power_in line
				(at -10.16 -12.7 90)
				(length 3.81)
				(name "GNDCORE"
					(effects
						(font
							(size 1.27 1.27)
						)
					)
				)
				(number "F8"
					(effects
						(font
							(size 1.27 1.27)
						)
					)
				)
			)
			(pin passive line
				(at -10.16 -12.7 90)
				(length 3.81) hide
				(name "GNDCORE"
					(effects
						(font
							(size 1.27 1.27)
						)
					)
				)
				(number "G7"
					(effects
						(font
							(size 1.27 1.27)
						)
					)
				)
			)
			(pin passive line
				(at -10.16 15.24 270)
				(length 3.81) hide
				(name "VDDCORE"
					(effects
						(font
							(size 1.27 1.27)
						)
					)
				)
				(number "G8"
					(effects
						(font
							(size 1.27 1.27)
						)
					)
				)
			)
			(pin passive line
				(at -10.16 -12.7 90)
				(length 3.81) hide
				(name "GNDCORE"
					(effects
						(font
							(size 1.27 1.27)
						)
					)
				)
				(number "G9"
					(effects
						(font
							(size 1.27 1.27)
						)
					)
				)
			)
			(pin passive line
				(at 7.62 15.24 270)
				(length 3.81) hide
				(name "VDDANA"
					(effects
						(font
							(size 1.27 1.27)
						)
					)
				)
				(number "H2"
					(effects
						(font
							(size 1.27 1.27)
						)
					)
				)
			)
			(pin passive line
				(at -10.16 -12.7 90)
				(length 3.81) hide
				(name "GNDCORE"
					(effects
						(font
							(size 1.27 1.27)
						)
					)
				)
				(number "H7"
					(effects
						(font
							(size 1.27 1.27)
						)
					)
				)
			)
			(pin passive line
				(at -10.16 15.24 270)
				(length 3.81) hide
				(name "VDDCORE"
					(effects
						(font
							(size 1.27 1.27)
						)
					)
				)
				(number "H8"
					(effects
						(font
							(size 1.27 1.27)
						)
					)
				)
			)
			(pin passive line
				(at -10.16 15.24 270)
				(length 3.81) hide
				(name "VDDCORE"
					(effects
						(font
							(size 1.27 1.27)
						)
					)
				)
				(number "H9"
					(effects
						(font
							(size 1.27 1.27)
						)
					)
				)
			)
			(pin passive line
				(at 7.62 -12.7 90)
				(length 3.81) hide
				(name "GNDANA"
					(effects
						(font
							(size 1.27 1.27)
						)
					)
				)
				(number "J2"
					(effects
						(font
							(size 1.27 1.27)
						)
					)
				)
			)
			(pin passive line
				(at -10.16 -12.7 90)
				(length 3.81) hide
				(name "GNDCORE"
					(effects
						(font
							(size 1.27 1.27)
						)
					)
				)
				(number "J4"
					(effects
						(font
							(size 1.27 1.27)
						)
					)
				)
			)
			(pin passive line
				(at -10.16 15.24 270)
				(length 3.81) hide
				(name "VDDCORE"
					(effects
						(font
							(size 1.27 1.27)
						)
					)
				)
				(number "J5"
					(effects
						(font
							(size 1.27 1.27)
						)
					)
				)
			)
			(pin power_in line
				(at 7.62 15.24 270)
				(length 3.81)
				(name "VDDANA"
					(effects
						(font
							(size 1.27 1.27)
						)
					)
				)
				(number "K3"
					(effects
						(font
							(size 1.27 1.27)
						)
					)
				)
			)
			(pin power_in line
				(at 7.62 -12.7 90)
				(length 3.81)
				(name "GNDANA"
					(effects
						(font
							(size 1.27 1.27)
						)
					)
				)
				(number "K4"
					(effects
						(font
							(size 1.27 1.27)
						)
					)
				)
			)
			(pin power_in line
				(at -5.08 15.24 270)
				(length 3.81)
				(name "VDDIOP1"
					(effects
						(font
							(size 1.27 1.27)
						)
					)
				)
				(number "K8"
					(effects
						(font
							(size 1.27 1.27)
						)
					)
				)
			)
			(pin power_in line
				(at -5.08 -12.7 90)
				(length 3.81)
				(name "GNDIOP1"
					(effects
						(font
							(size 1.27 1.27)
						)
					)
				)
				(number "K9"
					(effects
						(font
							(size 1.27 1.27)
						)
					)
				)
			)
			(pin passive line
				(at -5.08 15.24 270)
				(length 3.81) hide
				(name "VDDIOP1"
					(effects
						(font
							(size 1.27 1.27)
						)
					)
				)
				(number "L11"
					(effects
						(font
							(size 1.27 1.27)
						)
					)
				)
			)
			(pin passive line
				(at -5.08 -12.7 90)
				(length 3.81) hide
				(name "GNDIOP1"
					(effects
						(font
							(size 1.27 1.27)
						)
					)
				)
				(number "L12"
					(effects
						(font
							(size 1.27 1.27)
						)
					)
				)
			)
			(pin power_in line
				(at 5.08 15.24 270)
				(length 3.81)
				(name "ADVREF"
					(effects
						(font
							(size 1.27 1.27)
						)
					)
				)
				(number "L2"
					(effects
						(font
							(size 1.27 1.27)
						)
					)
				)
			)
			(pin power_in line
				(at 2.54 -12.7 90)
				(length 3.81)
				(name "GNDDPLL"
					(effects
						(font
							(size 1.27 1.27)
						)
					)
				)
				(number "L6"
					(effects
						(font
							(size 1.27 1.27)
						)
					)
				)
			)
			(pin power_in line
				(at 0 15.24 270)
				(length 3.81)
				(name "VDDPLLA"
					(effects
						(font
							(size 1.27 1.27)
						)
					)
				)
				(number "P3"
					(effects
						(font
							(size 1.27 1.27)
						)
					)
				)
			)
			(pin power_in line
				(at 0 -12.7 90)
				(length 3.81)
				(name "GNDPLLA"
					(effects
						(font
							(size 1.27 1.27)
						)
					)
				)
				(number "P4"
					(effects
						(font
							(size 1.27 1.27)
						)
					)
				)
			)
		)
		(symbol "ATSAMA5D21_6_1"
			(rectangle
				(start -16.51 44.45)
				(end 13.97 -46.99)
				(stroke
					(width 0)
					(type default)
				)
				(fill
					(type background)
				)
			)
			(pin bidirectional line
				(at -20.32 20.32 0)
				(length 3.81)
				(name "DDR_D6"
					(effects
						(font
							(size 1.27 1.27)
						)
					)
				)
				(number "A10"
					(effects
						(font
							(size 1.27 1.27)
						)
					)
				)
			)
			(pin output line
				(at 17.78 7.62 180)
				(length 3.81)
				(name "DDR_A11"
					(effects
						(font
							(size 1.27 1.27)
						)
					)
				)
				(number "A11"
					(effects
						(font
							(size 1.27 1.27)
						)
					)
				)
			)
			(pin output line
				(at 17.78 27.94 180)
				(length 3.81)
				(name "DDR_A3"
					(effects
						(font
							(size 1.27 1.27)
						)
					)
				)
				(number "A12"
					(effects
						(font
							(size 1.27 1.27)
						)
					)
				)
			)
			(pin output line
				(at 17.78 -2.54 180)
				(length 3.81)
				(name "DDR_CLK"
					(effects
						(font
							(size 1.27 1.27)
						)
					)
				)
				(number "A13"
					(effects
						(font
							(size 1.27 1.27)
						)
					)
				)
			)
			(pin output line
				(at 17.78 -15.24 180)
				(length 3.81)
				(name "DDR_WE"
					(effects
						(font
							(size 1.27 1.27)
						)
					)
				)
				(number "A14"
					(effects
						(font
							(size 1.27 1.27)
						)
					)
				)
			)
			(pin bidirectional line
				(at -20.32 33.02 0)
				(length 3.81)
				(name "DDR_D1"
					(effects
						(font
							(size 1.27 1.27)
						)
					)
				)
				(number "A7"
					(effects
						(font
							(size 1.27 1.27)
						)
					)
				)
			)
			(pin output line
				(at 17.78 -33.02 180)
				(length 3.81)
				(name "DDR_DQSN0"
					(effects
						(font
							(size 1.27 1.27)
						)
					)
				)
				(number "A8"
					(effects
						(font
							(size 1.27 1.27)
						)
					)
				)
			)
			(pin bidirectional line
				(at -20.32 25.4 0)
				(length 3.81)
				(name "DDR_D4"
					(effects
						(font
							(size 1.27 1.27)
						)
					)
				)
				(number "A9"
					(effects
						(font
							(size 1.27 1.27)
						)
					)
				)
			)
			(pin bidirectional line
				(at -20.32 17.78 0)
				(length 3.81)
				(name "DDR_D7"
					(effects
						(font
							(size 1.27 1.27)
						)
					)
				)
				(number "B10"
					(effects
						(font
							(size 1.27 1.27)
						)
					)
				)
			)
			(pin output line
				(at 17.78 5.08 180)
				(length 3.81)
				(name "DDR_A12"
					(effects
						(font
							(size 1.27 1.27)
						)
					)
				)
				(number "B11"
					(effects
						(font
							(size 1.27 1.27)
						)
					)
				)
			)
			(pin output line
				(at 17.78 30.48 180)
				(length 3.81)
				(name "DDR_A2"
					(effects
						(font
							(size 1.27 1.27)
						)
					)
				)
				(number "B12"
					(effects
						(font
							(size 1.27 1.27)
						)
					)
				)
			)
			(pin output line
				(at 17.78 -5.08 180)
				(length 3.81)
				(name "DDR_CLKN"
					(effects
						(font
							(size 1.27 1.27)
						)
					)
				)
				(number "B13"
					(effects
						(font
							(size 1.27 1.27)
						)
					)
				)
			)
			(pin output line
				(at 17.78 20.32 180)
				(length 3.81)
				(name "DDR_A6"
					(effects
						(font
							(size 1.27 1.27)
						)
					)
				)
				(number "B14"
					(effects
						(font
							(size 1.27 1.27)
						)
					)
				)
			)
			(pin bidirectional line
				(at -20.32 35.56 0)
				(length 3.81)
				(name "DDR_D0"
					(effects
						(font
							(size 1.27 1.27)
						)
					)
				)
				(number "B7"
					(effects
						(font
							(size 1.27 1.27)
						)
					)
				)
			)
			(pin output line
				(at 17.78 -27.94 180)
				(length 3.81)
				(name "DDR_DQS0"
					(effects
						(font
							(size 1.27 1.27)
						)
					)
				)
				(number "B8"
					(effects
						(font
							(size 1.27 1.27)
						)
					)
				)
			)
			(pin bidirectional line
				(at -20.32 27.94 0)
				(length 3.81)
				(name "DDR_D3"
					(effects
						(font
							(size 1.27 1.27)
						)
					)
				)
				(number "B9"
					(effects
						(font
							(size 1.27 1.27)
						)
					)
				)
			)
			(pin output line
				(at 17.78 15.24 180)
				(length 3.81)
				(name "DDR_A8"
					(effects
						(font
							(size 1.27 1.27)
						)
					)
				)
				(number "C10"
					(effects
						(font
							(size 1.27 1.27)
						)
					)
				)
			)
			(pin output line
				(at 17.78 33.02 180)
				(length 3.81)
				(name "DDR_A1"
					(effects
						(font
							(size 1.27 1.27)
						)
					)
				)
				(number "C11"
					(effects
						(font
							(size 1.27 1.27)
						)
					)
				)
			)
			(pin power_in line
				(at 0 48.26 270)
				(length 3.81)
				(name "DDR_VREF"
					(effects
						(font
							(size 1.27 1.27)
						)
					)
				)
				(number "C12"
					(effects
						(font
							(size 1.27 1.27)
						)
					)
				)
			)
			(pin output line
				(at 17.78 -20.32 180)
				(length 3.81)
				(name "DDR_CAS"
					(effects
						(font
							(size 1.27 1.27)
						)
					)
				)
				(number "C13"
					(effects
						(font
							(size 1.27 1.27)
						)
					)
				)
			)
			(pin output line
				(at 17.78 -17.78 180)
				(length 3.81)
				(name "DDR_RAS"
					(effects
						(font
							(size 1.27 1.27)
						)
					)
				)
				(number "C14"
					(effects
						(font
							(size 1.27 1.27)
						)
					)
				)
			)
			(pin power_in line
				(at -5.08 48.26 270)
				(length 3.81)
				(name "VDDIODDR"
					(effects
						(font
							(size 1.27 1.27)
						)
					)
				)
				(number "C6"
					(effects
						(font
							(size 1.27 1.27)
						)
					)
				)
			)
			(pin power_in line
				(at -5.08 -50.8 90)
				(length 3.81)
				(name "GNDIODDR"
					(effects
						(font
							(size 1.27 1.27)
						)
					)
				)
				(number "C7"
					(effects
						(font
							(size 1.27 1.27)
						)
					)
				)
			)
			(pin bidirectional line
				(at -20.32 30.48 0)
				(length 3.81)
				(name "DDR_D2"
					(effects
						(font
							(size 1.27 1.27)
						)
					)
				)
				(number "C8"
					(effects
						(font
							(size 1.27 1.27)
						)
					)
				)
			)
			(pin bidirectional line
				(at -20.32 22.86 0)
				(length 3.81)
				(name "DDR_D5"
					(effects
						(font
							(size 1.27 1.27)
						)
					)
				)
				(number "C9"
					(effects
						(font
							(size 1.27 1.27)
						)
					)
				)
			)
			(pin output line
				(at 17.78 12.7 180)
				(length 3.81)
				(name "DDR_A9"
					(effects
						(font
							(size 1.27 1.27)
						)
					)
				)
				(number "D10"
					(effects
						(font
							(size 1.27 1.27)
						)
					)
				)
			)
			(pin output line
				(at 17.78 25.4 180)
				(length 3.81)
				(name "DDR_A4"
					(effects
						(font
							(size 1.27 1.27)
						)
					)
				)
				(number "D11"
					(effects
						(font
							(size 1.27 1.27)
						)
					)
				)
			)
			(pin passive line
				(at -5.08 -50.8 90)
				(length 3.81) hide
				(name "GNDIODDR"
					(effects
						(font
							(size 1.27 1.27)
						)
					)
				)
				(number "D12"
					(effects
						(font
							(size 1.27 1.27)
						)
					)
				)
			)
			(pin output line
				(at 17.78 40.64 180)
				(length 3.81)
				(name "~{DDR_RESET}"
					(effects
						(font
							(size 1.27 1.27)
						)
					)
				)
				(number "D13"
					(effects
						(font
							(size 1.27 1.27)
						)
					)
				)
			)
			(pin output line
				(at 17.78 22.86 180)
				(length 3.81)
				(name "DDR_A5"
					(effects
						(font
							(size 1.27 1.27)
						)
					)
				)
				(number "D14"
					(effects
						(font
							(size 1.27 1.27)
						)
					)
				)
			)
			(pin output line
				(at 17.78 -22.86 180)
				(length 3.81)
				(name "DDR_DQM0"
					(effects
						(font
							(size 1.27 1.27)
						)
					)
				)
				(number "D8"
					(effects
						(font
							(size 1.27 1.27)
						)
					)
				)
			)
			(pin output line
				(at 17.78 17.78 180)
				(length 3.81)
				(name "DDR_A7"
					(effects
						(font
							(size 1.27 1.27)
						)
					)
				)
				(number "D9"
					(effects
						(font
							(size 1.27 1.27)
						)
					)
				)
			)
			(pin passive line
				(at -5.08 48.26 270)
				(length 3.81) hide
				(name "VDDIODDR"
					(effects
						(font
							(size 1.27 1.27)
						)
					)
				)
				(number "E10"
					(effects
						(font
							(size 1.27 1.27)
						)
					)
				)
			)
			(pin output line
				(at 17.78 35.56 180)
				(length 3.81)
				(name "DDR_A0"
					(effects
						(font
							(size 1.27 1.27)
						)
					)
				)
				(number "E11"
					(effects
						(font
							(size 1.27 1.27)
						)
					)
				)
			)
			(pin passive line
				(at -5.08 48.26 270)
				(length 3.81) hide
				(name "VDDIODDR"
					(effects
						(font
							(size 1.27 1.27)
						)
					)
				)
				(number "E12"
					(effects
						(font
							(size 1.27 1.27)
						)
					)
				)
			)
			(pin output line
				(at 17.78 2.54 180)
				(length 3.81)
				(name "DDR_A13"
					(effects
						(font
							(size 1.27 1.27)
						)
					)
				)
				(number "E13"
					(effects
						(font
							(size 1.27 1.27)
						)
					)
				)
			)
			(pin output line
				(at 17.78 -7.62 180)
				(length 3.81)
				(name "DDR_CKE"
					(effects
						(font
							(size 1.27 1.27)
						)
					)
				)
				(number "E14"
					(effects
						(font
							(size 1.27 1.27)
						)
					)
				)
			)
			(pin passive line
				(at -5.08 -50.8 90)
				(length 3.81) hide
				(name "GNDIODDR"
					(effects
						(font
							(size 1.27 1.27)
						)
					)
				)
				(number "E9"
					(effects
						(font
							(size 1.27 1.27)
						)
					)
				)
			)
			(pin input line
				(at -20.32 40.64 0)
				(length 3.81)
				(name "DDR_CAL"
					(effects
						(font
							(size 1.27 1.27)
						)
					)
				)
				(number "F10"
					(effects
						(font
							(size 1.27 1.27)
						)
					)
				)
			)
			(pin output line
				(at 17.78 -12.7 180)
				(length 3.81)
				(name "DDR_CS"
					(effects
						(font
							(size 1.27 1.27)
						)
					)
				)
				(number "F11"
					(effects
						(font
							(size 1.27 1.27)
						)
					)
				)
			)
			(pin passive line
				(at -5.08 -50.8 90)
				(length 3.81) hide
				(name "GNDIODDR"
					(effects
						(font
							(size 1.27 1.27)
						)
					)
				)
				(number "F12"
					(effects
						(font
							(size 1.27 1.27)
						)
					)
				)
			)
			(pin output line
				(at 17.78 -38.1 180)
				(length 3.81)
				(name "DDR_BA0"
					(effects
						(font
							(size 1.27 1.27)
						)
					)
				)
				(number "F13"
					(effects
						(font
							(size 1.27 1.27)
						)
					)
				)
			)
			(pin output line
				(at 17.78 -43.18 180)
				(length 3.81)
				(name "DDR_BA2"
					(effects
						(font
							(size 1.27 1.27)
						)
					)
				)
				(number "F14"
					(effects
						(font
							(size 1.27 1.27)
						)
					)
				)
			)
			(pin output line
				(at 17.78 10.16 180)
				(length 3.81)
				(name "DDR_A10"
					(effects
						(font
							(size 1.27 1.27)
						)
					)
				)
				(number "F9"
					(effects
						(font
							(size 1.27 1.27)
						)
					)
				)
			)
			(pin passive line
				(at -5.08 48.26 270)
				(length 3.81) hide
				(name "VDDIODDR"
					(effects
						(font
							(size 1.27 1.27)
						)
					)
				)
				(number "G10"
					(effects
						(font
							(size 1.27 1.27)
						)
					)
				)
			)
			(pin passive line
				(at -5.08 -50.8 90)
				(length 3.81) hide
				(name "GNDIODDR"
					(effects
						(font
							(size 1.27 1.27)
						)
					)
				)
				(number "G11"
					(effects
						(font
							(size 1.27 1.27)
						)
					)
				)
			)
			(pin passive line
				(at -5.08 48.26 270)
				(length 3.81) hide
				(name "VDDIODDR"
					(effects
						(font
							(size 1.27 1.27)
						)
					)
				)
				(number "G12"
					(effects
						(font
							(size 1.27 1.27)
						)
					)
				)
			)
			(pin output line
				(at 17.78 -40.64 180)
				(length 3.81)
				(name "DDR_BA1"
					(effects
						(font
							(size 1.27 1.27)
						)
					)
				)
				(number "G13"
					(effects
						(font
							(size 1.27 1.27)
						)
					)
				)
			)
			(pin output line
				(at 17.78 -25.4 180)
				(length 3.81)
				(name "DDR_DQM1"
					(effects
						(font
							(size 1.27 1.27)
						)
					)
				)
				(number "G14"
					(effects
						(font
							(size 1.27 1.27)
						)
					)
				)
			)
			(pin passive line
				(at -5.08 -50.8 90)
				(length 3.81) hide
				(name "GNDIODDR"
					(effects
						(font
							(size 1.27 1.27)
						)
					)
				)
				(number "H10"
					(effects
						(font
							(size 1.27 1.27)
						)
					)
				)
			)
			(pin passive line
				(at -5.08 48.26 270)
				(length 3.81) hide
				(name "VDDIODDR"
					(effects
						(font
							(size 1.27 1.27)
						)
					)
				)
				(number "H11"
					(effects
						(font
							(size 1.27 1.27)
						)
					)
				)
			)
			(pin passive line
				(at 0 48.26 270)
				(length 3.81) hide
				(name "DDR_VREF"
					(effects
						(font
							(size 1.27 1.27)
						)
					)
				)
				(number "H12"
					(effects
						(font
							(size 1.27 1.27)
						)
					)
				)
			)
			(pin bidirectional line
				(at -20.32 15.24 0)
				(length 3.81)
				(name "DDR_D8"
					(effects
						(font
							(size 1.27 1.27)
						)
					)
				)
				(number "H13"
					(effects
						(font
							(size 1.27 1.27)
						)
					)
				)
			)
			(pin bidirectional line
				(at -20.32 12.7 0)
				(length 3.81)
				(name "DDR_D9"
					(effects
						(font
							(size 1.27 1.27)
						)
					)
				)
				(number "H14"
					(effects
						(font
							(size 1.27 1.27)
						)
					)
				)
			)
			(pin passive line
				(at -5.08 48.26 270)
				(length 3.81) hide
				(name "VDDIODDR"
					(effects
						(font
							(size 1.27 1.27)
						)
					)
				)
				(number "J10"
					(effects
						(font
							(size 1.27 1.27)
						)
					)
				)
			)
			(pin passive line
				(at -5.08 -50.8 90)
				(length 3.81) hide
				(name "GNDIODDR"
					(effects
						(font
							(size 1.27 1.27)
						)
					)
				)
				(number "J11"
					(effects
						(font
							(size 1.27 1.27)
						)
					)
				)
			)
			(pin bidirectional line
				(at -20.32 0 0)
				(length 3.81)
				(name "DDR_D14"
					(effects
						(font
							(size 1.27 1.27)
						)
					)
				)
				(number "J12"
					(effects
						(font
							(size 1.27 1.27)
						)
					)
				)
			)
			(pin bidirectional line
				(at -20.32 10.16 0)
				(length 3.81)
				(name "DDR_D10"
					(effects
						(font
							(size 1.27 1.27)
						)
					)
				)
				(number "J13"
					(effects
						(font
							(size 1.27 1.27)
						)
					)
				)
			)
			(pin bidirectional line
				(at -20.32 7.62 0)
				(length 3.81)
				(name "DDR_D11"
					(effects
						(font
							(size 1.27 1.27)
						)
					)
				)
				(number "J14"
					(effects
						(font
							(size 1.27 1.27)
						)
					)
				)
			)
			(pin bidirectional line
				(at -20.32 -2.54 0)
				(length 3.81)
				(name "DDR_D15"
					(effects
						(font
							(size 1.27 1.27)
						)
					)
				)
				(number "K12"
					(effects
						(font
							(size 1.27 1.27)
						)
					)
				)
			)
			(pin output line
				(at 17.78 -35.56 180)
				(length 3.81)
				(name "DDR_DQSN1"
					(effects
						(font
							(size 1.27 1.27)
						)
					)
				)
				(number "K13"
					(effects
						(font
							(size 1.27 1.27)
						)
					)
				)
			)
			(pin output line
				(at 17.78 -30.48 180)
				(length 3.81)
				(name "DDR_DQS1"
					(effects
						(font
							(size 1.27 1.27)
						)
					)
				)
				(number "K14"
					(effects
						(font
							(size 1.27 1.27)
						)
					)
				)
			)
			(pin bidirectional line
				(at -20.32 5.08 0)
				(length 3.81)
				(name "DDR_D12"
					(effects
						(font
							(size 1.27 1.27)
						)
					)
				)
				(number "L13"
					(effects
						(font
							(size 1.27 1.27)
						)
					)
				)
			)
			(pin bidirectional line
				(at -20.32 2.54 0)
				(length 3.81)
				(name "DDR_D13"
					(effects
						(font
							(size 1.27 1.27)
						)
					)
				)
				(number "L14"
					(effects
						(font
							(size 1.27 1.27)
						)
					)
				)
			)
		)
		(symbol "ATSAMA5D21_7_1"
			(rectangle
				(start -13.97 11.43)
				(end 11.43 -11.43)
				(stroke
					(width 0)
					(type default)
				)
				(fill
					(type background)
				)
			)
			(pin power_in line
				(at -5.08 15.24 270)
				(length 3.81)
				(name "VDDFUSE"
					(effects
						(font
							(size 1.27 1.27)
						)
					)
				)
				(number "K11"
					(effects
						(font
							(size 1.27 1.27)
						)
					)
				)
			)
			(pin power_in line
				(at 0 15.24 270)
				(length 3.81)
				(name "VDDUTMII"
					(effects
						(font
							(size 1.27 1.27)
						)
					)
				)
				(number "K7"
					(effects
						(font
							(size 1.27 1.27)
						)
					)
				)
			)
			(pin power_in line
				(at 2.54 15.24 270)
				(length 3.81)
				(name "VBG"
					(effects
						(font
							(size 1.27 1.27)
						)
					)
				)
				(number "L7"
					(effects
						(font
							(size 1.27 1.27)
						)
					)
				)
			)
			(pin power_in line
				(at 0 -15.24 90)
				(length 3.81)
				(name "GNDUTMII"
					(effects
						(font
							(size 1.27 1.27)
						)
					)
				)
				(number "L8"
					(effects
						(font
							(size 1.27 1.27)
						)
					)
				)
			)
			(pin power_in line
				(at -2.54 15.24 270)
				(length 3.81)
				(name "VDDUTMIC"
					(effects
						(font
							(size 1.27 1.27)
						)
					)
				)
				(number "M7"
					(effects
						(font
							(size 1.27 1.27)
						)
					)
				)
			)
			(pin power_in line
				(at -2.54 -15.24 90)
				(length 3.81)
				(name "GNDUTMIC"
					(effects
						(font
							(size 1.27 1.27)
						)
					)
				)
				(number "M8"
					(effects
						(font
							(size 1.27 1.27)
						)
					)
				)
			)
			(pin bidirectional line
				(at -17.78 0 0)
				(length 3.81)
				(name "HHSDPA"
					(effects
						(font
							(size 1.27 1.27)
						)
					)
				)
				(number "N7"
					(effects
						(font
							(size 1.27 1.27)
						)
					)
				)
			)
			(pin bidirectional line
				(at 15.24 0 180)
				(length 3.81)
				(name "HHSDPB"
					(effects
						(font
							(size 1.27 1.27)
						)
					)
				)
				(number "N8"
					(effects
						(font
							(size 1.27 1.27)
						)
					)
				)
			)
			(pin bidirectional line
				(at -17.78 -2.54 0)
				(length 3.81)
				(name "HHSDMA"
					(effects
						(font
							(size 1.27 1.27)
						)
					)
				)
				(number "P7"
					(effects
						(font
							(size 1.27 1.27)
						)
					)
				)
			)
			(pin bidirectional line
				(at 15.24 -2.54 180)
				(length 3.81)
				(name "HHSDMB"
					(effects
						(font
							(size 1.27 1.27)
						)
					)
				)
				(number "P8"
					(effects
						(font
							(size 1.27 1.27)
						)
					)
				)
			)
		)
		(symbol "ATSAMA5D21_8_1"
			(rectangle
				(start -11.43 16.51)
				(end 11.43 -16.51)
				(stroke
					(width 0)
					(type default)
				)
				(fill
					(type background)
				)
			)
			(pin bidirectional line
				(at 15.24 12.7 180)
				(length 3.81)
				(name "PIOBU0"
					(effects
						(font
							(size 1.27 1.27)
						)
					)
				)
				(number "K5"
					(effects
						(font
							(size 1.27 1.27)
						)
					)
				)
			)
			(pin output line
				(at -15.24 7.62 0)
				(length 3.81)
				(name "XOUT32"
					(effects
						(font
							(size 1.27 1.27)
						)
					)
				)
				(number "L1"
					(effects
						(font
							(size 1.27 1.27)
						)
					)
				)
			)
			(pin bidirectional line
				(at 15.24 10.16 180)
				(length 3.81)
				(name "PIOBU1"
					(effects
						(font
							(size 1.27 1.27)
						)
					)
				)
				(number "L3"
					(effects
						(font
							(size 1.27 1.27)
						)
					)
				)
			)
			(pin input line
				(at -15.24 -2.54 0)
				(length 3.81)
				(name "JTAGSEL"
					(effects
						(font
							(size 1.27 1.27)
						)
					)
				)
				(number "L4"
					(effects
						(font
							(size 1.27 1.27)
						)
					)
				)
			)
			(pin bidirectional line
				(at 15.24 2.54 180)
				(length 3.81)
				(name "PIOBU4"
					(effects
						(font
							(size 1.27 1.27)
						)
					)
				)
				(number "L5"
					(effects
						(font
							(size 1.27 1.27)
						)
					)
				)
			)
			(pin input line
				(at -15.24 12.7 0)
				(length 3.81)
				(name "XIN32"
					(effects
						(font
							(size 1.27 1.27)
						)
					)
				)
				(number "M1"
					(effects
						(font
							(size 1.27 1.27)
						)
					)
				)
			)
			(pin input line
				(at -15.24 0 0)
				(length 3.81)
				(name "TST"
					(effects
						(font
							(size 1.27 1.27)
						)
					)
				)
				(number "M2"
					(effects
						(font
							(size 1.27 1.27)
						)
					)
				)
			)
			(pin bidirectional line
				(at 15.24 7.62 180)
				(length 3.81)
				(name "PIOBU2"
					(effects
						(font
							(size 1.27 1.27)
						)
					)
				)
				(number "M3"
					(effects
						(font
							(size 1.27 1.27)
						)
					)
				)
			)
			(pin power_in line
				(at 0 20.32 270)
				(length 3.81)
				(name "VDDBU"
					(effects
						(font
							(size 1.27 1.27)
						)
					)
				)
				(number "M4"
					(effects
						(font
							(size 1.27 1.27)
						)
					)
				)
			)
			(pin power_in line
				(at 0 -20.32 90)
				(length 3.81)
				(name "GNDBU"
					(effects
						(font
							(size 1.27 1.27)
						)
					)
				)
				(number "M5"
					(effects
						(font
							(size 1.27 1.27)
						)
					)
				)
			)
			(pin bidirectional line
				(at 15.24 0 180)
				(length 3.81)
				(name "PIOBU5"
					(effects
						(font
							(size 1.27 1.27)
						)
					)
				)
				(number "M6"
					(effects
						(font
							(size 1.27 1.27)
						)
					)
				)
			)
			(pin output line
				(at 15.24 -5.08 180)
				(length 3.81)
				(name "SHDN"
					(effects
						(font
							(size 1.27 1.27)
						)
					)
				)
				(number "N1"
					(effects
						(font
							(size 1.27 1.27)
						)
					)
				)
			)
			(pin input line
				(at -15.24 -10.16 0)
				(length 3.81)
				(name "COMPP"
					(effects
						(font
							(size 1.27 1.27)
						)
					)
				)
				(number "N2"
					(effects
						(font
							(size 1.27 1.27)
						)
					)
				)
			)
			(pin input line
				(at -15.24 2.54 0)
				(length 3.81)
				(name "~{RST}"
					(effects
						(font
							(size 1.27 1.27)
						)
					)
				)
				(number "N3"
					(effects
						(font
							(size 1.27 1.27)
						)
					)
				)
			)
			(pin bidirectional line
				(at 15.24 5.08 180)
				(length 3.81)
				(name "PIOBU3"
					(effects
						(font
							(size 1.27 1.27)
						)
					)
				)
				(number "N4"
					(effects
						(font
							(size 1.27 1.27)
						)
					)
				)
			)
			(pin input line
				(at -15.24 -5.08 0)
				(length 3.81)
				(name "WKUP"
					(effects
						(font
							(size 1.27 1.27)
						)
					)
				)
				(number "P1"
					(effects
						(font
							(size 1.27 1.27)
						)
					)
				)
			)
			(pin input line
				(at -15.24 -12.7 0)
				(length 3.81)
				(name "COMPN"
					(effects
						(font
							(size 1.27 1.27)
						)
					)
				)
				(number "P2"
					(effects
						(font
							(size 1.27 1.27)
						)
					)
				)
			)
		)
		(symbol "ATSAMA5D21_9_1"
			(rectangle
				(start -7.62 16.51)
				(end 3.81 -16.51)
				(stroke
					(width 0)
					(type default)
				)
				(fill
					(type background)
				)
			)
			(pin power_in line
				(at -2.54 -20.32 90)
				(length 3.81)
				(name "GNDAUDIOPLL"
					(effects
						(font
							(size 1.27 1.27)
						)
					)
				)
				(number "J6"
					(effects
						(font
							(size 1.27 1.27)
						)
					)
				)
			)
			(pin output line
				(at 7.62 0 180)
				(length 3.81)
				(name "CLK_AUDIO"
					(effects
						(font
							(size 1.27 1.27)
						)
					)
				)
				(number "J7"
					(effects
						(font
							(size 1.27 1.27)
						)
					)
				)
			)
			(pin power_in line
				(at -2.54 20.32 270)
				(length 3.81)
				(name "VDDAUDIOPLL"
					(effects
						(font
							(size 1.27 1.27)
						)
					)
				)
				(number "K6"
					(effects
						(font
							(size 1.27 1.27)
						)
					)
				)
			)
		)
		(symbol "ATSAMA5D21_10_1"
			(rectangle
				(start -3.81 6.35)
				(end 6.35 -6.35)
				(stroke
					(width 0)
					(type default)
				)
				(fill
					(type background)
				)
			)
			(pin power_in line
				(at 0 10.16 270)
				(length 3.81)
				(name "VDDOSC"
					(effects
						(font
							(size 1.27 1.27)
						)
					)
				)
				(number "N5"
					(effects
						(font
							(size 1.27 1.27)
						)
					)
				)
			)
			(pin power_in line
				(at -2.54 -10.16 90)
				(length 3.81)
				(name "GNDOSC"
					(effects
						(font
							(size 1.27 1.27)
						)
					)
				)
				(number "N6"
					(effects
						(font
							(size 1.27 1.27)
						)
					)
				)
			)
			(pin input line
				(at 10.16 2.54 180)
				(length 3.81)
				(name "XIN"
					(effects
						(font
							(size 1.27 1.27)
						)
					)
				)
				(number "P5"
					(effects
						(font
							(size 1.27 1.27)
						)
					)
				)
			)
			(pin output line
				(at 10.16 -2.54 180)
				(length 3.81)
				(name "XOUT"
					(effects
						(font
							(size 1.27 1.27)
						)
					)
				)
				(number "P6"
					(effects
						(font
							(size 1.27 1.27)
						)
					)
				)
			)
		)
	)
)