wlp1s0    IEEE 802.11  ESSID:"hoiho"  
          Mode:Managed  Frequency:5.785 GHz  Access Point: B8:5E:71:3D:F0:AE   
          Bit Rate=720.6 Mb/s   Tx-Power=3 dBm   
          Retry short limit:7   RTS thr:off   Fragment thr:off
          Power Management:on
          Link Quality=52/70  Signal level=-58 dBm  
          Rx invalid nwid:0  Rx invalid crypt:0  Rx invalid frag:0
          Tx excessive retries:3  Invalid misc:0   Missed beacon:0

