Connected to b8:5e:71:3d:f0:ae (on wlp1s0)
	SSID: hoiho
	freq: 5785
	RX: 11479693 bytes (13666 packets)
	TX: 10362216 bytes (12161 packets)
	signal: -53 dBm
	rx bitrate: 1200.9 MBit/s 80MHz HE-MCS 11 HE-NSS 2 HE-GI 0 HE-DCM 0
	tx bitrate: 576.4 MBit/s 80MHz HE-MCS 5 HE-NSS 2 HE-GI 0 HE-DCM 0

	bss flags:	short-slot-time
	dtim period:	1
	beacon int:	100
