Case: 1
Number of paths: 2 with length 3
1 3 
1 2 3 
Case: 2
Number of paths: 1 with length 2
1 4 
Case: 3
Number of paths: 1 with length 78
1 2 7 
Case: 4
Number of paths: 1 with length 8
1 100 
Case: 5
Number of paths: 4 with length 4
1 918 745 1000 
1 97 906 74 1000 
1 918 634 267 1000 
1 990 684 785 1000