   /*  Name: Exp_ODI_Framework
/*  Description: Setup the ODI framework required tables, run in EXPR_INTEGRATION schema
/* Modification History: 
/* Date      Name                Modification Description
/* --------  -----------------   -------------------------------------
/* 2014-09-03 Sajan Khadka		DDL for EXP_ODI_PUB_INFO_LOG table, required to build ODI framework
/* 
/**********************************************************************/ 
 
 
 
 
 drop table exp_odi_pub_info_log;
 
 CREATE TABLE exp_odi_pub_info_log
  (
    INTERFACE_ID VARCHAR2(50 BYTE) NOT NULL ,
    TABLE_ID     VARCHAR2(50 BYTE) NOT NULL ,
    LAST_INT_TIME TIMESTAMP (6) WITH TIME ZONE,
  LAST_UPDATE_ID VARCHAR2(80 BYTE),
  LAST_UPDATE_DATETIME TIMESTAMP (6),
  CONSTRAINT INTERFACE_ID_EOPIL_EOI_FK FOREIGN KEY (INTERFACE_ID) REFERENCES EXP_ODI_INTERFACE (INTERFACE_ID) 
  ) 
  INITRANS 6
 STORAGE
 (
   FREELISTS 6
 );