<svg width="26" height="25" viewBox="0 0 26 25" fill="none" xmlns="http://www.w3.org/2000/svg">
<path d="M25.6383 2.4996C25.6383 1.11835 24.5401 -0.000396729 23.1688 -0.000396729H3.31384C1.94261 -0.000396729 0.83197 1.11835 0.83197 2.4996V17.4996C0.83197 18.8809 1.94261 19.9996 3.31384 19.9996H20.687L25.6507 24.9996L25.6383 2.4996ZM20.687 14.9996H5.79572V12.4996H20.687V14.9996ZM20.687 11.2496H5.79572V8.7496H20.687V11.2496ZM20.687 7.4996H5.79572V4.9996H20.687V7.4996Z" fill="#6DD2AE"/>
</svg>

