module main.go

go 1.15

require (
	cloud.google.com/go/firestore v1.3.0 // indirect
	cloud.google.com/go/storage v1.12.0 // indirect
	firebase.google.com/go v3.13.0+incompatible
	github.com/gin-gonic/gin v1.6.3
	google.golang.org/api v0.34.0
	google.golang.org/appengine v1.6.7 // indirect
)
