[{
  "_id": {
    "$oid": "5f94f7e2bf82f92514ec71a3"
  },
  "title": "News21",
  "name": "anti",
  "rating": 4,
  "comment": 5,
  "tag": 3,
  "tagName": "db",
  "date": "2014-01-02"
},{
  "_id": {
    "$oid": "5f94f7e2bf82f92514ec71a4"
  },
  "title": "News3",
  "name": "patma",
  "rating": 3,
  "comment": 3,
  "tag": 3,
  "tagName": "data",
  "date": "2014-01-01"
},{
  "_id": {
    "$oid": "5f94f7e2bf82f92514ec71a5"
  },
  "title": "Newss2",
  "name": "dian",
  "rating": 7,
  "comment": 2,
  "tag": 2,
  "tagName": "two",
  "date": "2014-01-21"
},{
  "_id": {
    "$oid": "5f94f7e2bf82f92514ec71a6"
  },
  "title": "Berita2",
  "name": "anti",
  "rating": 7,
  "comment": 2,
  "tag": 2,
  "tagName": "databases",
  "date": "2014-01-19"
},{
  "_id": {
    "$oid": "5f94f7e2bf82f92514ec71a7"
  },
  "title": "News2",
  "name": "wati",
  "rating": 8,
  "comment": 2,
  "tag": 2,
  "tagName": "database",
  "date": "2014-01-19"
},{
  "_id": {
    "$oid": "5f94f7e2bf82f92514ec71a8"
  },
  "title": "News",
  "name": "wati",
  "rating": 7,
  "comment": 2,
  "tag": 2,
  "tagName": "database",
  "date": "2014-01-20"
},{
  "_id": {
    "$oid": "5f94f7e2bf82f92514ec71a9"
  },
  "title": "News3",
  "name": "patma",
  "rating": 2,
  "comment": 3,
  "tag": 2,
  "tagName": "db",
  "date": "2014-01-25"
},{
  "_id": {
    "$oid": "5f94f7e2bf82f92514ec71aa"
  },
  "title": "News3",
  "name": "hendy",
  "rating": 7,
  "comment": 2,
  "tag": 2,
  "tagName": "db",
  "date": "2014-01-10"
}]