('D:\\personal projects\\Python\\Prototype\\build\\__main__\\PYZ-00.pyz',
 [('multiprocessing.popen_spawn_posix',
   'C:\\Users\\Patipol\\AppData\\Local\\Programs\\Python\\Python311\\Lib\\multiprocessing\\popen_spawn_posix.py',
   'PYMODULE'),
  ('multiprocessing.resource_tracker',
   'C:\\Users\\Patipol\\AppData\\Local\\Programs\\Python\\Python311\\Lib\\multiprocessing\\resource_tracker.py',
   'PYMODULE'),
  ('threading',
   'C:\\Users\\Patipol\\AppData\\Local\\Programs\\Python\\Python311\\Lib\\threading.py',
   'PYMODULE'),
  ('_threading_local',
   'C:\\Users\\Patipol\\AppData\\Local\\Programs\\Python\\Python311\\Lib\\_threading_local.py',
   'PYMODULE'),
  ('contextlib',
   'C:\\Users\\Patipol\\AppData\\Local\\Programs\\Python\\Python311\\Lib\\contextlib.py',
   'PYMODULE'),
  ('_strptime',
   'C:\\Users\\Patipol\\AppData\\Local\\Programs\\Python\\Python311\\Lib\\_strptime.py',
   'PYMODULE'),
  ('datetime',
   'C:\\Users\\Patipol\\AppData\\Local\\Programs\\Python\\Python311\\Lib\\datetime.py',
   'PYMODULE'),
  ('calendar',
   'C:\\Users\\Patipol\\AppData\\Local\\Programs\\Python\\Python311\\Lib\\calendar.py',
   'PYMODULE'),
  ('argparse',
   'C:\\Users\\Patipol\\AppData\\Local\\Programs\\Python\\Python311\\Lib\\argparse.py',
   'PYMODULE'),
  ('textwrap',
   'C:\\Users\\Patipol\\AppData\\Local\\Programs\\Python\\Python311\\Lib\\textwrap.py',
   'PYMODULE'),
  ('shutil',
   'C:\\Users\\Patipol\\AppData\\Local\\Programs\\Python\\Python311\\Lib\\shutil.py',
   'PYMODULE'),
  ('zipfile',
   'C:\\Users\\Patipol\\AppData\\Local\\Programs\\Python\\Python311\\Lib\\zipfile.py',
   'PYMODULE'),
  ('py_compile',
   'C:\\Users\\Patipol\\AppData\\Local\\Programs\\Python\\Python311\\Lib\\py_compile.py',
   'PYMODULE'),
  ('importlib.machinery',
   'C:\\Users\\Patipol\\AppData\\Local\\Programs\\Python\\Python311\\Lib\\importlib\\machinery.py',
   'PYMODULE'),
  ('importlib',
   'C:\\Users\\Patipol\\AppData\\Local\\Programs\\Python\\Python311\\Lib\\importlib\\__init__.py',
   'PYMODULE'),
  ('importlib._bootstrap',
   'C:\\Users\\Patipol\\AppData\\Local\\Programs\\Python\\Python311\\Lib\\importlib\\_bootstrap.py',
   'PYMODULE'),
  ('importlib._bootstrap_external',
   'C:\\Users\\Patipol\\AppData\\Local\\Programs\\Python\\Python311\\Lib\\importlib\\_bootstrap_external.py',
   'PYMODULE'),
  ('importlib.metadata',
   'C:\\Users\\Patipol\\AppData\\Local\\Programs\\Python\\Python311\\Lib\\importlib\\metadata\\__init__.py',
   'PYMODULE'),
  ('typing',
   'C:\\Users\\Patipol\\AppData\\Local\\Programs\\Python\\Python311\\Lib\\typing.py',
   'PYMODULE'),
  ('importlib.abc',
   'C:\\Users\\Patipol\\AppData\\Local\\Programs\\Python\\Python311\\Lib\\importlib\\abc.py',
   'PYMODULE'),
  ('importlib.resources.abc',
   'C:\\Users\\Patipol\\AppData\\Local\\Programs\\Python\\Python311\\Lib\\importlib\\resources\\abc.py',
   'PYMODULE'),
  ('importlib.resources',
   'C:\\Users\\Patipol\\AppData\\Local\\Programs\\Python\\Python311\\Lib\\importlib\\resources\\__init__.py',
   'PYMODULE'),
  ('importlib.resources._legacy',
   'C:\\Users\\Patipol\\AppData\\Local\\Programs\\Python\\Python311\\Lib\\importlib\\resources\\_legacy.py',
   'PYMODULE'),
  ('importlib.resources._common',
   'C:\\Users\\Patipol\\AppData\\Local\\Programs\\Python\\Python311\\Lib\\importlib\\resources\\_common.py',
   'PYMODULE'),
  ('importlib.resources._adapters',
   'C:\\Users\\Patipol\\AppData\\Local\\Programs\\Python\\Python311\\Lib\\importlib\\resources\\_adapters.py',
   'PYMODULE'),
  ('tempfile',
   'C:\\Users\\Patipol\\AppData\\Local\\Programs\\Python\\Python311\\Lib\\tempfile.py',
   'PYMODULE'),
  ('random',
   'C:\\Users\\Patipol\\AppData\\Local\\Programs\\Python\\Python311\\Lib\\random.py',
   'PYMODULE'),
  ('statistics',
   'C:\\Users\\Patipol\\AppData\\Local\\Programs\\Python\\Python311\\Lib\\statistics.py',
   'PYMODULE'),
  ('decimal',
   'C:\\Users\\Patipol\\AppData\\Local\\Programs\\Python\\Python311\\Lib\\decimal.py',
   'PYMODULE'),
  ('_pydecimal',
   'C:\\Users\\Patipol\\AppData\\Local\\Programs\\Python\\Python311\\Lib\\_pydecimal.py',
   'PYMODULE'),
  ('contextvars',
   'C:\\Users\\Patipol\\AppData\\Local\\Programs\\Python\\Python311\\Lib\\contextvars.py',
   'PYMODULE'),
  ('fractions',
   'C:\\Users\\Patipol\\AppData\\Local\\Programs\\Python\\Python311\\Lib\\fractions.py',
   'PYMODULE'),
  ('numbers',
   'C:\\Users\\Patipol\\AppData\\Local\\Programs\\Python\\Python311\\Lib\\numbers.py',
   'PYMODULE'),
  ('hashlib',
   'C:\\Users\\Patipol\\AppData\\Local\\Programs\\Python\\Python311\\Lib\\hashlib.py',
   'PYMODULE'),
  ('logging',
   'C:\\Users\\Patipol\\AppData\\Local\\Programs\\Python\\Python311\\Lib\\logging\\__init__.py',
   'PYMODULE'),
  ('pickle',
   'C:\\Users\\Patipol\\AppData\\Local\\Programs\\Python\\Python311\\Lib\\pickle.py',
   'PYMODULE'),
  ('pprint',
   'C:\\Users\\Patipol\\AppData\\Local\\Programs\\Python\\Python311\\Lib\\pprint.py',
   'PYMODULE'),
  ('dataclasses',
   'C:\\Users\\Patipol\\AppData\\Local\\Programs\\Python\\Python311\\Lib\\dataclasses.py',
   'PYMODULE'),
  ('inspect',
   'C:\\Users\\Patipol\\AppData\\Local\\Programs\\Python\\Python311\\Lib\\inspect.py',
   'PYMODULE'),
  ('dis',
   'C:\\Users\\Patipol\\AppData\\Local\\Programs\\Python\\Python311\\Lib\\dis.py',
   'PYMODULE'),
  ('opcode',
   'C:\\Users\\Patipol\\AppData\\Local\\Programs\\Python\\Python311\\Lib\\opcode.py',
   'PYMODULE'),
  ('ast',
   'C:\\Users\\Patipol\\AppData\\Local\\Programs\\Python\\Python311\\Lib\\ast.py',
   'PYMODULE'),
  ('_compat_pickle',
   'C:\\Users\\Patipol\\AppData\\Local\\Programs\\Python\\Python311\\Lib\\_compat_pickle.py',
   'PYMODULE'),
  ('string',
   'C:\\Users\\Patipol\\AppData\\Local\\Programs\\Python\\Python311\\Lib\\string.py',
   'PYMODULE'),
  ('bisect',
   'C:\\Users\\Patipol\\AppData\\Local\\Programs\\Python\\Python311\\Lib\\bisect.py',
   'PYMODULE'),
  ('importlib._abc',
   'C:\\Users\\Patipol\\AppData\\Local\\Programs\\Python\\Python311\\Lib\\importlib\\_abc.py',
   'PYMODULE'),
  ('importlib.metadata._itertools',
   'C:\\Users\\Patipol\\AppData\\Local\\Programs\\Python\\Python311\\Lib\\importlib\\metadata\\_itertools.py',
   'PYMODULE'),
  ('importlib.metadata._functools',
   'C:\\Users\\Patipol\\AppData\\Local\\Programs\\Python\\Python311\\Lib\\importlib\\metadata\\_functools.py',
   'PYMODULE'),
  ('importlib.metadata._collections',
   'C:\\Users\\Patipol\\AppData\\Local\\Programs\\Python\\Python311\\Lib\\importlib\\metadata\\_collections.py',
   'PYMODULE'),
  ('importlib.metadata._meta',
   'C:\\Users\\Patipol\\AppData\\Local\\Programs\\Python\\Python311\\Lib\\importlib\\metadata\\_meta.py',
   'PYMODULE'),
  ('importlib.metadata._adapters',
   'C:\\Users\\Patipol\\AppData\\Local\\Programs\\Python\\Python311\\Lib\\importlib\\metadata\\_adapters.py',
   'PYMODULE'),
  ('importlib.metadata._text',
   'C:\\Users\\Patipol\\AppData\\Local\\Programs\\Python\\Python311\\Lib\\importlib\\metadata\\_text.py',
   'PYMODULE'),
  ('email.message',
   'C:\\Users\\Patipol\\AppData\\Local\\Programs\\Python\\Python311\\Lib\\email\\message.py',
   'PYMODULE'),
  ('email.policy',
   'C:\\Users\\Patipol\\AppData\\Local\\Programs\\Python\\Python311\\Lib\\email\\policy.py',
   'PYMODULE'),
  ('email.contentmanager',
   'C:\\Users\\Patipol\\AppData\\Local\\Programs\\Python\\Python311\\Lib\\email\\contentmanager.py',
   'PYMODULE'),
  ('email.quoprimime',
   'C:\\Users\\Patipol\\AppData\\Local\\Programs\\Python\\Python311\\Lib\\email\\quoprimime.py',
   'PYMODULE'),
  ('email.headerregistry',
   'C:\\Users\\Patipol\\AppData\\Local\\Programs\\Python\\Python311\\Lib\\email\\headerregistry.py',
   'PYMODULE'),
  ('email._header_value_parser',
   'C:\\Users\\Patipol\\AppData\\Local\\Programs\\Python\\Python311\\Lib\\email\\_header_value_parser.py',
   'PYMODULE'),
  ('email.iterators',
   'C:\\Users\\Patipol\\AppData\\Local\\Programs\\Python\\Python311\\Lib\\email\\iterators.py',
   'PYMODULE'),
  ('email.generator',
   'C:\\Users\\Patipol\\AppData\\Local\\Programs\\Python\\Python311\\Lib\\email\\generator.py',
   'PYMODULE'),
  ('email._encoded_words',
   'C:\\Users\\Patipol\\AppData\\Local\\Programs\\Python\\Python311\\Lib\\email\\_encoded_words.py',
   'PYMODULE'),
  ('base64',
   'C:\\Users\\Patipol\\AppData\\Local\\Programs\\Python\\Python311\\Lib\\base64.py',
   'PYMODULE'),
  ('getopt',
   'C:\\Users\\Patipol\\AppData\\Local\\Programs\\Python\\Python311\\Lib\\getopt.py',
   'PYMODULE'),
  ('email.charset',
   'C:\\Users\\Patipol\\AppData\\Local\\Programs\\Python\\Python311\\Lib\\email\\charset.py',
   'PYMODULE'),
  ('email.encoders',
   'C:\\Users\\Patipol\\AppData\\Local\\Programs\\Python\\Python311\\Lib\\email\\encoders.py',
   'PYMODULE'),
  ('email.base64mime',
   'C:\\Users\\Patipol\\AppData\\Local\\Programs\\Python\\Python311\\Lib\\email\\base64mime.py',
   'PYMODULE'),
  ('email._policybase',
   'C:\\Users\\Patipol\\AppData\\Local\\Programs\\Python\\Python311\\Lib\\email\\_policybase.py',
   'PYMODULE'),
  ('email.header',
   'C:\\Users\\Patipol\\AppData\\Local\\Programs\\Python\\Python311\\Lib\\email\\header.py',
   'PYMODULE'),
  ('email.errors',
   'C:\\Users\\Patipol\\AppData\\Local\\Programs\\Python\\Python311\\Lib\\email\\errors.py',
   'PYMODULE'),
  ('email.utils',
   'C:\\Users\\Patipol\\AppData\\Local\\Programs\\Python\\Python311\\Lib\\email\\utils.py',
   'PYMODULE'),
  ('email._parseaddr',
   'C:\\Users\\Patipol\\AppData\\Local\\Programs\\Python\\Python311\\Lib\\email\\_parseaddr.py',
   'PYMODULE'),
  ('socket',
   'C:\\Users\\Patipol\\AppData\\Local\\Programs\\Python\\Python311\\Lib\\socket.py',
   'PYMODULE'),
  ('selectors',
   'C:\\Users\\Patipol\\AppData\\Local\\Programs\\Python\\Python311\\Lib\\selectors.py',
   'PYMODULE'),
  ('quopri',
   'C:\\Users\\Patipol\\AppData\\Local\\Programs\\Python\\Python311\\Lib\\quopri.py',
   'PYMODULE'),
  ('email',
   'C:\\Users\\Patipol\\AppData\\Local\\Programs\\Python\\Python311\\Lib\\email\\__init__.py',
   'PYMODULE'),
  ('email.parser',
   'C:\\Users\\Patipol\\AppData\\Local\\Programs\\Python\\Python311\\Lib\\email\\parser.py',
   'PYMODULE'),
  ('email.feedparser',
   'C:\\Users\\Patipol\\AppData\\Local\\Programs\\Python\\Python311\\Lib\\email\\feedparser.py',
   'PYMODULE'),
  ('csv',
   'C:\\Users\\Patipol\\AppData\\Local\\Programs\\Python\\Python311\\Lib\\csv.py',
   'PYMODULE'),
  ('importlib.readers',
   'C:\\Users\\Patipol\\AppData\\Local\\Programs\\Python\\Python311\\Lib\\importlib\\readers.py',
   'PYMODULE'),
  ('importlib.resources.readers',
   'C:\\Users\\Patipol\\AppData\\Local\\Programs\\Python\\Python311\\Lib\\importlib\\resources\\readers.py',
   'PYMODULE'),
  ('importlib.resources._itertools',
   'C:\\Users\\Patipol\\AppData\\Local\\Programs\\Python\\Python311\\Lib\\importlib\\resources\\_itertools.py',
   'PYMODULE'),
  ('struct',
   'C:\\Users\\Patipol\\AppData\\Local\\Programs\\Python\\Python311\\Lib\\struct.py',
   'PYMODULE'),
  ('importlib.util',
   'C:\\Users\\Patipol\\AppData\\Local\\Programs\\Python\\Python311\\Lib\\importlib\\util.py',
   'PYMODULE'),
  ('tarfile',
   'C:\\Users\\Patipol\\AppData\\Local\\Programs\\Python\\Python311\\Lib\\tarfile.py',
   'PYMODULE'),
  ('gzip',
   'C:\\Users\\Patipol\\AppData\\Local\\Programs\\Python\\Python311\\Lib\\gzip.py',
   'PYMODULE'),
  ('_compression',
   'C:\\Users\\Patipol\\AppData\\Local\\Programs\\Python\\Python311\\Lib\\_compression.py',
   'PYMODULE'),
  ('resource', '-', 'PYMODULE'),
  ('lzma',
   'C:\\Users\\Patipol\\AppData\\Local\\Programs\\Python\\Python311\\Lib\\lzma.py',
   'PYMODULE'),
  ('bz2',
   'C:\\Users\\Patipol\\AppData\\Local\\Programs\\Python\\Python311\\Lib\\bz2.py',
   'PYMODULE'),
  ('copy',
   'C:\\Users\\Patipol\\AppData\\Local\\Programs\\Python\\Python311\\Lib\\copy.py',
   'PYMODULE'),
  ('gettext',
   'C:\\Users\\Patipol\\AppData\\Local\\Programs\\Python\\Python311\\Lib\\gettext.py',
   'PYMODULE'),
  ('signal',
   'C:\\Users\\Patipol\\AppData\\Local\\Programs\\Python\\Python311\\Lib\\signal.py',
   'PYMODULE'),
  ('multiprocessing.util',
   'C:\\Users\\Patipol\\AppData\\Local\\Programs\\Python\\Python311\\Lib\\multiprocessing\\util.py',
   'PYMODULE'),
  ('multiprocessing.forkserver',
   'C:\\Users\\Patipol\\AppData\\Local\\Programs\\Python\\Python311\\Lib\\multiprocessing\\forkserver.py',
   'PYMODULE'),
  ('multiprocessing.connection',
   'C:\\Users\\Patipol\\AppData\\Local\\Programs\\Python\\Python311\\Lib\\multiprocessing\\connection.py',
   'PYMODULE'),
  ('multiprocessing.resource_sharer',
   'C:\\Users\\Patipol\\AppData\\Local\\Programs\\Python\\Python311\\Lib\\multiprocessing\\resource_sharer.py',
   'PYMODULE'),
  ('xmlrpc.client',
   'C:\\Users\\Patipol\\AppData\\Local\\Programs\\Python\\Python311\\Lib\\xmlrpc\\client.py',
   'PYMODULE'),
  ('xmlrpc',
   'C:\\Users\\Patipol\\AppData\\Local\\Programs\\Python\\Python311\\Lib\\xmlrpc\\__init__.py',
   'PYMODULE'),
  ('xml.parsers.expat',
   'C:\\Users\\Patipol\\AppData\\Local\\Programs\\Python\\Python311\\Lib\\xml\\parsers\\expat.py',
   'PYMODULE'),
  ('xml.parsers',
   'C:\\Users\\Patipol\\AppData\\Local\\Programs\\Python\\Python311\\Lib\\xml\\parsers\\__init__.py',
   'PYMODULE'),
  ('xml',
   'C:\\Users\\Patipol\\AppData\\Local\\Programs\\Python\\Python311\\Lib\\xml\\__init__.py',
   'PYMODULE'),
  ('xml.sax.expatreader',
   'C:\\Users\\Patipol\\AppData\\Local\\Programs\\Python\\Python311\\Lib\\xml\\sax\\expatreader.py',
   'PYMODULE'),
  ('xml.sax.saxutils',
   'C:\\Users\\Patipol\\AppData\\Local\\Programs\\Python\\Python311\\Lib\\xml\\sax\\saxutils.py',
   'PYMODULE'),
  ('xml.sax',
   'C:\\Users\\Patipol\\AppData\\Local\\Programs\\Python\\Python311\\Lib\\xml\\sax\\__init__.py',
   'PYMODULE'),
  ('xml.sax.handler',
   'C:\\Users\\Patipol\\AppData\\Local\\Programs\\Python\\Python311\\Lib\\xml\\sax\\handler.py',
   'PYMODULE'),
  ('xml.sax._exceptions',
   'C:\\Users\\Patipol\\AppData\\Local\\Programs\\Python\\Python311\\Lib\\xml\\sax\\_exceptions.py',
   'PYMODULE'),
  ('xml.sax.xmlreader',
   'C:\\Users\\Patipol\\AppData\\Local\\Programs\\Python\\Python311\\Lib\\xml\\sax\\xmlreader.py',
   'PYMODULE'),
  ('http.client',
   'C:\\Users\\Patipol\\AppData\\Local\\Programs\\Python\\Python311\\Lib\\http\\client.py',
   'PYMODULE'),
  ('ssl',
   'C:\\Users\\Patipol\\AppData\\Local\\Programs\\Python\\Python311\\Lib\\ssl.py',
   'PYMODULE'),
  ('http',
   'C:\\Users\\Patipol\\AppData\\Local\\Programs\\Python\\Python311\\Lib\\http\\__init__.py',
   'PYMODULE'),
  ('hmac',
   'C:\\Users\\Patipol\\AppData\\Local\\Programs\\Python\\Python311\\Lib\\hmac.py',
   'PYMODULE'),
  ('multiprocessing.process',
   'C:\\Users\\Patipol\\AppData\\Local\\Programs\\Python\\Python311\\Lib\\multiprocessing\\process.py',
   'PYMODULE'),
  ('multiprocessing.context',
   'C:\\Users\\Patipol\\AppData\\Local\\Programs\\Python\\Python311\\Lib\\multiprocessing\\context.py',
   'PYMODULE'),
  ('multiprocessing.popen_forkserver',
   'C:\\Users\\Patipol\\AppData\\Local\\Programs\\Python\\Python311\\Lib\\multiprocessing\\popen_forkserver.py',
   'PYMODULE'),
  ('multiprocessing.sharedctypes',
   'C:\\Users\\Patipol\\AppData\\Local\\Programs\\Python\\Python311\\Lib\\multiprocessing\\sharedctypes.py',
   'PYMODULE'),
  ('multiprocessing.heap',
   'C:\\Users\\Patipol\\AppData\\Local\\Programs\\Python\\Python311\\Lib\\multiprocessing\\heap.py',
   'PYMODULE'),
  ('ctypes',
   'C:\\Users\\Patipol\\AppData\\Local\\Programs\\Python\\Python311\\Lib\\ctypes\\__init__.py',
   'PYMODULE'),
  ('ctypes.util',
   'C:\\Users\\Patipol\\AppData\\Local\\Programs\\Python\\Python311\\Lib\\ctypes\\util.py',
   'PYMODULE'),
  ('ctypes._aix',
   'C:\\Users\\Patipol\\AppData\\Local\\Programs\\Python\\Python311\\Lib\\ctypes\\_aix.py',
   'PYMODULE'),
  ('ctypes.macholib.dyld',
   'C:\\Users\\Patipol\\AppData\\Local\\Programs\\Python\\Python311\\Lib\\ctypes\\macholib\\dyld.py',
   'PYMODULE'),
  ('ctypes.macholib',
   'C:\\Users\\Patipol\\AppData\\Local\\Programs\\Python\\Python311\\Lib\\ctypes\\macholib\\__init__.py',
   'PYMODULE'),
  ('ctypes.macholib.dylib',
   'C:\\Users\\Patipol\\AppData\\Local\\Programs\\Python\\Python311\\Lib\\ctypes\\macholib\\dylib.py',
   'PYMODULE'),
  ('ctypes.macholib.framework',
   'C:\\Users\\Patipol\\AppData\\Local\\Programs\\Python\\Python311\\Lib\\ctypes\\macholib\\framework.py',
   'PYMODULE'),
  ('ctypes.wintypes',
   'C:\\Users\\Patipol\\AppData\\Local\\Programs\\Python\\Python311\\Lib\\ctypes\\wintypes.py',
   'PYMODULE'),
  ('ctypes._endian',
   'C:\\Users\\Patipol\\AppData\\Local\\Programs\\Python\\Python311\\Lib\\ctypes\\_endian.py',
   'PYMODULE'),
  ('multiprocessing.pool',
   'C:\\Users\\Patipol\\AppData\\Local\\Programs\\Python\\Python311\\Lib\\multiprocessing\\pool.py',
   'PYMODULE'),
  ('multiprocessing.dummy',
   'C:\\Users\\Patipol\\AppData\\Local\\Programs\\Python\\Python311\\Lib\\multiprocessing\\dummy\\__init__.py',
   'PYMODULE'),
  ('multiprocessing.dummy.connection',
   'C:\\Users\\Patipol\\AppData\\Local\\Programs\\Python\\Python311\\Lib\\multiprocessing\\dummy\\connection.py',
   'PYMODULE'),
  ('queue',
   'C:\\Users\\Patipol\\AppData\\Local\\Programs\\Python\\Python311\\Lib\\queue.py',
   'PYMODULE'),
  ('multiprocessing.queues',
   'C:\\Users\\Patipol\\AppData\\Local\\Programs\\Python\\Python311\\Lib\\multiprocessing\\queues.py',
   'PYMODULE'),
  ('multiprocessing.synchronize',
   'C:\\Users\\Patipol\\AppData\\Local\\Programs\\Python\\Python311\\Lib\\multiprocessing\\synchronize.py',
   'PYMODULE'),
  ('multiprocessing.managers',
   'C:\\Users\\Patipol\\AppData\\Local\\Programs\\Python\\Python311\\Lib\\multiprocessing\\managers.py',
   'PYMODULE'),
  ('multiprocessing.shared_memory',
   'C:\\Users\\Patipol\\AppData\\Local\\Programs\\Python\\Python311\\Lib\\multiprocessing\\shared_memory.py',
   'PYMODULE'),
  ('secrets',
   'C:\\Users\\Patipol\\AppData\\Local\\Programs\\Python\\Python311\\Lib\\secrets.py',
   'PYMODULE'),
  ('multiprocessing.reduction',
   'C:\\Users\\Patipol\\AppData\\Local\\Programs\\Python\\Python311\\Lib\\multiprocessing\\reduction.py',
   'PYMODULE'),
  ('multiprocessing.popen_fork',
   'C:\\Users\\Patipol\\AppData\\Local\\Programs\\Python\\Python311\\Lib\\multiprocessing\\popen_fork.py',
   'PYMODULE'),
  ('multiprocessing.popen_spawn_win32',
   'C:\\Users\\Patipol\\AppData\\Local\\Programs\\Python\\Python311\\Lib\\multiprocessing\\popen_spawn_win32.py',
   'PYMODULE'),
  ('subprocess',
   'C:\\Users\\Patipol\\AppData\\Local\\Programs\\Python\\Python311\\Lib\\subprocess.py',
   'PYMODULE'),
  ('multiprocessing.spawn',
   'C:\\Users\\Patipol\\AppData\\Local\\Programs\\Python\\Python311\\Lib\\multiprocessing\\spawn.py',
   'PYMODULE'),
  ('runpy',
   'C:\\Users\\Patipol\\AppData\\Local\\Programs\\Python\\Python311\\Lib\\runpy.py',
   'PYMODULE'),
  ('pkgutil',
   'C:\\Users\\Patipol\\AppData\\Local\\Programs\\Python\\Python311\\Lib\\pkgutil.py',
   'PYMODULE'),
  ('zipimport',
   'C:\\Users\\Patipol\\AppData\\Local\\Programs\\Python\\Python311\\Lib\\zipimport.py',
   'PYMODULE'),
  ('multiprocessing',
   'C:\\Users\\Patipol\\AppData\\Local\\Programs\\Python\\Python311\\Lib\\multiprocessing\\__init__.py',
   'PYMODULE'),
  ('_py_abc',
   'C:\\Users\\Patipol\\AppData\\Local\\Programs\\Python\\Python311\\Lib\\_py_abc.py',
   'PYMODULE'),
  ('getpass',
   'C:\\Users\\Patipol\\AppData\\Local\\Programs\\Python\\Python311\\Lib\\getpass.py',
   'PYMODULE'),
  ('nturl2path',
   'C:\\Users\\Patipol\\AppData\\Local\\Programs\\Python\\Python311\\Lib\\nturl2path.py',
   'PYMODULE'),
  ('ftplib',
   'C:\\Users\\Patipol\\AppData\\Local\\Programs\\Python\\Python311\\Lib\\ftplib.py',
   'PYMODULE'),
  ('netrc',
   'C:\\Users\\Patipol\\AppData\\Local\\Programs\\Python\\Python311\\Lib\\netrc.py',
   'PYMODULE'),
  ('shlex',
   'C:\\Users\\Patipol\\AppData\\Local\\Programs\\Python\\Python311\\Lib\\shlex.py',
   'PYMODULE'),
  ('mimetypes',
   'C:\\Users\\Patipol\\AppData\\Local\\Programs\\Python\\Python311\\Lib\\mimetypes.py',
   'PYMODULE'),
  ('http.cookiejar',
   'C:\\Users\\Patipol\\AppData\\Local\\Programs\\Python\\Python311\\Lib\\http\\cookiejar.py',
   'PYMODULE'),
  ('stringprep',
   'C:\\Users\\Patipol\\AppData\\Local\\Programs\\Python\\Python311\\Lib\\stringprep.py',
   'PYMODULE'),
  ('tracemalloc',
   'C:\\Users\\Patipol\\AppData\\Local\\Programs\\Python\\Python311\\Lib\\tracemalloc.py',
   'PYMODULE'),
  ('package1.marker',
   'D:\\personal projects\\Python\\Prototype\\prototype\\package1\\marker.py',
   'PYMODULE'),
  ('package2.shooter',
   'D:\\personal projects\\Python\\Prototype\\prototype\\package2\\shooter.py',
   'PYMODULE'),
  ('package2', '-', 'PYMODULE'),
  ('pyautogui',
   'C:\\Users\\Patipol\\AppData\\Local\\Programs\\Python\\Python311\\Lib\\site-packages\\pyautogui\\__init__.py',
   'PYMODULE'),
  ('pyautogui._pyautogui_x11',
   'C:\\Users\\Patipol\\AppData\\Local\\Programs\\Python\\Python311\\Lib\\site-packages\\pyautogui\\_pyautogui_x11.py',
   'PYMODULE'),
  ('pyautogui._pyautogui_win',
   'C:\\Users\\Patipol\\AppData\\Local\\Programs\\Python\\Python311\\Lib\\site-packages\\pyautogui\\_pyautogui_win.py',
   'PYMODULE'),
  ('pyautogui._pyautogui_osx',
   'C:\\Users\\Patipol\\AppData\\Local\\Programs\\Python\\Python311\\Lib\\site-packages\\pyautogui\\_pyautogui_osx.py',
   'PYMODULE'),
  ('pygetwindow',
   'C:\\Users\\Patipol\\AppData\\Local\\Programs\\Python\\Python311\\Lib\\site-packages\\pygetwindow\\__init__.py',
   'PYMODULE'),
  ('pygetwindow._pygetwindow_win',
   'C:\\Users\\Patipol\\AppData\\Local\\Programs\\Python\\Python311\\Lib\\site-packages\\pygetwindow\\_pygetwindow_win.py',
   'PYMODULE'),
  ('pygetwindow._pygetwindow_macos',
   'C:\\Users\\Patipol\\AppData\\Local\\Programs\\Python\\Python311\\Lib\\site-packages\\pygetwindow\\_pygetwindow_macos.py',
   'PYMODULE'),
  ('pyrect',
   'C:\\Users\\Patipol\\AppData\\Local\\Programs\\Python\\Python311\\Lib\\site-packages\\pyrect\\__init__.py',
   'PYMODULE'),
  ('doctest',
   'C:\\Users\\Patipol\\AppData\\Local\\Programs\\Python\\Python311\\Lib\\doctest.py',
   'PYMODULE'),
  ('unittest',
   'C:\\Users\\Patipol\\AppData\\Local\\Programs\\Python\\Python311\\Lib\\unittest\\__init__.py',
   'PYMODULE'),
  ('unittest.async_case',
   'C:\\Users\\Patipol\\AppData\\Local\\Programs\\Python\\Python311\\Lib\\unittest\\async_case.py',
   'PYMODULE'),
  ('asyncio',
   'C:\\Users\\Patipol\\AppData\\Local\\Programs\\Python\\Python311\\Lib\\asyncio\\__init__.py',
   'PYMODULE'),
  ('asyncio.unix_events',
   'C:\\Users\\Patipol\\AppData\\Local\\Programs\\Python\\Python311\\Lib\\asyncio\\unix_events.py',
   'PYMODULE'),
  ('asyncio.log',
   'C:\\Users\\Patipol\\AppData\\Local\\Programs\\Python\\Python311\\Lib\\asyncio\\log.py',
   'PYMODULE'),
  ('asyncio.windows_events',
   'C:\\Users\\Patipol\\AppData\\Local\\Programs\\Python\\Python311\\Lib\\asyncio\\windows_events.py',
   'PYMODULE'),
  ('asyncio.windows_utils',
   'C:\\Users\\Patipol\\AppData\\Local\\Programs\\Python\\Python311\\Lib\\asyncio\\windows_utils.py',
   'PYMODULE'),
  ('asyncio.selector_events',
   'C:\\Users\\Patipol\\AppData\\Local\\Programs\\Python\\Python311\\Lib\\asyncio\\selector_events.py',
   'PYMODULE'),
  ('asyncio.proactor_events',
   'C:\\Users\\Patipol\\AppData\\Local\\Programs\\Python\\Python311\\Lib\\asyncio\\proactor_events.py',
   'PYMODULE'),
  ('asyncio.base_subprocess',
   'C:\\Users\\Patipol\\AppData\\Local\\Programs\\Python\\Python311\\Lib\\asyncio\\base_subprocess.py',
   'PYMODULE'),
  ('asyncio.threads',
   'C:\\Users\\Patipol\\AppData\\Local\\Programs\\Python\\Python311\\Lib\\asyncio\\threads.py',
   'PYMODULE'),
  ('asyncio.timeouts',
   'C:\\Users\\Patipol\\AppData\\Local\\Programs\\Python\\Python311\\Lib\\asyncio\\timeouts.py',
   'PYMODULE'),
  ('asyncio.taskgroups',
   'C:\\Users\\Patipol\\AppData\\Local\\Programs\\Python\\Python311\\Lib\\asyncio\\taskgroups.py',
   'PYMODULE'),
  ('asyncio.subprocess',
   'C:\\Users\\Patipol\\AppData\\Local\\Programs\\Python\\Python311\\Lib\\asyncio\\subprocess.py',
   'PYMODULE'),
  ('asyncio.streams',
   'C:\\Users\\Patipol\\AppData\\Local\\Programs\\Python\\Python311\\Lib\\asyncio\\streams.py',
   'PYMODULE'),
  ('asyncio.queues',
   'C:\\Users\\Patipol\\AppData\\Local\\Programs\\Python\\Python311\\Lib\\asyncio\\queues.py',
   'PYMODULE'),
  ('asyncio.runners',
   'C:\\Users\\Patipol\\AppData\\Local\\Programs\\Python\\Python311\\Lib\\asyncio\\runners.py',
   'PYMODULE'),
  ('asyncio.base_events',
   'C:\\Users\\Patipol\\AppData\\Local\\Programs\\Python\\Python311\\Lib\\asyncio\\base_events.py',
   'PYMODULE'),
  ('concurrent.futures',
   'C:\\Users\\Patipol\\AppData\\Local\\Programs\\Python\\Python311\\Lib\\concurrent\\futures\\__init__.py',
   'PYMODULE'),
  ('concurrent.futures.thread',
   'C:\\Users\\Patipol\\AppData\\Local\\Programs\\Python\\Python311\\Lib\\concurrent\\futures\\thread.py',
   'PYMODULE'),
  ('concurrent.futures.process',
   'C:\\Users\\Patipol\\AppData\\Local\\Programs\\Python\\Python311\\Lib\\concurrent\\futures\\process.py',
   'PYMODULE'),
  ('concurrent.futures._base',
   'C:\\Users\\Patipol\\AppData\\Local\\Programs\\Python\\Python311\\Lib\\concurrent\\futures\\_base.py',
   'PYMODULE'),
  ('concurrent',
   'C:\\Users\\Patipol\\AppData\\Local\\Programs\\Python\\Python311\\Lib\\concurrent\\__init__.py',
   'PYMODULE'),
  ('asyncio.trsock',
   'C:\\Users\\Patipol\\AppData\\Local\\Programs\\Python\\Python311\\Lib\\asyncio\\trsock.py',
   'PYMODULE'),
  ('asyncio.staggered',
   'C:\\Users\\Patipol\\AppData\\Local\\Programs\\Python\\Python311\\Lib\\asyncio\\staggered.py',
   'PYMODULE'),
  ('asyncio.tasks',
   'C:\\Users\\Patipol\\AppData\\Local\\Programs\\Python\\Python311\\Lib\\asyncio\\tasks.py',
   'PYMODULE'),
  ('asyncio.locks',
   'C:\\Users\\Patipol\\AppData\\Local\\Programs\\Python\\Python311\\Lib\\asyncio\\locks.py',
   'PYMODULE'),
  ('asyncio.base_tasks',
   'C:\\Users\\Patipol\\AppData\\Local\\Programs\\Python\\Python311\\Lib\\asyncio\\base_tasks.py',
   'PYMODULE'),
  ('asyncio.mixins',
   'C:\\Users\\Patipol\\AppData\\Local\\Programs\\Python\\Python311\\Lib\\asyncio\\mixins.py',
   'PYMODULE'),
  ('asyncio.sslproto',
   'C:\\Users\\Patipol\\AppData\\Local\\Programs\\Python\\Python311\\Lib\\asyncio\\sslproto.py',
   'PYMODULE'),
  ('asyncio.transports',
   'C:\\Users\\Patipol\\AppData\\Local\\Programs\\Python\\Python311\\Lib\\asyncio\\transports.py',
   'PYMODULE'),
  ('asyncio.protocols',
   'C:\\Users\\Patipol\\AppData\\Local\\Programs\\Python\\Python311\\Lib\\asyncio\\protocols.py',
   'PYMODULE'),
  ('asyncio.futures',
   'C:\\Users\\Patipol\\AppData\\Local\\Programs\\Python\\Python311\\Lib\\asyncio\\futures.py',
   'PYMODULE'),
  ('asyncio.base_futures',
   'C:\\Users\\Patipol\\AppData\\Local\\Programs\\Python\\Python311\\Lib\\asyncio\\base_futures.py',
   'PYMODULE'),
  ('asyncio.exceptions',
   'C:\\Users\\Patipol\\AppData\\Local\\Programs\\Python\\Python311\\Lib\\asyncio\\exceptions.py',
   'PYMODULE'),
  ('asyncio.events',
   'C:\\Users\\Patipol\\AppData\\Local\\Programs\\Python\\Python311\\Lib\\asyncio\\events.py',
   'PYMODULE'),
  ('asyncio.format_helpers',
   'C:\\Users\\Patipol\\AppData\\Local\\Programs\\Python\\Python311\\Lib\\asyncio\\format_helpers.py',
   'PYMODULE'),
  ('asyncio.coroutines',
   'C:\\Users\\Patipol\\AppData\\Local\\Programs\\Python\\Python311\\Lib\\asyncio\\coroutines.py',
   'PYMODULE'),
  ('asyncio.constants',
   'C:\\Users\\Patipol\\AppData\\Local\\Programs\\Python\\Python311\\Lib\\asyncio\\constants.py',
   'PYMODULE'),
  ('unittest.signals',
   'C:\\Users\\Patipol\\AppData\\Local\\Programs\\Python\\Python311\\Lib\\unittest\\signals.py',
   'PYMODULE'),
  ('unittest.main',
   'C:\\Users\\Patipol\\AppData\\Local\\Programs\\Python\\Python311\\Lib\\unittest\\main.py',
   'PYMODULE'),
  ('unittest.runner',
   'C:\\Users\\Patipol\\AppData\\Local\\Programs\\Python\\Python311\\Lib\\unittest\\runner.py',
   'PYMODULE'),
  ('unittest.loader',
   'C:\\Users\\Patipol\\AppData\\Local\\Programs\\Python\\Python311\\Lib\\unittest\\loader.py',
   'PYMODULE'),
  ('unittest.suite',
   'C:\\Users\\Patipol\\AppData\\Local\\Programs\\Python\\Python311\\Lib\\unittest\\suite.py',
   'PYMODULE'),
  ('unittest.case',
   'C:\\Users\\Patipol\\AppData\\Local\\Programs\\Python\\Python311\\Lib\\unittest\\case.py',
   'PYMODULE'),
  ('unittest._log',
   'C:\\Users\\Patipol\\AppData\\Local\\Programs\\Python\\Python311\\Lib\\unittest\\_log.py',
   'PYMODULE'),
  ('unittest.result',
   'C:\\Users\\Patipol\\AppData\\Local\\Programs\\Python\\Python311\\Lib\\unittest\\result.py',
   'PYMODULE'),
  ('unittest.util',
   'C:\\Users\\Patipol\\AppData\\Local\\Programs\\Python\\Python311\\Lib\\unittest\\util.py',
   'PYMODULE'),
  ('pdb',
   'C:\\Users\\Patipol\\AppData\\Local\\Programs\\Python\\Python311\\Lib\\pdb.py',
   'PYMODULE'),
  ('pydoc',
   'C:\\Users\\Patipol\\AppData\\Local\\Programs\\Python\\Python311\\Lib\\pydoc.py',
   'PYMODULE'),
  ('webbrowser',
   'C:\\Users\\Patipol\\AppData\\Local\\Programs\\Python\\Python311\\Lib\\webbrowser.py',
   'PYMODULE'),
  ('http.server',
   'C:\\Users\\Patipol\\AppData\\Local\\Programs\\Python\\Python311\\Lib\\http\\server.py',
   'PYMODULE'),
  ('socketserver',
   'C:\\Users\\Patipol\\AppData\\Local\\Programs\\Python\\Python311\\Lib\\socketserver.py',
   'PYMODULE'),
  ('html',
   'C:\\Users\\Patipol\\AppData\\Local\\Programs\\Python\\Python311\\Lib\\html\\__init__.py',
   'PYMODULE'),
  ('html.entities',
   'C:\\Users\\Patipol\\AppData\\Local\\Programs\\Python\\Python311\\Lib\\html\\entities.py',
   'PYMODULE'),
  ('pydoc_data.topics',
   'C:\\Users\\Patipol\\AppData\\Local\\Programs\\Python\\Python311\\Lib\\pydoc_data\\topics.py',
   'PYMODULE'),
  ('pydoc_data',
   'C:\\Users\\Patipol\\AppData\\Local\\Programs\\Python\\Python311\\Lib\\pydoc_data\\__init__.py',
   'PYMODULE'),
  ('tty',
   'C:\\Users\\Patipol\\AppData\\Local\\Programs\\Python\\Python311\\Lib\\tty.py',
   'PYMODULE'),
  ('sysconfig',
   'C:\\Users\\Patipol\\AppData\\Local\\Programs\\Python\\Python311\\Lib\\sysconfig.py',
   'PYMODULE'),
  ('_aix_support',
   'C:\\Users\\Patipol\\AppData\\Local\\Programs\\Python\\Python311\\Lib\\_aix_support.py',
   'PYMODULE'),
  ('_bootsubprocess',
   'C:\\Users\\Patipol\\AppData\\Local\\Programs\\Python\\Python311\\Lib\\_bootsubprocess.py',
   'PYMODULE'),
  ('glob',
   'C:\\Users\\Patipol\\AppData\\Local\\Programs\\Python\\Python311\\Lib\\glob.py',
   'PYMODULE'),
  ('code',
   'C:\\Users\\Patipol\\AppData\\Local\\Programs\\Python\\Python311\\Lib\\code.py',
   'PYMODULE'),
  ('codeop',
   'C:\\Users\\Patipol\\AppData\\Local\\Programs\\Python\\Python311\\Lib\\codeop.py',
   'PYMODULE'),
  ('bdb',
   'C:\\Users\\Patipol\\AppData\\Local\\Programs\\Python\\Python311\\Lib\\bdb.py',
   'PYMODULE'),
  ('cmd',
   'C:\\Users\\Patipol\\AppData\\Local\\Programs\\Python\\Python311\\Lib\\cmd.py',
   'PYMODULE'),
  ('difflib',
   'C:\\Users\\Patipol\\AppData\\Local\\Programs\\Python\\Python311\\Lib\\difflib.py',
   'PYMODULE'),
  ('mouseinfo',
   'C:\\Users\\Patipol\\AppData\\Local\\Programs\\Python\\Python311\\Lib\\site-packages\\mouseinfo\\__init__.py',
   'PYMODULE'),
  ('tkinter.ttk',
   'C:\\Users\\Patipol\\AppData\\Local\\Programs\\Python\\Python311\\Lib\\tkinter\\ttk.py',
   'PYMODULE'),
  ('tkinter',
   'C:\\Users\\Patipol\\AppData\\Local\\Programs\\Python\\Python311\\Lib\\tkinter\\__init__.py',
   'PYMODULE'),
  ('tkinter.constants',
   'C:\\Users\\Patipol\\AppData\\Local\\Programs\\Python\\Python311\\Lib\\tkinter\\constants.py',
   'PYMODULE'),
  ('PIL.ImageGrab',
   'C:\\Users\\Patipol\\AppData\\Local\\Programs\\Python\\Python311\\Lib\\site-packages\\PIL\\ImageGrab.py',
   'PYMODULE'),
  ('PIL.BmpImagePlugin',
   'C:\\Users\\Patipol\\AppData\\Local\\Programs\\Python\\Python311\\Lib\\site-packages\\PIL\\BmpImagePlugin.py',
   'PYMODULE'),
  ('PIL._binary',
   'C:\\Users\\Patipol\\AppData\\Local\\Programs\\Python\\Python311\\Lib\\site-packages\\PIL\\_binary.py',
   'PYMODULE'),
  ('PIL.ImagePalette',
   'C:\\Users\\Patipol\\AppData\\Local\\Programs\\Python\\Python311\\Lib\\site-packages\\PIL\\ImagePalette.py',
   'PYMODULE'),
  ('PIL._deprecate',
   'C:\\Users\\Patipol\\AppData\\Local\\Programs\\Python\\Python311\\Lib\\site-packages\\PIL\\_deprecate.py',
   'PYMODULE'),
  ('PIL.PaletteFile',
   'C:\\Users\\Patipol\\AppData\\Local\\Programs\\Python\\Python311\\Lib\\site-packages\\PIL\\PaletteFile.py',
   'PYMODULE'),
  ('PIL.ImageColor',
   'C:\\Users\\Patipol\\AppData\\Local\\Programs\\Python\\Python311\\Lib\\site-packages\\PIL\\ImageColor.py',
   'PYMODULE'),
  ('colorsys',
   'C:\\Users\\Patipol\\AppData\\Local\\Programs\\Python\\Python311\\Lib\\colorsys.py',
   'PYMODULE'),
  ('PIL.GimpPaletteFile',
   'C:\\Users\\Patipol\\AppData\\Local\\Programs\\Python\\Python311\\Lib\\site-packages\\PIL\\GimpPaletteFile.py',
   'PYMODULE'),
  ('PIL.GimpGradientFile',
   'C:\\Users\\Patipol\\AppData\\Local\\Programs\\Python\\Python311\\Lib\\site-packages\\PIL\\GimpGradientFile.py',
   'PYMODULE'),
  ('PIL.ImageFile',
   'C:\\Users\\Patipol\\AppData\\Local\\Programs\\Python\\Python311\\Lib\\site-packages\\PIL\\ImageFile.py',
   'PYMODULE'),
  ('PIL._util',
   'C:\\Users\\Patipol\\AppData\\Local\\Programs\\Python\\Python311\\Lib\\site-packages\\PIL\\_util.py',
   'PYMODULE'),
  ('PIL.PngImagePlugin',
   'C:\\Users\\Patipol\\AppData\\Local\\Programs\\Python\\Python311\\Lib\\site-packages\\PIL\\PngImagePlugin.py',
   'PYMODULE'),
  ('PIL.ImageSequence',
   'C:\\Users\\Patipol\\AppData\\Local\\Programs\\Python\\Python311\\Lib\\site-packages\\PIL\\ImageSequence.py',
   'PYMODULE'),
  ('PIL.ImageChops',
   'C:\\Users\\Patipol\\AppData\\Local\\Programs\\Python\\Python311\\Lib\\site-packages\\PIL\\ImageChops.py',
   'PYMODULE'),
  ('PIL.Image',
   'C:\\Users\\Patipol\\AppData\\Local\\Programs\\Python\\Python311\\Lib\\site-packages\\PIL\\Image.py',
   'PYMODULE'),
  ('PIL.XpmImagePlugin',
   'C:\\Users\\Patipol\\AppData\\Local\\Programs\\Python\\Python311\\Lib\\site-packages\\PIL\\XpmImagePlugin.py',
   'PYMODULE'),
  ('PIL.XbmImagePlugin',
   'C:\\Users\\Patipol\\AppData\\Local\\Programs\\Python\\Python311\\Lib\\site-packages\\PIL\\XbmImagePlugin.py',
   'PYMODULE'),
  ('PIL.XVThumbImagePlugin',
   'C:\\Users\\Patipol\\AppData\\Local\\Programs\\Python\\Python311\\Lib\\site-packages\\PIL\\XVThumbImagePlugin.py',
   'PYMODULE'),
  ('PIL.WmfImagePlugin',
   'C:\\Users\\Patipol\\AppData\\Local\\Programs\\Python\\Python311\\Lib\\site-packages\\PIL\\WmfImagePlugin.py',
   'PYMODULE'),
  ('PIL.WebPImagePlugin',
   'C:\\Users\\Patipol\\AppData\\Local\\Programs\\Python\\Python311\\Lib\\site-packages\\PIL\\WebPImagePlugin.py',
   'PYMODULE'),
  ('PIL.TgaImagePlugin',
   'C:\\Users\\Patipol\\AppData\\Local\\Programs\\Python\\Python311\\Lib\\site-packages\\PIL\\TgaImagePlugin.py',
   'PYMODULE'),
  ('PIL.SunImagePlugin',
   'C:\\Users\\Patipol\\AppData\\Local\\Programs\\Python\\Python311\\Lib\\site-packages\\PIL\\SunImagePlugin.py',
   'PYMODULE'),
  ('PIL.SpiderImagePlugin',
   'C:\\Users\\Patipol\\AppData\\Local\\Programs\\Python\\Python311\\Lib\\site-packages\\PIL\\SpiderImagePlugin.py',
   'PYMODULE'),
  ('PIL.ImageTk',
   'C:\\Users\\Patipol\\AppData\\Local\\Programs\\Python\\Python311\\Lib\\site-packages\\PIL\\ImageTk.py',
   'PYMODULE'),
  ('PIL.SgiImagePlugin',
   'C:\\Users\\Patipol\\AppData\\Local\\Programs\\Python\\Python311\\Lib\\site-packages\\PIL\\SgiImagePlugin.py',
   'PYMODULE'),
  ('PIL.PsdImagePlugin',
   'C:\\Users\\Patipol\\AppData\\Local\\Programs\\Python\\Python311\\Lib\\site-packages\\PIL\\PsdImagePlugin.py',
   'PYMODULE'),
  ('PIL.PixarImagePlugin',
   'C:\\Users\\Patipol\\AppData\\Local\\Programs\\Python\\Python311\\Lib\\site-packages\\PIL\\PixarImagePlugin.py',
   'PYMODULE'),
  ('PIL.PdfImagePlugin',
   'C:\\Users\\Patipol\\AppData\\Local\\Programs\\Python\\Python311\\Lib\\site-packages\\PIL\\PdfImagePlugin.py',
   'PYMODULE'),
  ('PIL.features',
   'C:\\Users\\Patipol\\AppData\\Local\\Programs\\Python\\Python311\\Lib\\site-packages\\PIL\\features.py',
   'PYMODULE'),
  ('PIL.PdfParser',
   'C:\\Users\\Patipol\\AppData\\Local\\Programs\\Python\\Python311\\Lib\\site-packages\\PIL\\PdfParser.py',
   'PYMODULE'),
  ('PIL.PcxImagePlugin',
   'C:\\Users\\Patipol\\AppData\\Local\\Programs\\Python\\Python311\\Lib\\site-packages\\PIL\\PcxImagePlugin.py',
   'PYMODULE'),
  ('PIL.PcdImagePlugin',
   'C:\\Users\\Patipol\\AppData\\Local\\Programs\\Python\\Python311\\Lib\\site-packages\\PIL\\PcdImagePlugin.py',
   'PYMODULE'),
  ('PIL.PalmImagePlugin',
   'C:\\Users\\Patipol\\AppData\\Local\\Programs\\Python\\Python311\\Lib\\site-packages\\PIL\\PalmImagePlugin.py',
   'PYMODULE'),
  ('PIL.MspImagePlugin',
   'C:\\Users\\Patipol\\AppData\\Local\\Programs\\Python\\Python311\\Lib\\site-packages\\PIL\\MspImagePlugin.py',
   'PYMODULE'),
  ('PIL.MpoImagePlugin',
   'C:\\Users\\Patipol\\AppData\\Local\\Programs\\Python\\Python311\\Lib\\site-packages\\PIL\\MpoImagePlugin.py',
   'PYMODULE'),
  ('PIL.MpegImagePlugin',
   'C:\\Users\\Patipol\\AppData\\Local\\Programs\\Python\\Python311\\Lib\\site-packages\\PIL\\MpegImagePlugin.py',
   'PYMODULE'),
  ('PIL.MicImagePlugin',
   'C:\\Users\\Patipol\\AppData\\Local\\Programs\\Python\\Python311\\Lib\\site-packages\\PIL\\MicImagePlugin.py',
   'PYMODULE'),
  ('PIL.McIdasImagePlugin',
   'C:\\Users\\Patipol\\AppData\\Local\\Programs\\Python\\Python311\\Lib\\site-packages\\PIL\\McIdasImagePlugin.py',
   'PYMODULE'),
  ('PIL.Jpeg2KImagePlugin',
   'C:\\Users\\Patipol\\AppData\\Local\\Programs\\Python\\Python311\\Lib\\site-packages\\PIL\\Jpeg2KImagePlugin.py',
   'PYMODULE'),
  ('PIL.IptcImagePlugin',
   'C:\\Users\\Patipol\\AppData\\Local\\Programs\\Python\\Python311\\Lib\\site-packages\\PIL\\IptcImagePlugin.py',
   'PYMODULE'),
  ('PIL.ImtImagePlugin',
   'C:\\Users\\Patipol\\AppData\\Local\\Programs\\Python\\Python311\\Lib\\site-packages\\PIL\\ImtImagePlugin.py',
   'PYMODULE'),
  ('PIL.ImImagePlugin',
   'C:\\Users\\Patipol\\AppData\\Local\\Programs\\Python\\Python311\\Lib\\site-packages\\PIL\\ImImagePlugin.py',
   'PYMODULE'),
  ('PIL.IcoImagePlugin',
   'C:\\Users\\Patipol\\AppData\\Local\\Programs\\Python\\Python311\\Lib\\site-packages\\PIL\\IcoImagePlugin.py',
   'PYMODULE'),
  ('PIL.IcnsImagePlugin',
   'C:\\Users\\Patipol\\AppData\\Local\\Programs\\Python\\Python311\\Lib\\site-packages\\PIL\\IcnsImagePlugin.py',
   'PYMODULE'),
  ('PIL.Hdf5StubImagePlugin',
   'C:\\Users\\Patipol\\AppData\\Local\\Programs\\Python\\Python311\\Lib\\site-packages\\PIL\\Hdf5StubImagePlugin.py',
   'PYMODULE'),
  ('PIL.GribStubImagePlugin',
   'C:\\Users\\Patipol\\AppData\\Local\\Programs\\Python\\Python311\\Lib\\site-packages\\PIL\\GribStubImagePlugin.py',
   'PYMODULE'),
  ('PIL.GbrImagePlugin',
   'C:\\Users\\Patipol\\AppData\\Local\\Programs\\Python\\Python311\\Lib\\site-packages\\PIL\\GbrImagePlugin.py',
   'PYMODULE'),
  ('PIL.FtexImagePlugin',
   'C:\\Users\\Patipol\\AppData\\Local\\Programs\\Python\\Python311\\Lib\\site-packages\\PIL\\FtexImagePlugin.py',
   'PYMODULE'),
  ('PIL.FpxImagePlugin',
   'C:\\Users\\Patipol\\AppData\\Local\\Programs\\Python\\Python311\\Lib\\site-packages\\PIL\\FpxImagePlugin.py',
   'PYMODULE'),
  ('PIL.FliImagePlugin',
   'C:\\Users\\Patipol\\AppData\\Local\\Programs\\Python\\Python311\\Lib\\site-packages\\PIL\\FliImagePlugin.py',
   'PYMODULE'),
  ('PIL.FitsStubImagePlugin',
   'C:\\Users\\Patipol\\AppData\\Local\\Programs\\Python\\Python311\\Lib\\site-packages\\PIL\\FitsStubImagePlugin.py',
   'PYMODULE'),
  ('PIL.FitsImagePlugin',
   'C:\\Users\\Patipol\\AppData\\Local\\Programs\\Python\\Python311\\Lib\\site-packages\\PIL\\FitsImagePlugin.py',
   'PYMODULE'),
  ('PIL.EpsImagePlugin',
   'C:\\Users\\Patipol\\AppData\\Local\\Programs\\Python\\Python311\\Lib\\site-packages\\PIL\\EpsImagePlugin.py',
   'PYMODULE'),
  ('PIL.DdsImagePlugin',
   'C:\\Users\\Patipol\\AppData\\Local\\Programs\\Python\\Python311\\Lib\\site-packages\\PIL\\DdsImagePlugin.py',
   'PYMODULE'),
  ('PIL.DcxImagePlugin',
   'C:\\Users\\Patipol\\AppData\\Local\\Programs\\Python\\Python311\\Lib\\site-packages\\PIL\\DcxImagePlugin.py',
   'PYMODULE'),
  ('PIL.CurImagePlugin',
   'C:\\Users\\Patipol\\AppData\\Local\\Programs\\Python\\Python311\\Lib\\site-packages\\PIL\\CurImagePlugin.py',
   'PYMODULE'),
  ('PIL.BufrStubImagePlugin',
   'C:\\Users\\Patipol\\AppData\\Local\\Programs\\Python\\Python311\\Lib\\site-packages\\PIL\\BufrStubImagePlugin.py',
   'PYMODULE'),
  ('PIL.BlpImagePlugin',
   'C:\\Users\\Patipol\\AppData\\Local\\Programs\\Python\\Python311\\Lib\\site-packages\\PIL\\BlpImagePlugin.py',
   'PYMODULE'),
  ('PIL.TiffImagePlugin',
   'C:\\Users\\Patipol\\AppData\\Local\\Programs\\Python\\Python311\\Lib\\site-packages\\PIL\\TiffImagePlugin.py',
   'PYMODULE'),
  ('PIL.ImageOps',
   'C:\\Users\\Patipol\\AppData\\Local\\Programs\\Python\\Python311\\Lib\\site-packages\\PIL\\ImageOps.py',
   'PYMODULE'),
  ('PIL.ImageShow',
   'C:\\Users\\Patipol\\AppData\\Local\\Programs\\Python\\Python311\\Lib\\site-packages\\PIL\\ImageShow.py',
   'PYMODULE'),
  ('PIL.ImageQt',
   'C:\\Users\\Patipol\\AppData\\Local\\Programs\\Python\\Python311\\Lib\\site-packages\\PIL\\ImageQt.py',
   'PYMODULE'),
  ('PIL.ImageFilter',
   'C:\\Users\\Patipol\\AppData\\Local\\Programs\\Python\\Python311\\Lib\\site-packages\\PIL\\ImageFilter.py',
   'PYMODULE'),
  ('PIL.ImageCms',
   'C:\\Users\\Patipol\\AppData\\Local\\Programs\\Python\\Python311\\Lib\\site-packages\\PIL\\ImageCms.py',
   'PYMODULE'),
  ('PIL.ImageWin',
   'C:\\Users\\Patipol\\AppData\\Local\\Programs\\Python\\Python311\\Lib\\site-packages\\PIL\\ImageWin.py',
   'PYMODULE'),
  ('PIL.PyAccess',
   'C:\\Users\\Patipol\\AppData\\Local\\Programs\\Python\\Python311\\Lib\\site-packages\\PIL\\PyAccess.py',
   'PYMODULE'),
  ('numpy',
   'C:\\Users\\Patipol\\AppData\\Local\\Programs\\Python\\Python311\\Lib\\site-packages\\numpy\\__init__.py',
   'PYMODULE'),
  ('numpy.core._dtype_ctypes',
   'C:\\Users\\Patipol\\AppData\\Local\\Programs\\Python\\Python311\\Lib\\site-packages\\numpy\\core\\_dtype_ctypes.py',
   'PYMODULE'),
  ('numpy.version',
   'C:\\Users\\Patipol\\AppData\\Local\\Programs\\Python\\Python311\\Lib\\site-packages\\numpy\\version.py',
   'PYMODULE'),
  ('numpy._version',
   'C:\\Users\\Patipol\\AppData\\Local\\Programs\\Python\\Python311\\Lib\\site-packages\\numpy\\_version.py',
   'PYMODULE'),
  ('json',
   'C:\\Users\\Patipol\\AppData\\Local\\Programs\\Python\\Python311\\Lib\\json\\__init__.py',
   'PYMODULE'),
  ('json.encoder',
   'C:\\Users\\Patipol\\AppData\\Local\\Programs\\Python\\Python311\\Lib\\json\\encoder.py',
   'PYMODULE'),
  ('json.decoder',
   'C:\\Users\\Patipol\\AppData\\Local\\Programs\\Python\\Python311\\Lib\\json\\decoder.py',
   'PYMODULE'),
  ('json.scanner',
   'C:\\Users\\Patipol\\AppData\\Local\\Programs\\Python\\Python311\\Lib\\json\\scanner.py',
   'PYMODULE'),
  ('numpy._pytesttester',
   'C:\\Users\\Patipol\\AppData\\Local\\Programs\\Python\\Python311\\Lib\\site-packages\\numpy\\_pytesttester.py',
   'PYMODULE'),
  ('numpy.testing',
   'C:\\Users\\Patipol\\AppData\\Local\\Programs\\Python\\Python311\\Lib\\site-packages\\numpy\\testing\\__init__.py',
   'PYMODULE'),
  ('numpy.testing._private.nosetester',
   'C:\\Users\\Patipol\\AppData\\Local\\Programs\\Python\\Python311\\Lib\\site-packages\\numpy\\testing\\_private\\nosetester.py',
   'PYMODULE'),
  ('numpy.testing._private.noseclasses',
   'C:\\Users\\Patipol\\AppData\\Local\\Programs\\Python\\Python311\\Lib\\site-packages\\numpy\\testing\\_private\\noseclasses.py',
   'PYMODULE'),
  ('numpy.testing._private.decorators',
   'C:\\Users\\Patipol\\AppData\\Local\\Programs\\Python\\Python311\\Lib\\site-packages\\numpy\\testing\\_private\\decorators.py',
   'PYMODULE'),
  ('numpy.testing._private.parameterized',
   'C:\\Users\\Patipol\\AppData\\Local\\Programs\\Python\\Python311\\Lib\\site-packages\\numpy\\testing\\_private\\parameterized.py',
   'PYMODULE'),
  ('numpy.testing._private.extbuild',
   'C:\\Users\\Patipol\\AppData\\Local\\Programs\\Python\\Python311\\Lib\\site-packages\\numpy\\testing\\_private\\extbuild.py',
   'PYMODULE'),
  ('numpy.testing._private',
   'C:\\Users\\Patipol\\AppData\\Local\\Programs\\Python\\Python311\\Lib\\site-packages\\numpy\\testing\\_private\\__init__.py',
   'PYMODULE'),
  ('numpy.testing._private.utils',
   'C:\\Users\\Patipol\\AppData\\Local\\Programs\\Python\\Python311\\Lib\\site-packages\\numpy\\testing\\_private\\utils.py',
   'PYMODULE'),
  ('numpy.core.fromnumeric',
   'C:\\Users\\Patipol\\AppData\\Local\\Programs\\Python\\Python311\\Lib\\site-packages\\numpy\\core\\fromnumeric.py',
   'PYMODULE'),
  ('numpy.core._methods',
   'C:\\Users\\Patipol\\AppData\\Local\\Programs\\Python\\Python311\\Lib\\site-packages\\numpy\\core\\_methods.py',
   'PYMODULE'),
  ('numpy.lib.stride_tricks',
   'C:\\Users\\Patipol\\AppData\\Local\\Programs\\Python\\Python311\\Lib\\site-packages\\numpy\\lib\\stride_tricks.py',
   'PYMODULE'),
  ('numpy.core.numeric',
   'C:\\Users\\Patipol\\AppData\\Local\\Programs\\Python\\Python311\\Lib\\site-packages\\numpy\\core\\numeric.py',
   'PYMODULE'),
  ('numpy.core._asarray',
   'C:\\Users\\Patipol\\AppData\\Local\\Programs\\Python\\Python311\\Lib\\site-packages\\numpy\\core\\_asarray.py',
   'PYMODULE'),
  ('numpy.core.arrayprint',
   'C:\\Users\\Patipol\\AppData\\Local\\Programs\\Python\\Python311\\Lib\\site-packages\\numpy\\core\\arrayprint.py',
   'PYMODULE'),
  ('numpy.core._ufunc_config',
   'C:\\Users\\Patipol\\AppData\\Local\\Programs\\Python\\Python311\\Lib\\site-packages\\numpy\\core\\_ufunc_config.py',
   'PYMODULE'),
  ('numpy.core.shape_base',
   'C:\\Users\\Patipol\\AppData\\Local\\Programs\\Python\\Python311\\Lib\\site-packages\\numpy\\core\\shape_base.py',
   'PYMODULE'),
  ('numpy.core._exceptions',
   'C:\\Users\\Patipol\\AppData\\Local\\Programs\\Python\\Python311\\Lib\\site-packages\\numpy\\core\\_exceptions.py',
   'PYMODULE'),
  ('numpy.core.umath',
   'C:\\Users\\Patipol\\AppData\\Local\\Programs\\Python\\Python311\\Lib\\site-packages\\numpy\\core\\umath.py',
   'PYMODULE'),
  ('numpy.core.overrides',
   'C:\\Users\\Patipol\\AppData\\Local\\Programs\\Python\\Python311\\Lib\\site-packages\\numpy\\core\\overrides.py',
   'PYMODULE'),
  ('numpy.compat._inspect',
   'C:\\Users\\Patipol\\AppData\\Local\\Programs\\Python\\Python311\\Lib\\site-packages\\numpy\\compat\\_inspect.py',
   'PYMODULE'),
  ('numpy.core.multiarray',
   'C:\\Users\\Patipol\\AppData\\Local\\Programs\\Python\\Python311\\Lib\\site-packages\\numpy\\core\\multiarray.py',
   'PYMODULE'),
  ('numpy.core.numerictypes',
   'C:\\Users\\Patipol\\AppData\\Local\\Programs\\Python\\Python311\\Lib\\site-packages\\numpy\\core\\numerictypes.py',
   'PYMODULE'),
  ('numpy.core._dtype',
   'C:\\Users\\Patipol\\AppData\\Local\\Programs\\Python\\Python311\\Lib\\site-packages\\numpy\\core\\_dtype.py',
   'PYMODULE'),
  ('numpy.core._type_aliases',
   'C:\\Users\\Patipol\\AppData\\Local\\Programs\\Python\\Python311\\Lib\\site-packages\\numpy\\core\\_type_aliases.py',
   'PYMODULE'),
  ('numpy.core._string_helpers',
   'C:\\Users\\Patipol\\AppData\\Local\\Programs\\Python\\Python311\\Lib\\site-packages\\numpy\\core\\_string_helpers.py',
   'PYMODULE'),
  ('numpy.matrixlib',
   'C:\\Users\\Patipol\\AppData\\Local\\Programs\\Python\\Python311\\Lib\\site-packages\\numpy\\matrixlib\\__init__.py',
   'PYMODULE'),
  ('numpy.matrixlib.defmatrix',
   'C:\\Users\\Patipol\\AppData\\Local\\Programs\\Python\\Python311\\Lib\\site-packages\\numpy\\matrixlib\\defmatrix.py',
   'PYMODULE'),
  ('numpy.ma',
   'C:\\Users\\Patipol\\AppData\\Local\\Programs\\Python\\Python311\\Lib\\site-packages\\numpy\\ma\\__init__.py',
   'PYMODULE'),
  ('numpy.ma.extras',
   'C:\\Users\\Patipol\\AppData\\Local\\Programs\\Python\\Python311\\Lib\\site-packages\\numpy\\ma\\extras.py',
   'PYMODULE'),
  ('numpy.lib.index_tricks',
   'C:\\Users\\Patipol\\AppData\\Local\\Programs\\Python\\Python311\\Lib\\site-packages\\numpy\\lib\\index_tricks.py',
   'PYMODULE'),
  ('numpy.lib.function_base',
   'C:\\Users\\Patipol\\AppData\\Local\\Programs\\Python\\Python311\\Lib\\site-packages\\numpy\\lib\\function_base.py',
   'PYMODULE'),
  ('numpy.lib.histograms',
   'C:\\Users\\Patipol\\AppData\\Local\\Programs\\Python\\Python311\\Lib\\site-packages\\numpy\\lib\\histograms.py',
   'PYMODULE'),
  ('numpy.lib.twodim_base',
   'C:\\Users\\Patipol\\AppData\\Local\\Programs\\Python\\Python311\\Lib\\site-packages\\numpy\\lib\\twodim_base.py',
   'PYMODULE'),
  ('numpy.core.function_base',
   'C:\\Users\\Patipol\\AppData\\Local\\Programs\\Python\\Python311\\Lib\\site-packages\\numpy\\core\\function_base.py',
   'PYMODULE'),
  ('numpy.ma.core',
   'C:\\Users\\Patipol\\AppData\\Local\\Programs\\Python\\Python311\\Lib\\site-packages\\numpy\\ma\\core.py',
   'PYMODULE'),
  ('numpy.ctypeslib',
   'C:\\Users\\Patipol\\AppData\\Local\\Programs\\Python\\Python311\\Lib\\site-packages\\numpy\\ctypeslib.py',
   'PYMODULE'),
  ('numpy.core._internal',
   'C:\\Users\\Patipol\\AppData\\Local\\Programs\\Python\\Python311\\Lib\\site-packages\\numpy\\core\\_internal.py',
   'PYMODULE'),
  ('numpy.random',
   'C:\\Users\\Patipol\\AppData\\Local\\Programs\\Python\\Python311\\Lib\\site-packages\\numpy\\random\\__init__.py',
   'PYMODULE'),
  ('numpy.random._pickle',
   'C:\\Users\\Patipol\\AppData\\Local\\Programs\\Python\\Python311\\Lib\\site-packages\\numpy\\random\\_pickle.py',
   'PYMODULE'),
  ('numpy.polynomial',
   'C:\\Users\\Patipol\\AppData\\Local\\Programs\\Python\\Python311\\Lib\\site-packages\\numpy\\polynomial\\__init__.py',
   'PYMODULE'),
  ('numpy.polynomial._polybase',
   'C:\\Users\\Patipol\\AppData\\Local\\Programs\\Python\\Python311\\Lib\\site-packages\\numpy\\polynomial\\_polybase.py',
   'PYMODULE'),
  ('numpy.polynomial.laguerre',
   'C:\\Users\\Patipol\\AppData\\Local\\Programs\\Python\\Python311\\Lib\\site-packages\\numpy\\polynomial\\laguerre.py',
   'PYMODULE'),
  ('numpy.polynomial.hermite_e',
   'C:\\Users\\Patipol\\AppData\\Local\\Programs\\Python\\Python311\\Lib\\site-packages\\numpy\\polynomial\\hermite_e.py',
   'PYMODULE'),
  ('numpy.polynomial.hermite',
   'C:\\Users\\Patipol\\AppData\\Local\\Programs\\Python\\Python311\\Lib\\site-packages\\numpy\\polynomial\\hermite.py',
   'PYMODULE'),
  ('numpy.polynomial.legendre',
   'C:\\Users\\Patipol\\AppData\\Local\\Programs\\Python\\Python311\\Lib\\site-packages\\numpy\\polynomial\\legendre.py',
   'PYMODULE'),
  ('numpy.polynomial.chebyshev',
   'C:\\Users\\Patipol\\AppData\\Local\\Programs\\Python\\Python311\\Lib\\site-packages\\numpy\\polynomial\\chebyshev.py',
   'PYMODULE'),
  ('numpy.polynomial.polynomial',
   'C:\\Users\\Patipol\\AppData\\Local\\Programs\\Python\\Python311\\Lib\\site-packages\\numpy\\polynomial\\polynomial.py',
   'PYMODULE'),
  ('numpy.polynomial.polyutils',
   'C:\\Users\\Patipol\\AppData\\Local\\Programs\\Python\\Python311\\Lib\\site-packages\\numpy\\polynomial\\polyutils.py',
   'PYMODULE'),
  ('numpy.fft',
   'C:\\Users\\Patipol\\AppData\\Local\\Programs\\Python\\Python311\\Lib\\site-packages\\numpy\\fft\\__init__.py',
   'PYMODULE'),
  ('numpy.fft.helper',
   'C:\\Users\\Patipol\\AppData\\Local\\Programs\\Python\\Python311\\Lib\\site-packages\\numpy\\fft\\helper.py',
   'PYMODULE'),
  ('numpy.fft._pocketfft',
   'C:\\Users\\Patipol\\AppData\\Local\\Programs\\Python\\Python311\\Lib\\site-packages\\numpy\\fft\\_pocketfft.py',
   'PYMODULE'),
  ('numpy.linalg',
   'C:\\Users\\Patipol\\AppData\\Local\\Programs\\Python\\Python311\\Lib\\site-packages\\numpy\\linalg\\__init__.py',
   'PYMODULE'),
  ('numpy.linalg.linalg',
   'C:\\Users\\Patipol\\AppData\\Local\\Programs\\Python\\Python311\\Lib\\site-packages\\numpy\\linalg\\linalg.py',
   'PYMODULE'),
  ('numpy.lib',
   'C:\\Users\\Patipol\\AppData\\Local\\Programs\\Python\\Python311\\Lib\\site-packages\\numpy\\lib\\__init__.py',
   'PYMODULE'),
  ('numpy.lib._version',
   'C:\\Users\\Patipol\\AppData\\Local\\Programs\\Python\\Python311\\Lib\\site-packages\\numpy\\lib\\_version.py',
   'PYMODULE'),
  ('numpy.lib.arraypad',
   'C:\\Users\\Patipol\\AppData\\Local\\Programs\\Python\\Python311\\Lib\\site-packages\\numpy\\lib\\arraypad.py',
   'PYMODULE'),
  ('numpy.lib.arrayterator',
   'C:\\Users\\Patipol\\AppData\\Local\\Programs\\Python\\Python311\\Lib\\site-packages\\numpy\\lib\\arrayterator.py',
   'PYMODULE'),
  ('numpy.lib.npyio',
   'C:\\Users\\Patipol\\AppData\\Local\\Programs\\Python\\Python311\\Lib\\site-packages\\numpy\\lib\\npyio.py',
   'PYMODULE'),
  ('numpy.ma.mrecords',
   'C:\\Users\\Patipol\\AppData\\Local\\Programs\\Python\\Python311\\Lib\\site-packages\\numpy\\ma\\mrecords.py',
   'PYMODULE'),
  ('numpy.core.records',
   'C:\\Users\\Patipol\\AppData\\Local\\Programs\\Python\\Python311\\Lib\\site-packages\\numpy\\core\\records.py',
   'PYMODULE'),
  ('numpy.lib._iotools',
   'C:\\Users\\Patipol\\AppData\\Local\\Programs\\Python\\Python311\\Lib\\site-packages\\numpy\\lib\\_iotools.py',
   'PYMODULE'),
  ('numpy.lib._datasource',
   'C:\\Users\\Patipol\\AppData\\Local\\Programs\\Python\\Python311\\Lib\\site-packages\\numpy\\lib\\_datasource.py',
   'PYMODULE'),
  ('numpy.lib.format',
   'C:\\Users\\Patipol\\AppData\\Local\\Programs\\Python\\Python311\\Lib\\site-packages\\numpy\\lib\\format.py',
   'PYMODULE'),
  ('numpy.lib.arraysetops',
   'C:\\Users\\Patipol\\AppData\\Local\\Programs\\Python\\Python311\\Lib\\site-packages\\numpy\\lib\\arraysetops.py',
   'PYMODULE'),
  ('numpy.lib.utils',
   'C:\\Users\\Patipol\\AppData\\Local\\Programs\\Python\\Python311\\Lib\\site-packages\\numpy\\lib\\utils.py',
   'PYMODULE'),
  ('numpy.lib.polynomial',
   'C:\\Users\\Patipol\\AppData\\Local\\Programs\\Python\\Python311\\Lib\\site-packages\\numpy\\lib\\polynomial.py',
   'PYMODULE'),
  ('numpy.lib.ufunclike',
   'C:\\Users\\Patipol\\AppData\\Local\\Programs\\Python\\Python311\\Lib\\site-packages\\numpy\\lib\\ufunclike.py',
   'PYMODULE'),
  ('numpy.lib.shape_base',
   'C:\\Users\\Patipol\\AppData\\Local\\Programs\\Python\\Python311\\Lib\\site-packages\\numpy\\lib\\shape_base.py',
   'PYMODULE'),
  ('numpy.lib.nanfunctions',
   'C:\\Users\\Patipol\\AppData\\Local\\Programs\\Python\\Python311\\Lib\\site-packages\\numpy\\lib\\nanfunctions.py',
   'PYMODULE'),
  ('numpy.lib.type_check',
   'C:\\Users\\Patipol\\AppData\\Local\\Programs\\Python\\Python311\\Lib\\site-packages\\numpy\\lib\\type_check.py',
   'PYMODULE'),
  ('numpy.core.getlimits',
   'C:\\Users\\Patipol\\AppData\\Local\\Programs\\Python\\Python311\\Lib\\site-packages\\numpy\\core\\getlimits.py',
   'PYMODULE'),
  ('numpy.core._machar',
   'C:\\Users\\Patipol\\AppData\\Local\\Programs\\Python\\Python311\\Lib\\site-packages\\numpy\\core\\_machar.py',
   'PYMODULE'),
  ('numpy.lib.scimath',
   'C:\\Users\\Patipol\\AppData\\Local\\Programs\\Python\\Python311\\Lib\\site-packages\\numpy\\lib\\scimath.py',
   'PYMODULE'),
  ('numpy.lib.mixins',
   'C:\\Users\\Patipol\\AppData\\Local\\Programs\\Python\\Python311\\Lib\\site-packages\\numpy\\lib\\mixins.py',
   'PYMODULE'),
  ('numpy.compat',
   'C:\\Users\\Patipol\\AppData\\Local\\Programs\\Python\\Python311\\Lib\\site-packages\\numpy\\compat\\__init__.py',
   'PYMODULE'),
  ('numpy.compat.py3k',
   'C:\\Users\\Patipol\\AppData\\Local\\Programs\\Python\\Python311\\Lib\\site-packages\\numpy\\compat\\py3k.py',
   'PYMODULE'),
  ('numpy.compat._pep440',
   'C:\\Users\\Patipol\\AppData\\Local\\Programs\\Python\\Python311\\Lib\\site-packages\\numpy\\compat\\_pep440.py',
   'PYMODULE'),
  ('numpy.core',
   'C:\\Users\\Patipol\\AppData\\Local\\Programs\\Python\\Python311\\Lib\\site-packages\\numpy\\core\\__init__.py',
   'PYMODULE'),
  ('numpy.core._add_newdocs_scalars',
   'C:\\Users\\Patipol\\AppData\\Local\\Programs\\Python\\Python311\\Lib\\site-packages\\numpy\\core\\_add_newdocs_scalars.py',
   'PYMODULE'),
  ('numpy.core._add_newdocs',
   'C:\\Users\\Patipol\\AppData\\Local\\Programs\\Python\\Python311\\Lib\\site-packages\\numpy\\core\\_add_newdocs.py',
   'PYMODULE'),
  ('numpy.core.einsumfunc',
   'C:\\Users\\Patipol\\AppData\\Local\\Programs\\Python\\Python311\\Lib\\site-packages\\numpy\\core\\einsumfunc.py',
   'PYMODULE'),
  ('numpy.core.memmap',
   'C:\\Users\\Patipol\\AppData\\Local\\Programs\\Python\\Python311\\Lib\\site-packages\\numpy\\core\\memmap.py',
   'PYMODULE'),
  ('numpy.core.defchararray',
   'C:\\Users\\Patipol\\AppData\\Local\\Programs\\Python\\Python311\\Lib\\site-packages\\numpy\\core\\defchararray.py',
   'PYMODULE'),
  ('numpy._distributor_init',
   'C:\\Users\\Patipol\\AppData\\Local\\Programs\\Python\\Python311\\Lib\\site-packages\\numpy\\_distributor_init.py',
   'PYMODULE'),
  ('numpy.__config__',
   'C:\\Users\\Patipol\\AppData\\Local\\Programs\\Python\\Python311\\Lib\\site-packages\\numpy\\__config__.py',
   'PYMODULE'),
  ('numpy.array_api',
   'C:\\Users\\Patipol\\AppData\\Local\\Programs\\Python\\Python311\\Lib\\site-packages\\numpy\\array_api\\__init__.py',
   'PYMODULE'),
  ('numpy.array_api._utility_functions',
   'C:\\Users\\Patipol\\AppData\\Local\\Programs\\Python\\Python311\\Lib\\site-packages\\numpy\\array_api\\_utility_functions.py',
   'PYMODULE'),
  ('numpy.array_api._array_object',
   'C:\\Users\\Patipol\\AppData\\Local\\Programs\\Python\\Python311\\Lib\\site-packages\\numpy\\array_api\\_array_object.py',
   'PYMODULE'),
  ('numpy.typing',
   'C:\\Users\\Patipol\\AppData\\Local\\Programs\\Python\\Python311\\Lib\\site-packages\\numpy\\typing\\__init__.py',
   'PYMODULE'),
  ('numpy._typing._add_docstring',
   'C:\\Users\\Patipol\\AppData\\Local\\Programs\\Python\\Python311\\Lib\\site-packages\\numpy\\_typing\\_add_docstring.py',
   'PYMODULE'),
  ('numpy._typing._generic_alias',
   'C:\\Users\\Patipol\\AppData\\Local\\Programs\\Python\\Python311\\Lib\\site-packages\\numpy\\_typing\\_generic_alias.py',
   'PYMODULE'),
  ('numpy._typing',
   'C:\\Users\\Patipol\\AppData\\Local\\Programs\\Python\\Python311\\Lib\\site-packages\\numpy\\_typing\\__init__.py',
   'PYMODULE'),
  ('numpy._typing._array_like',
   'C:\\Users\\Patipol\\AppData\\Local\\Programs\\Python\\Python311\\Lib\\site-packages\\numpy\\_typing\\_array_like.py',
   'PYMODULE'),
  ('numpy._typing._dtype_like',
   'C:\\Users\\Patipol\\AppData\\Local\\Programs\\Python\\Python311\\Lib\\site-packages\\numpy\\_typing\\_dtype_like.py',
   'PYMODULE'),
  ('numpy._typing._shape',
   'C:\\Users\\Patipol\\AppData\\Local\\Programs\\Python\\Python311\\Lib\\site-packages\\numpy\\_typing\\_shape.py',
   'PYMODULE'),
  ('numpy._typing._scalars',
   'C:\\Users\\Patipol\\AppData\\Local\\Programs\\Python\\Python311\\Lib\\site-packages\\numpy\\_typing\\_scalars.py',
   'PYMODULE'),
  ('numpy._typing._char_codes',
   'C:\\Users\\Patipol\\AppData\\Local\\Programs\\Python\\Python311\\Lib\\site-packages\\numpy\\_typing\\_char_codes.py',
   'PYMODULE'),
  ('numpy._typing._nbit',
   'C:\\Users\\Patipol\\AppData\\Local\\Programs\\Python\\Python311\\Lib\\site-packages\\numpy\\_typing\\_nbit.py',
   'PYMODULE'),
  ('numpy._typing._nested_sequence',
   'C:\\Users\\Patipol\\AppData\\Local\\Programs\\Python\\Python311\\Lib\\site-packages\\numpy\\_typing\\_nested_sequence.py',
   'PYMODULE'),
  ('numpy.array_api._typing',
   'C:\\Users\\Patipol\\AppData\\Local\\Programs\\Python\\Python311\\Lib\\site-packages\\numpy\\array_api\\_typing.py',
   'PYMODULE'),
  ('numpy.array_api._statistical_functions',
   'C:\\Users\\Patipol\\AppData\\Local\\Programs\\Python\\Python311\\Lib\\site-packages\\numpy\\array_api\\_statistical_functions.py',
   'PYMODULE'),
  ('numpy.array_api._sorting_functions',
   'C:\\Users\\Patipol\\AppData\\Local\\Programs\\Python\\Python311\\Lib\\site-packages\\numpy\\array_api\\_sorting_functions.py',
   'PYMODULE'),
  ('numpy.array_api._set_functions',
   'C:\\Users\\Patipol\\AppData\\Local\\Programs\\Python\\Python311\\Lib\\site-packages\\numpy\\array_api\\_set_functions.py',
   'PYMODULE'),
  ('numpy.array_api._searching_functions',
   'C:\\Users\\Patipol\\AppData\\Local\\Programs\\Python\\Python311\\Lib\\site-packages\\numpy\\array_api\\_searching_functions.py',
   'PYMODULE'),
  ('numpy.array_api._manipulation_functions',
   'C:\\Users\\Patipol\\AppData\\Local\\Programs\\Python\\Python311\\Lib\\site-packages\\numpy\\array_api\\_manipulation_functions.py',
   'PYMODULE'),
  ('numpy.array_api.linalg',
   'C:\\Users\\Patipol\\AppData\\Local\\Programs\\Python\\Python311\\Lib\\site-packages\\numpy\\array_api\\linalg.py',
   'PYMODULE'),
  ('numpy.array_api._elementwise_functions',
   'C:\\Users\\Patipol\\AppData\\Local\\Programs\\Python\\Python311\\Lib\\site-packages\\numpy\\array_api\\_elementwise_functions.py',
   'PYMODULE'),
  ('numpy.array_api._dtypes',
   'C:\\Users\\Patipol\\AppData\\Local\\Programs\\Python\\Python311\\Lib\\site-packages\\numpy\\array_api\\_dtypes.py',
   'PYMODULE'),
  ('numpy.array_api._data_type_functions',
   'C:\\Users\\Patipol\\AppData\\Local\\Programs\\Python\\Python311\\Lib\\site-packages\\numpy\\array_api\\_data_type_functions.py',
   'PYMODULE'),
  ('numpy.array_api._creation_functions',
   'C:\\Users\\Patipol\\AppData\\Local\\Programs\\Python\\Python311\\Lib\\site-packages\\numpy\\array_api\\_creation_functions.py',
   'PYMODULE'),
  ('numpy.array_api._constants',
   'C:\\Users\\Patipol\\AppData\\Local\\Programs\\Python\\Python311\\Lib\\site-packages\\numpy\\array_api\\_constants.py',
   'PYMODULE'),
  ('numpy._globals',
   'C:\\Users\\Patipol\\AppData\\Local\\Programs\\Python\\Python311\\Lib\\site-packages\\numpy\\_globals.py',
   'PYMODULE'),
  ('PIL.PpmImagePlugin',
   'C:\\Users\\Patipol\\AppData\\Local\\Programs\\Python\\Python311\\Lib\\site-packages\\PIL\\PpmImagePlugin.py',
   'PYMODULE'),
  ('PIL.JpegImagePlugin',
   'C:\\Users\\Patipol\\AppData\\Local\\Programs\\Python\\Python311\\Lib\\site-packages\\PIL\\JpegImagePlugin.py',
   'PYMODULE'),
  ('PIL.JpegPresets',
   'C:\\Users\\Patipol\\AppData\\Local\\Programs\\Python\\Python311\\Lib\\site-packages\\PIL\\JpegPresets.py',
   'PYMODULE'),
  ('PIL.GifImagePlugin',
   'C:\\Users\\Patipol\\AppData\\Local\\Programs\\Python\\Python311\\Lib\\site-packages\\PIL\\GifImagePlugin.py',
   'PYMODULE'),
  ('PIL.TiffTags',
   'C:\\Users\\Patipol\\AppData\\Local\\Programs\\Python\\Python311\\Lib\\site-packages\\PIL\\TiffTags.py',
   'PYMODULE'),
  ('PIL.ImageMode',
   'C:\\Users\\Patipol\\AppData\\Local\\Programs\\Python\\Python311\\Lib\\site-packages\\PIL\\ImageMode.py',
   'PYMODULE'),
  ('PIL',
   'C:\\Users\\Patipol\\AppData\\Local\\Programs\\Python\\Python311\\Lib\\site-packages\\PIL\\__init__.py',
   'PYMODULE'),
  ('PIL.ImageDraw2',
   'C:\\Users\\Patipol\\AppData\\Local\\Programs\\Python\\Python311\\Lib\\site-packages\\PIL\\ImageDraw2.py',
   'PYMODULE'),
  ('PIL.ImagePath',
   'C:\\Users\\Patipol\\AppData\\Local\\Programs\\Python\\Python311\\Lib\\site-packages\\PIL\\ImagePath.py',
   'PYMODULE'),
  ('PIL.ImageDraw',
   'C:\\Users\\Patipol\\AppData\\Local\\Programs\\Python\\Python311\\Lib\\site-packages\\PIL\\ImageDraw.py',
   'PYMODULE'),
  ('PIL.ImageFont',
   'C:\\Users\\Patipol\\AppData\\Local\\Programs\\Python\\Python311\\Lib\\site-packages\\PIL\\ImageFont.py',
   'PYMODULE'),
  ('PIL._version',
   'C:\\Users\\Patipol\\AppData\\Local\\Programs\\Python\\Python311\\Lib\\site-packages\\PIL\\_version.py',
   'PYMODULE'),
  ('pyperclip',
   'C:\\Users\\Patipol\\AppData\\Local\\Programs\\Python\\Python311\\Lib\\site-packages\\pyperclip\\__init__.py',
   'PYMODULE'),
  ('pyscreeze',
   'C:\\Users\\Patipol\\AppData\\Local\\Programs\\Python\\Python311\\Lib\\site-packages\\pyscreeze\\__init__.py',
   'PYMODULE'),
  ('pymsgbox',
   'C:\\Users\\Patipol\\AppData\\Local\\Programs\\Python\\Python311\\Lib\\site-packages\\pymsgbox\\__init__.py',
   'PYMODULE'),
  ('pymsgbox._native_win',
   'C:\\Users\\Patipol\\AppData\\Local\\Programs\\Python\\Python311\\Lib\\site-packages\\pymsgbox\\_native_win.py',
   'PYMODULE'),
  ('pytweening',
   'C:\\Users\\Patipol\\AppData\\Local\\Programs\\Python\\Python311\\Lib\\site-packages\\pytweening\\__init__.py',
   'PYMODULE'),
  ('platform',
   'C:\\Users\\Patipol\\AppData\\Local\\Programs\\Python\\Python311\\Lib\\platform.py',
   'PYMODULE'),
  ('__future__',
   'C:\\Users\\Patipol\\AppData\\Local\\Programs\\Python\\Python311\\Lib\\__future__.py',
   'PYMODULE'),
  ('package1', '-', 'PYMODULE')])
