module gitlab.com/patipol.thamdee/adeptus-notificus

go 1.19

require (
	github.com/bwmarrin/discordgo v0.26.1 // indirect
	github.com/go-co-op/gocron v1.17.0 // indirect
	github.com/gorilla/websocket v1.4.2 // indirect
	github.com/robfig/cron/v3 v3.0.1 // indirect
	golang.org/x/crypto v0.0.0-20210421170649-83a5a9bb288b // indirect
	golang.org/x/sync v0.0.0-20210220032951-036812b2e83c // indirect
	golang.org/x/sys v0.0.0-20201119102817-f84b799fce68 // indirect
)
