[
  {
    "name": "Jason",
    "age": 20,
    "attributes": {
      "happy": true,
      "healthy": false,
      "busy": true
    }
  },
  {
    "name": "Jack",
    "age": 20,
    "attributes": {
      "happy": true,
      "healthy": false,
      "busy": true
    }
  },
  {
    "name": "Jamie",
    "age": 20,
    "attributes": {
      "happy": true,
      "healthy": true,
      "busy": true
    }
  }
]