{
  "component": {
    "tab": {
      "paddingHorizontal": {
        "value": "{padding.md}",
        "type": "spacing"
      },
      "paddingVerticalMd": {
        "value": "{padding.md}",
        "type": "spacing"
      },
      "paddingVerticalXs": {
        "value": "{padding.xs}",
        "type": "spacing"
      },
      "paddingContent": {
        "value": "{padding.xs}",
        "type": "spacing"
      },
      "colorPrimaryBgDefault": {
        "value": "{primary.colorPrimaryBg}",
        "type": "color"
      },
      "colorPrimaryBgHover": {
        "value": "{light.colorLightHover}",
        "type": "color"
      },
      "colorTextDefault": {
        "value": "{text.colorText}",
        "type": "color"
      },
      "colorTextActive": {
        "value": "{primary.colorPrimaryBase}",
        "type": "color"
      },
      "colorTextDisable": {
        "value": "{text.colorTextDisable}",
        "type": "color"
      },
      "colorIconDefault": {
        "value": "{text.colorDescription}",
        "type": "color"
      },
      "colorPrimaryBorder": {
        "value": "{primary.colorPrimaryBase}",
        "type": "color"
      },
      "borderRadius": {
        "value": "{borderRadius.sm}",
        "type": "borderRadius"
      },
      "borderWidth": {
        "value": "{borderWidth.bold}",
        "type": "borderWidth"
      }
    }
  }
}