{
  "fontFamilies": {
    "base": {
      "value": "Kanit",
      "type": "fontFamilies"
    }
  },
  "fontWeight": {
    "fontWeightNormal": {
      "value": "Regular",
      "type": "fontWeights"
    },
    "fontWeightStrong": {
      "value": "SemiBold",
      "type": "fontWeights"
    }
  },
  "fontScale": {
    "base": {
      "value": "16",
      "type": "fontSizes"
    },
    "typeScale": {
      "value": "1.125",
      "type": "fontSizes"
    },
    "scale10": {
      "value": "{fontScale.base}",
      "type": "fontSizes"
    },
    "scale09": {
      "value": "{fontScale.base}/{fontScale.typeScale}",
      "type": "fontSizes"
    },
    "scale08": {
      "value": "{fontScale.scale09}/{fontScale.typeScale}",
      "type": "fontSizes"
    },
    "scale07": {
      "value": "{fontScale.scale08}/{fontScale.typeScale}",
      "type": "fontSizes"
    },
    "scale06": {
      "value": "{fontScale.scale07}/{fontScale.typeScale}",
      "type": "fontSizes"
    },
    "scale05": {
      "value": "{fontScale.scale06}/{fontScale.typeScale}",
      "type": "fontSizes"
    },
    "scale11": {
      "value": "{fontScale.scale10}*{fontScale.typeScale}",
      "type": "fontSizes"
    },
    "scale12": {
      "value": "{fontScale.scale11}*{fontScale.typeScale}",
      "type": "fontSizes"
    },
    "scale13": {
      "value": "{fontScale.scale12}* {fontScale.typeScale}",
      "type": "fontSizes"
    },
    "scale14": {
      "value": "{fontScale.scale13}* {fontScale.typeScale}",
      "type": "fontSizes"
    },
    "scale15": {
      "value": "{fontScale.scale14}* {fontScale.typeScale}",
      "type": "fontSizes"
    },
    "scale16": {
      "value": "{fontScale.scale15}* {fontScale.typeScale}",
      "type": "fontSizes"
    },
    "scale17": {
      "value": "{fontScale.scale16}*{fontScale.typeScale}",
      "type": "fontSizes"
    },
    "scale18": {
      "value": "{fontScale.scale17}* {fontScale.typeScale}",
      "type": "fontSizes"
    },
    "scale19": {
      "value": "{fontScale.scale18}*{fontScale.typeScale}",
      "type": "fontSizes"
    },
    "scale20": {
      "value": "{fontScale.scale19}* {fontScale.typeScale}",
      "type": "fontSizes"
    },
    "scale21": {
      "value": "{fontScale.scale20}*{fontScale.typeScale}",
      "type": "fontSizes"
    },
    "scale22": {
      "value": "{fontScale.scale21}*{fontScale.typeScale}",
      "type": "fontSizes"
    }
  },
  "fontSize": {
    "display1": {
      "value": "roundTo({fontScale.scale21})",
      "type": "fontSizes"
    },
    "display2": {
      "value": "roundTo({fontScale.scale20})",
      "type": "fontSizes"
    },
    "display3": {
      "value": "roundTo({fontScale.scale19})",
      "type": "fontSizes"
    },
    "display4": {
      "value": "roundTo({fontScale.scale18})",
      "type": "fontSizes"
    },
    "head1": {
      "value": "roundTo({fontScale.scale16})",
      "type": "fontSizes"
    },
    "head2": {
      "value": "floor({fontScale.scale15})",
      "type": "fontSizes"
    },
    "head3": {
      "value": "roundTo({fontScale.scale14})",
      "type": "fontSizes"
    },
    "head4": {
      "value": "floor({fontScale.scale13})",
      "type": "fontSizes"
    },
    "head5": {
      "value": "roundTo({fontScale.scale12})",
      "type": "fontSizes"
    },
    "title1": {
      "value": "roundTo({fontScale.scale11})",
      "type": "fontSizes"
    },
    "title2": {
      "value": "roundTo({fontScale.scale10})",
      "type": "fontSizes"
    },
    "body1": {
      "value": "{fontScale.scale10}",
      "type": "fontSizes"
    },
    "body2": {
      "value": "roundTo({fontScale.scale09})",
      "type": "fontSizes"
    },
    "body3": {
      "value": "floor({fontScale.scale08})",
      "type": "fontSizes"
    },
    "body4": {
      "value": "roundTo({fontScale.scale06})",
      "type": "fontSizes"
    }
  },
  "lineHeight": {
    "dispMultiple": {
      "value": "1.4",
      "type": "lineHeights"
    },
    "headMultiple": {
      "value": "1.6",
      "type": "lineHeights"
    },
    "textMultiple": {
      "value": "1.5",
      "type": "lineHeights"
    },
    "display1": {
      "value": "2*roundTo(({fontSize.display1}*{lineHeight.dispMultiple})/2)",
      "type": "lineHeights"
    },
    "display2": {
      "value": "2*roundTo(({fontSize.display2}*{lineHeight.dispMultiple})/2)",
      "type": "lineHeights"
    },
    "display3": {
      "value": "2*roundTo(({fontSize.display3}*{lineHeight.dispMultiple})/2)",
      "type": "lineHeights"
    },
    "display4": {
      "value": "2*roundTo(({fontSize.display4}*{lineHeight.dispMultiple})/2)",
      "type": "lineHeights"
    },
    "head1": {
      "value": "2*roundTo(({fontSize.head1}*{lineHeight.headMultiple})/2)",
      "type": "lineHeights"
    },
    "head2": {
      "value": "2*roundTo(({fontSize.head2}*{lineHeight.headMultiple})/2)",
      "type": "lineHeights"
    },
    "head3": {
      "value": "2*roundTo(({fontSize.head3}*{lineHeight.headMultiple})/2)",
      "type": "lineHeights"
    },
    "head4": {
      "value": "2*roundTo(({fontSize.head4}*{lineHeight.headMultiple})/2)",
      "type": "lineHeights"
    },
    "head5": {
      "value": "2*roundTo(({fontSize.head5}*{lineHeight.headMultiple})/2)",
      "type": "lineHeights"
    },
    "title1": {
      "value": "2*roundTo(({fontSize.title1}*{lineHeight.headMultiple})/2)",
      "type": "lineHeights"
    },
    "title2": {
      "value": "2*roundTo(({fontSize.title2}*{lineHeight.headMultiple})/2)",
      "type": "lineHeights"
    },
    "body1": {
      "value": "2*roundTo(({fontSize.body1}*{lineHeight.textMultiple})/2)",
      "type": "lineHeights"
    },
    "body2": {
      "value": "2*roundTo(({fontSize.body2}*{lineHeight.textMultiple})/2)",
      "type": "lineHeights"
    },
    "body3": {
      "value": "2*roundTo(({fontSize.body3}*{lineHeight.textMultiple})/2)",
      "type": "lineHeights"
    },
    "body4": {
      "value": "2*roundTo(({fontSize.body4}*{lineHeight.textMultiple})/2)",
      "type": "lineHeights"
    }
  },
  "letterSpacing": {
    "display": {
      "value": "0%",
      "type": "letterSpacing"
    },
    "head": {
      "value": "0%",
      "type": "letterSpacing"
    },
    "text": {
      "value": "0%",
      "type": "letterSpacing"
    }
  },
  "paragraphSpacing": {
    "display": {
      "value": "0",
      "type": "paragraphSpacing"
    },
    "head": {
      "value": "0",
      "type": "paragraphSpacing"
    },
    "text": {
      "value": "0",
      "type": "paragraphSpacing"
    }
  }
}