{
  "component": {
    "button": {
      "controlHeightSm": {
        "value": "24",
        "type": "sizing"
      },
      "controlHeightMd": {
        "value": "38",
        "type": "sizing"
      },
      "controlHeightLg": {
        "value": "46",
        "type": "sizing"
      },
      "paddingHorizontalSm": {
        "value": "{padding.xs}",
        "type": "spacing"
      },
      "paddingHorizontalMd": {
        "value": "{padding.md}",
        "type": "spacing"
      },
      "paddingHorizontalLg": {
        "value": "{padding.md}",
        "type": "spacing"
      },
      "paddingVerticalMd": {
        "value": "{padding.xxs}",
        "type": "spacing"
      },
      "paddingVerticalLg": {
        "value": "{padding.xs}",
        "type": "spacing"
      },
      "borderRadiusMd": {
        "value": "{borderRadius.xs}",
        "type": "borderRadius"
      },
      "borderRadiusLg": {
        "value": "{borderRadius.sm}",
        "type": "borderRadius"
      },
      "focusedPrimary": {
        "value": "{state.focused.primary}",
        "type": "boxShadow"
      },
      "colorPrimaryBgDefault": {
        "value": "{primary.colorPrimaryBase}",
        "type": "color"
      },
      "colorPrimaryBgHover": {
        "value": "{primary.colorPrimaryHover}",
        "type": "color"
      },
      "colorPrimaryBgPress": {
        "value": "{primary.colorPrimaryActive}",
        "type": "color"
      },
      "colorSecondaryBgDefault": {
        "value": "{primary.colorPrimaryBg}",
        "type": "color"
      },
      "colorSecondaryBgHover": {
        "value": "{primary.colorPrimaryBgHover}",
        "type": "color"
      },
      "colorSecondaryBgPress": {
        "value": "{primary.colorPrimaryBorder}",
        "type": "color"
      },
      "colorWhiteBgDefault": {
        "value": "{light.colorLightBg}",
        "type": "color"
      },
      "borderWidth": {
        "value": "{borderWidth.regular}",
        "type": "borderWidth"
      },
      "colorDangerBgDefault": {
        "value": "{error.colorErrorBase}",
        "type": "color"
      },
      "colorDangerBgHover": {
        "value": "{error.colorErrorHover}",
        "type": "color"
      },
      "colorDangerBgPress": {
        "value": "{red.500}",
        "type": "color"
      },
      "colorDangerSecondaryBgDefault": {
        "value": "{error.colorErrorBg}",
        "type": "color"
      },
      "colorDangerSecondaryBgHover": {
        "value": "{error.colorErrorBgHover}",
        "type": "color"
      },
      "colorDangerSecondaryBgPress": {
        "value": "{error.colorErrorBorder}",
        "type": "color"
      },
      "focusedDanger": {
        "value": "{state.focused.red}",
        "type": "boxShadow"
      },
      "borderRadiusRound": {
        "value": "{borderRadius.max}",
        "type": "borderRadius"
      },
      "colorTextLight": {
        "value": "{text.colorTextWhite}",
        "type": "color"
      },
      "colorTextDark": {
        "value": "{text.colorText}",
        "type": "color"
      },
      "colorTextPrimaryDefault": {
        "value": "{primary.colorPrimaryBase}",
        "type": "color"
      },
      "colorTextPrimaryHover": {
        "value": "{primary.colorPrimaryHover}",
        "type": "color"
      },
      "colorTextPrimaryPress": {
        "value": "{primary.colorPrimaryActive}",
        "type": "color"
      },
      "colorTextDangerDefault": {
        "value": "{error.colorErrorBase}",
        "type": "color"
      },
      "colorTextDangerHover": {
        "value": "{error.colorErrorHover}",
        "type": "color"
      },
      "colorTextDangerPress": {
        "value": "{red.500}",
        "type": "color"
      },
      "colorTextDisable": {
        "value": "{text.colorTextDisable}",
        "type": "color"
      },
      "colorDisableBg": {
        "value": "{light.colorLightDisable}",
        "type": "color"
      },
      "colorWhiteBorder": {
        "value": "{light.colorLightBorder}",
        "type": "color"
      },
      "colorPrimaryBorderDefault": {
        "value": "{primary.colorPrimaryBase}",
        "type": "color"
      },
      "colorPrimaryBorderPress": {
        "value": "{primary.colorPrimaryActive}",
        "type": "color"
      },
      "colorPrimaryBorderHover": {
        "value": "{primary.colorPrimaryHover}",
        "type": "color"
      },
      "colorDangerBorderDefault": {
        "value": "{error.colorErrorBase}",
        "type": "color"
      },
      "colorDangerBorderHover": {
        "value": "{error.colorErrorHover}",
        "type": "color"
      },
      "colorDangerBorderPress": {
        "value": "{red.500}",
        "type": "color"
      },
      "colorDisableBorder": {
        "value": "{light.colorLightBorder}",
        "type": "color"
      },
      "paddingContent": {
        "value": "{padding.xs}",
        "type": "spacing"
      }
    }
  }
}