G04 #@! TF.GenerationSoftware,KiCad,Pcbnew,(5.0.2)-1*
G04 #@! TF.CreationDate,2019-07-24T01:21:19+02:00*
G04 #@! TF.ProjectId,Cern2,4365726e-322e-46b6-9963-61645f706362,rev?*
G04 #@! TF.SameCoordinates,Original*
G04 #@! TF.FileFunction,Soldermask,Bot*
G04 #@! TF.FilePolarity,Negative*
%FSLAX46Y46*%
G04 Gerber Fmt 4.6, Leading zero omitted, Abs format (unit mm)*
G04 Created by KiCad (PCBNEW (5.0.2)-1) date 24/07/2019 01:21:19*
%MOMM*%
%LPD*%
G01*
G04 APERTURE LIST*
%ADD10C,0.100000*%
G04 APERTURE END LIST*
D10*
G36*
X92943643Y-86859781D02*
X93089415Y-86920162D01*
X93220611Y-87007824D01*
X93332176Y-87119389D01*
X93419838Y-87250585D01*
X93480219Y-87396357D01*
X93511000Y-87551107D01*
X93511000Y-87708893D01*
X93480219Y-87863643D01*
X93419838Y-88009415D01*
X93332176Y-88140611D01*
X93220611Y-88252176D01*
X93089415Y-88339838D01*
X92943643Y-88400219D01*
X92788893Y-88431000D01*
X92631107Y-88431000D01*
X92476357Y-88400219D01*
X92330585Y-88339838D01*
X92199389Y-88252176D01*
X92087824Y-88140611D01*
X92000162Y-88009415D01*
X91939781Y-87863643D01*
X91909000Y-87708893D01*
X91909000Y-87551107D01*
X91939781Y-87396357D01*
X92000162Y-87250585D01*
X92087824Y-87119389D01*
X92199389Y-87007824D01*
X92330585Y-86920162D01*
X92476357Y-86859781D01*
X92631107Y-86829000D01*
X92788893Y-86829000D01*
X92943643Y-86859781D01*
X92943643Y-86859781D01*
G37*
G36*
X73770442Y-85465518D02*
X73836627Y-85472037D01*
X73949853Y-85506384D01*
X74006467Y-85523557D01*
X74145087Y-85597652D01*
X74162991Y-85607222D01*
X74198729Y-85636552D01*
X74300186Y-85719814D01*
X74365858Y-85799837D01*
X74412778Y-85857009D01*
X74412779Y-85857011D01*
X74496443Y-86013533D01*
X74496443Y-86013534D01*
X74547963Y-86183373D01*
X74565359Y-86360000D01*
X74547963Y-86536627D01*
X74513616Y-86649853D01*
X74496443Y-86706467D01*
X74430947Y-86829000D01*
X74412778Y-86862991D01*
X74383448Y-86898729D01*
X74300186Y-87000186D01*
X74198729Y-87083448D01*
X74162991Y-87112778D01*
X74162989Y-87112779D01*
X74006467Y-87196443D01*
X73949853Y-87213616D01*
X73836627Y-87247963D01*
X73770442Y-87254482D01*
X73704260Y-87261000D01*
X73615740Y-87261000D01*
X73549558Y-87254482D01*
X73483373Y-87247963D01*
X73370147Y-87213616D01*
X73313533Y-87196443D01*
X73157011Y-87112779D01*
X73157009Y-87112778D01*
X73121271Y-87083448D01*
X73019814Y-87000186D01*
X72936552Y-86898729D01*
X72907222Y-86862991D01*
X72889053Y-86829000D01*
X72823557Y-86706467D01*
X72806384Y-86649853D01*
X72772037Y-86536627D01*
X72754641Y-86360000D01*
X72772037Y-86183373D01*
X72823557Y-86013534D01*
X72823557Y-86013533D01*
X72907221Y-85857011D01*
X72907222Y-85857009D01*
X72954142Y-85799837D01*
X73019814Y-85719814D01*
X73121271Y-85636552D01*
X73157009Y-85607222D01*
X73174913Y-85597652D01*
X73313533Y-85523557D01*
X73370147Y-85506384D01*
X73483373Y-85472037D01*
X73549558Y-85465518D01*
X73615740Y-85459000D01*
X73704260Y-85459000D01*
X73770442Y-85465518D01*
X73770442Y-85465518D01*
G37*
G36*
X92943643Y-84319781D02*
X93089415Y-84380162D01*
X93220611Y-84467824D01*
X93332176Y-84579389D01*
X93419838Y-84710585D01*
X93480219Y-84856357D01*
X93511000Y-85011107D01*
X93511000Y-85168893D01*
X93480219Y-85323643D01*
X93419838Y-85469415D01*
X93332176Y-85600611D01*
X93220611Y-85712176D01*
X93089415Y-85799838D01*
X92943643Y-85860219D01*
X92788893Y-85891000D01*
X92631107Y-85891000D01*
X92476357Y-85860219D01*
X92330585Y-85799838D01*
X92199389Y-85712176D01*
X92087824Y-85600611D01*
X92000162Y-85469415D01*
X91939781Y-85323643D01*
X91909000Y-85168893D01*
X91909000Y-85011107D01*
X91939781Y-84856357D01*
X92000162Y-84710585D01*
X92087824Y-84579389D01*
X92199389Y-84467824D01*
X92330585Y-84380162D01*
X92476357Y-84319781D01*
X92631107Y-84289000D01*
X92788893Y-84289000D01*
X92943643Y-84319781D01*
X92943643Y-84319781D01*
G37*
G36*
X118373567Y-82334959D02*
X118504072Y-82360918D01*
X118749939Y-82462759D01*
X118970464Y-82610110D01*
X118971215Y-82610612D01*
X119159388Y-82798785D01*
X119159390Y-82798788D01*
X119307241Y-83020061D01*
X119409082Y-83265928D01*
X119461000Y-83526938D01*
X119461000Y-83793062D01*
X119409082Y-84054072D01*
X119307241Y-84299939D01*
X119195064Y-84467822D01*
X119159388Y-84521215D01*
X118971215Y-84709388D01*
X118971212Y-84709390D01*
X118749939Y-84857241D01*
X118504072Y-84959082D01*
X118373567Y-84985041D01*
X118243063Y-85011000D01*
X117976937Y-85011000D01*
X117846433Y-84985041D01*
X117715928Y-84959082D01*
X117470061Y-84857241D01*
X117248788Y-84709390D01*
X117248785Y-84709388D01*
X117060612Y-84521215D01*
X117024936Y-84467822D01*
X116912759Y-84299939D01*
X116810918Y-84054072D01*
X116759000Y-83793062D01*
X116759000Y-83526938D01*
X116810918Y-83265928D01*
X116912759Y-83020061D01*
X117060610Y-82798788D01*
X117060612Y-82798785D01*
X117248785Y-82610612D01*
X117249536Y-82610110D01*
X117470061Y-82462759D01*
X117715928Y-82360918D01*
X117846433Y-82334959D01*
X117976937Y-82309000D01*
X118243063Y-82309000D01*
X118373567Y-82334959D01*
X118373567Y-82334959D01*
G37*
G36*
X74561000Y-84721000D02*
X72759000Y-84721000D01*
X72759000Y-82919000D01*
X74561000Y-82919000D01*
X74561000Y-84721000D01*
X74561000Y-84721000D01*
G37*
G36*
X93511000Y-83351000D02*
X91909000Y-83351000D01*
X91909000Y-81749000D01*
X93511000Y-81749000D01*
X93511000Y-83351000D01*
X93511000Y-83351000D01*
G37*
G36*
X106866425Y-79072760D02*
X106866428Y-79072761D01*
X106866429Y-79072761D01*
X107045693Y-79127140D01*
X107045695Y-79127141D01*
X107210905Y-79215448D01*
X107355712Y-79334288D01*
X107474552Y-79479095D01*
X107562859Y-79644305D01*
X107562860Y-79644307D01*
X107617239Y-79823571D01*
X107617240Y-79823575D01*
X107635601Y-80010000D01*
X107617240Y-80196425D01*
X107617239Y-80196428D01*
X107617239Y-80196429D01*
X107598493Y-80258228D01*
X107562859Y-80375695D01*
X107474552Y-80540905D01*
X107355712Y-80685712D01*
X107210905Y-80804552D01*
X107105299Y-80861000D01*
X107045693Y-80892860D01*
X106866429Y-80947239D01*
X106866428Y-80947239D01*
X106866425Y-80947240D01*
X106726718Y-80961000D01*
X106633282Y-80961000D01*
X106493575Y-80947240D01*
X106493572Y-80947239D01*
X106493571Y-80947239D01*
X106314307Y-80892860D01*
X106254701Y-80861000D01*
X106149095Y-80804552D01*
X106004288Y-80685712D01*
X105885448Y-80540905D01*
X105797141Y-80375695D01*
X105761508Y-80258228D01*
X105742761Y-80196429D01*
X105742761Y-80196428D01*
X105742760Y-80196425D01*
X105724399Y-80010000D01*
X105742760Y-79823575D01*
X105742761Y-79823571D01*
X105797140Y-79644307D01*
X105797141Y-79644305D01*
X105885448Y-79479095D01*
X106004288Y-79334288D01*
X106149095Y-79215448D01*
X106314305Y-79127141D01*
X106314307Y-79127140D01*
X106493571Y-79072761D01*
X106493572Y-79072761D01*
X106493575Y-79072760D01*
X106633282Y-79059000D01*
X106726718Y-79059000D01*
X106866425Y-79072760D01*
X106866425Y-79072760D01*
G37*
G36*
X100011000Y-80961000D02*
X98109000Y-80961000D01*
X98109000Y-79059000D01*
X100011000Y-79059000D01*
X100011000Y-80961000D01*
X100011000Y-80961000D01*
G37*
G36*
X89148228Y-79191703D02*
X89303100Y-79255853D01*
X89442481Y-79348985D01*
X89561015Y-79467519D01*
X89654147Y-79606900D01*
X89718297Y-79761772D01*
X89751000Y-79926184D01*
X89751000Y-80093816D01*
X89718297Y-80258228D01*
X89654147Y-80413100D01*
X89561015Y-80552481D01*
X89442481Y-80671015D01*
X89303100Y-80764147D01*
X89148228Y-80828297D01*
X88983816Y-80861000D01*
X88816184Y-80861000D01*
X88651772Y-80828297D01*
X88496900Y-80764147D01*
X88357519Y-80671015D01*
X88238985Y-80552481D01*
X88145853Y-80413100D01*
X88081703Y-80258228D01*
X88049000Y-80093816D01*
X88049000Y-79926184D01*
X88081703Y-79761772D01*
X88145853Y-79606900D01*
X88238985Y-79467519D01*
X88357519Y-79348985D01*
X88496900Y-79255853D01*
X88651772Y-79191703D01*
X88816184Y-79159000D01*
X88983816Y-79159000D01*
X89148228Y-79191703D01*
X89148228Y-79191703D01*
G37*
G36*
X78906821Y-79171313D02*
X78906824Y-79171314D01*
X78906825Y-79171314D01*
X79067239Y-79219975D01*
X79067241Y-79219976D01*
X79067244Y-79219977D01*
X79215078Y-79298995D01*
X79344659Y-79405341D01*
X79451005Y-79534922D01*
X79530023Y-79682756D01*
X79530024Y-79682759D01*
X79530025Y-79682761D01*
X79572739Y-79823571D01*
X79578687Y-79843179D01*
X79595117Y-80010000D01*
X79578687Y-80176821D01*
X79578686Y-80176824D01*
X79578686Y-80176825D01*
X79553993Y-80258228D01*
X79530023Y-80337244D01*
X79451005Y-80485078D01*
X79344659Y-80614659D01*
X79215078Y-80721005D01*
X79067244Y-80800023D01*
X79067241Y-80800024D01*
X79067239Y-80800025D01*
X78906825Y-80848686D01*
X78906824Y-80848686D01*
X78906821Y-80848687D01*
X78781804Y-80861000D01*
X78698196Y-80861000D01*
X78573179Y-80848687D01*
X78573176Y-80848686D01*
X78573175Y-80848686D01*
X78412761Y-80800025D01*
X78412759Y-80800024D01*
X78412756Y-80800023D01*
X78264922Y-80721005D01*
X78135341Y-80614659D01*
X78028995Y-80485078D01*
X77949977Y-80337244D01*
X77926008Y-80258228D01*
X77901314Y-80176825D01*
X77901314Y-80176824D01*
X77901313Y-80176821D01*
X77884883Y-80010000D01*
X77901313Y-79843179D01*
X77907261Y-79823571D01*
X77949975Y-79682761D01*
X77949976Y-79682759D01*
X77949977Y-79682756D01*
X78028995Y-79534922D01*
X78135341Y-79405341D01*
X78264922Y-79298995D01*
X78412756Y-79219977D01*
X78412759Y-79219976D01*
X78412761Y-79219975D01*
X78573175Y-79171314D01*
X78573176Y-79171314D01*
X78573179Y-79171313D01*
X78698196Y-79159000D01*
X78781804Y-79159000D01*
X78906821Y-79171313D01*
X78906821Y-79171313D01*
G37*
G36*
X118373567Y-77334959D02*
X118504072Y-77360918D01*
X118749939Y-77462759D01*
X118970464Y-77610110D01*
X118971215Y-77610612D01*
X119159388Y-77798785D01*
X119159390Y-77798788D01*
X119307241Y-78020061D01*
X119409082Y-78265928D01*
X119461000Y-78526938D01*
X119461000Y-78793062D01*
X119409082Y-79054072D01*
X119307241Y-79299939D01*
X119159890Y-79520464D01*
X119159388Y-79521215D01*
X118971215Y-79709388D01*
X118971212Y-79709390D01*
X118749939Y-79857241D01*
X118504072Y-79959082D01*
X118373567Y-79985041D01*
X118243063Y-80011000D01*
X117976937Y-80011000D01*
X117846433Y-79985041D01*
X117715928Y-79959082D01*
X117470061Y-79857241D01*
X117248788Y-79709390D01*
X117248785Y-79709388D01*
X117060612Y-79521215D01*
X117060110Y-79520464D01*
X116912759Y-79299939D01*
X116810918Y-79054072D01*
X116759000Y-78793062D01*
X116759000Y-78526938D01*
X116810918Y-78265928D01*
X116912759Y-78020061D01*
X117060610Y-77798788D01*
X117060612Y-77798785D01*
X117248785Y-77610612D01*
X117249536Y-77610110D01*
X117470061Y-77462759D01*
X117715928Y-77360918D01*
X117846433Y-77334959D01*
X117976937Y-77309000D01*
X118243063Y-77309000D01*
X118373567Y-77334959D01*
X118373567Y-77334959D01*
G37*
G36*
X119461000Y-75011000D02*
X116759000Y-75011000D01*
X116759000Y-72309000D01*
X119461000Y-72309000D01*
X119461000Y-75011000D01*
X119461000Y-75011000D01*
G37*
G36*
X109468228Y-71571703D02*
X109623100Y-71635853D01*
X109762481Y-71728985D01*
X109881015Y-71847519D01*
X109974147Y-71986900D01*
X110038297Y-72141772D01*
X110071000Y-72306184D01*
X110071000Y-72473816D01*
X110038297Y-72638228D01*
X109974147Y-72793100D01*
X109881015Y-72932481D01*
X109762481Y-73051015D01*
X109623100Y-73144147D01*
X109468228Y-73208297D01*
X109303816Y-73241000D01*
X109136184Y-73241000D01*
X108971772Y-73208297D01*
X108816900Y-73144147D01*
X108677519Y-73051015D01*
X108558985Y-72932481D01*
X108465853Y-72793100D01*
X108401703Y-72638228D01*
X108369000Y-72473816D01*
X108369000Y-72306184D01*
X108401703Y-72141772D01*
X108465853Y-71986900D01*
X108558985Y-71847519D01*
X108677519Y-71728985D01*
X108816900Y-71635853D01*
X108971772Y-71571703D01*
X109136184Y-71539000D01*
X109303816Y-71539000D01*
X109468228Y-71571703D01*
X109468228Y-71571703D01*
G37*
G36*
X99226821Y-71551313D02*
X99226824Y-71551314D01*
X99226825Y-71551314D01*
X99387239Y-71599975D01*
X99387241Y-71599976D01*
X99387244Y-71599977D01*
X99535078Y-71678995D01*
X99664659Y-71785341D01*
X99771005Y-71914922D01*
X99850023Y-72062756D01*
X99850024Y-72062759D01*
X99850025Y-72062761D01*
X99878417Y-72156357D01*
X99898687Y-72223179D01*
X99915117Y-72390000D01*
X99898687Y-72556821D01*
X99898686Y-72556824D01*
X99898686Y-72556825D01*
X99873993Y-72638228D01*
X99850023Y-72717244D01*
X99771005Y-72865078D01*
X99664659Y-72994659D01*
X99535078Y-73101005D01*
X99387244Y-73180023D01*
X99387241Y-73180024D01*
X99387239Y-73180025D01*
X99226825Y-73228686D01*
X99226824Y-73228686D01*
X99226821Y-73228687D01*
X99101804Y-73241000D01*
X99018196Y-73241000D01*
X98893179Y-73228687D01*
X98893176Y-73228686D01*
X98893175Y-73228686D01*
X98732761Y-73180025D01*
X98732759Y-73180024D01*
X98732756Y-73180023D01*
X98584922Y-73101005D01*
X98455341Y-72994659D01*
X98348995Y-72865078D01*
X98269977Y-72717244D01*
X98246008Y-72638228D01*
X98221314Y-72556825D01*
X98221314Y-72556824D01*
X98221313Y-72556821D01*
X98204883Y-72390000D01*
X98221313Y-72223179D01*
X98241583Y-72156357D01*
X98269975Y-72062761D01*
X98269976Y-72062759D01*
X98269977Y-72062756D01*
X98348995Y-71914922D01*
X98455341Y-71785341D01*
X98584922Y-71678995D01*
X98732756Y-71599977D01*
X98732759Y-71599976D01*
X98732761Y-71599975D01*
X98893175Y-71551314D01*
X98893176Y-71551314D01*
X98893179Y-71551313D01*
X99018196Y-71539000D01*
X99101804Y-71539000D01*
X99226821Y-71551313D01*
X99226821Y-71551313D01*
G37*
G36*
X75178228Y-71571703D02*
X75333100Y-71635853D01*
X75472481Y-71728985D01*
X75591015Y-71847519D01*
X75684147Y-71986900D01*
X75748297Y-72141772D01*
X75781000Y-72306184D01*
X75781000Y-72473816D01*
X75748297Y-72638228D01*
X75684147Y-72793100D01*
X75591015Y-72932481D01*
X75472481Y-73051015D01*
X75333100Y-73144147D01*
X75178228Y-73208297D01*
X75013816Y-73241000D01*
X74846184Y-73241000D01*
X74681772Y-73208297D01*
X74526900Y-73144147D01*
X74387519Y-73051015D01*
X74268985Y-72932481D01*
X74175853Y-72793100D01*
X74111703Y-72638228D01*
X74079000Y-72473816D01*
X74079000Y-72306184D01*
X74111703Y-72141772D01*
X74175853Y-71986900D01*
X74268985Y-71847519D01*
X74387519Y-71728985D01*
X74526900Y-71635853D01*
X74681772Y-71571703D01*
X74846184Y-71539000D01*
X75013816Y-71539000D01*
X75178228Y-71571703D01*
X75178228Y-71571703D01*
G37*
G36*
X70178228Y-71571703D02*
X70333100Y-71635853D01*
X70472481Y-71728985D01*
X70591015Y-71847519D01*
X70684147Y-71986900D01*
X70748297Y-72141772D01*
X70781000Y-72306184D01*
X70781000Y-72473816D01*
X70748297Y-72638228D01*
X70684147Y-72793100D01*
X70591015Y-72932481D01*
X70472481Y-73051015D01*
X70333100Y-73144147D01*
X70178228Y-73208297D01*
X70013816Y-73241000D01*
X69846184Y-73241000D01*
X69681772Y-73208297D01*
X69526900Y-73144147D01*
X69387519Y-73051015D01*
X69268985Y-72932481D01*
X69175853Y-72793100D01*
X69111703Y-72638228D01*
X69079000Y-72473816D01*
X69079000Y-72306184D01*
X69111703Y-72141772D01*
X69175853Y-71986900D01*
X69268985Y-71847519D01*
X69387519Y-71728985D01*
X69526900Y-71635853D01*
X69681772Y-71571703D01*
X69846184Y-71539000D01*
X70013816Y-71539000D01*
X70178228Y-71571703D01*
X70178228Y-71571703D01*
G37*
G36*
X95483643Y-71619781D02*
X95629415Y-71680162D01*
X95760611Y-71767824D01*
X95872176Y-71879389D01*
X95959838Y-72010585D01*
X96020219Y-72156357D01*
X96051000Y-72311107D01*
X96051000Y-72468893D01*
X96020219Y-72623643D01*
X95959838Y-72769415D01*
X95872176Y-72900611D01*
X95760611Y-73012176D01*
X95629415Y-73099838D01*
X95483643Y-73160219D01*
X95328893Y-73191000D01*
X95171107Y-73191000D01*
X95016357Y-73160219D01*
X94870585Y-73099838D01*
X94739389Y-73012176D01*
X94627824Y-72900611D01*
X94540162Y-72769415D01*
X94479781Y-72623643D01*
X94449000Y-72468893D01*
X94449000Y-72311107D01*
X94479781Y-72156357D01*
X94540162Y-72010585D01*
X94627824Y-71879389D01*
X94739389Y-71767824D01*
X94870585Y-71680162D01*
X95016357Y-71619781D01*
X95171107Y-71589000D01*
X95328893Y-71589000D01*
X95483643Y-71619781D01*
X95483643Y-71619781D01*
G37*
G36*
X92943643Y-71619781D02*
X93089415Y-71680162D01*
X93220611Y-71767824D01*
X93332176Y-71879389D01*
X93419838Y-72010585D01*
X93480219Y-72156357D01*
X93511000Y-72311107D01*
X93511000Y-72468893D01*
X93480219Y-72623643D01*
X93419838Y-72769415D01*
X93332176Y-72900611D01*
X93220611Y-73012176D01*
X93089415Y-73099838D01*
X92943643Y-73160219D01*
X92788893Y-73191000D01*
X92631107Y-73191000D01*
X92476357Y-73160219D01*
X92330585Y-73099838D01*
X92199389Y-73012176D01*
X92087824Y-72900611D01*
X92000162Y-72769415D01*
X91939781Y-72623643D01*
X91909000Y-72468893D01*
X91909000Y-72311107D01*
X91939781Y-72156357D01*
X92000162Y-72010585D01*
X92087824Y-71879389D01*
X92199389Y-71767824D01*
X92330585Y-71680162D01*
X92476357Y-71619781D01*
X92631107Y-71589000D01*
X92788893Y-71589000D01*
X92943643Y-71619781D01*
X92943643Y-71619781D01*
G37*
G36*
X90971000Y-73191000D02*
X89369000Y-73191000D01*
X89369000Y-71589000D01*
X90971000Y-71589000D01*
X90971000Y-73191000D01*
X90971000Y-73191000D01*
G37*
G36*
X80176821Y-66471313D02*
X80176824Y-66471314D01*
X80176825Y-66471314D01*
X80337239Y-66519975D01*
X80337241Y-66519976D01*
X80337244Y-66519977D01*
X80485078Y-66598995D01*
X80614659Y-66705341D01*
X80721005Y-66834922D01*
X80800023Y-66982756D01*
X80848687Y-67143179D01*
X80865117Y-67310000D01*
X80848687Y-67476821D01*
X80800023Y-67637244D01*
X80721005Y-67785078D01*
X80614659Y-67914659D01*
X80485078Y-68021005D01*
X80337244Y-68100023D01*
X80337241Y-68100024D01*
X80337239Y-68100025D01*
X80176825Y-68148686D01*
X80176824Y-68148686D01*
X80176821Y-68148687D01*
X80051804Y-68161000D01*
X79968196Y-68161000D01*
X79843179Y-68148687D01*
X79843176Y-68148686D01*
X79843175Y-68148686D01*
X79682761Y-68100025D01*
X79682759Y-68100024D01*
X79682756Y-68100023D01*
X79534922Y-68021005D01*
X79405341Y-67914659D01*
X79298995Y-67785078D01*
X79219977Y-67637244D01*
X79171313Y-67476821D01*
X79154883Y-67310000D01*
X79171313Y-67143179D01*
X79219977Y-66982756D01*
X79298995Y-66834922D01*
X79405341Y-66705341D01*
X79534922Y-66598995D01*
X79682756Y-66519977D01*
X79682759Y-66519976D01*
X79682761Y-66519975D01*
X79843175Y-66471314D01*
X79843176Y-66471314D01*
X79843179Y-66471313D01*
X79968196Y-66459000D01*
X80051804Y-66459000D01*
X80176821Y-66471313D01*
X80176821Y-66471313D01*
G37*
G36*
X91606821Y-66471313D02*
X91606824Y-66471314D01*
X91606825Y-66471314D01*
X91767239Y-66519975D01*
X91767241Y-66519976D01*
X91767244Y-66519977D01*
X91915078Y-66598995D01*
X92044659Y-66705341D01*
X92151005Y-66834922D01*
X92230023Y-66982756D01*
X92278687Y-67143179D01*
X92295117Y-67310000D01*
X92278687Y-67476821D01*
X92230023Y-67637244D01*
X92151005Y-67785078D01*
X92044659Y-67914659D01*
X91915078Y-68021005D01*
X91767244Y-68100023D01*
X91767241Y-68100024D01*
X91767239Y-68100025D01*
X91606825Y-68148686D01*
X91606824Y-68148686D01*
X91606821Y-68148687D01*
X91481804Y-68161000D01*
X91398196Y-68161000D01*
X91273179Y-68148687D01*
X91273176Y-68148686D01*
X91273175Y-68148686D01*
X91112761Y-68100025D01*
X91112759Y-68100024D01*
X91112756Y-68100023D01*
X90964922Y-68021005D01*
X90835341Y-67914659D01*
X90728995Y-67785078D01*
X90649977Y-67637244D01*
X90601313Y-67476821D01*
X90584883Y-67310000D01*
X90601313Y-67143179D01*
X90649977Y-66982756D01*
X90728995Y-66834922D01*
X90835341Y-66705341D01*
X90964922Y-66598995D01*
X91112756Y-66519977D01*
X91112759Y-66519976D01*
X91112761Y-66519975D01*
X91273175Y-66471314D01*
X91273176Y-66471314D01*
X91273179Y-66471313D01*
X91398196Y-66459000D01*
X91481804Y-66459000D01*
X91606821Y-66471313D01*
X91606821Y-66471313D01*
G37*
G36*
X103036821Y-66471313D02*
X103036824Y-66471314D01*
X103036825Y-66471314D01*
X103197239Y-66519975D01*
X103197241Y-66519976D01*
X103197244Y-66519977D01*
X103345078Y-66598995D01*
X103474659Y-66705341D01*
X103581005Y-66834922D01*
X103660023Y-66982756D01*
X103708687Y-67143179D01*
X103725117Y-67310000D01*
X103708687Y-67476821D01*
X103660023Y-67637244D01*
X103581005Y-67785078D01*
X103474659Y-67914659D01*
X103345078Y-68021005D01*
X103197244Y-68100023D01*
X103197241Y-68100024D01*
X103197239Y-68100025D01*
X103036825Y-68148686D01*
X103036824Y-68148686D01*
X103036821Y-68148687D01*
X102911804Y-68161000D01*
X102828196Y-68161000D01*
X102703179Y-68148687D01*
X102703176Y-68148686D01*
X102703175Y-68148686D01*
X102542761Y-68100025D01*
X102542759Y-68100024D01*
X102542756Y-68100023D01*
X102394922Y-68021005D01*
X102265341Y-67914659D01*
X102158995Y-67785078D01*
X102079977Y-67637244D01*
X102031313Y-67476821D01*
X102014883Y-67310000D01*
X102031313Y-67143179D01*
X102079977Y-66982756D01*
X102158995Y-66834922D01*
X102265341Y-66705341D01*
X102394922Y-66598995D01*
X102542756Y-66519977D01*
X102542759Y-66519976D01*
X102542761Y-66519975D01*
X102703175Y-66471314D01*
X102703176Y-66471314D01*
X102703179Y-66471313D01*
X102828196Y-66459000D01*
X102911804Y-66459000D01*
X103036821Y-66471313D01*
X103036821Y-66471313D01*
G37*
G36*
X91688228Y-58871703D02*
X91843100Y-58935853D01*
X91982481Y-59028985D01*
X92101015Y-59147519D01*
X92194147Y-59286900D01*
X92258297Y-59441772D01*
X92291000Y-59606184D01*
X92291000Y-59773816D01*
X92258297Y-59938228D01*
X92194147Y-60093100D01*
X92101015Y-60232481D01*
X91982481Y-60351015D01*
X91843100Y-60444147D01*
X91688228Y-60508297D01*
X91523816Y-60541000D01*
X91356184Y-60541000D01*
X91191772Y-60508297D01*
X91036900Y-60444147D01*
X90897519Y-60351015D01*
X90778985Y-60232481D01*
X90685853Y-60093100D01*
X90621703Y-59938228D01*
X90589000Y-59773816D01*
X90589000Y-59606184D01*
X90621703Y-59441772D01*
X90685853Y-59286900D01*
X90778985Y-59147519D01*
X90897519Y-59028985D01*
X91036900Y-58935853D01*
X91191772Y-58871703D01*
X91356184Y-58839000D01*
X91523816Y-58839000D01*
X91688228Y-58871703D01*
X91688228Y-58871703D01*
G37*
G36*
X103118228Y-58871703D02*
X103273100Y-58935853D01*
X103412481Y-59028985D01*
X103531015Y-59147519D01*
X103624147Y-59286900D01*
X103688297Y-59441772D01*
X103721000Y-59606184D01*
X103721000Y-59773816D01*
X103688297Y-59938228D01*
X103624147Y-60093100D01*
X103531015Y-60232481D01*
X103412481Y-60351015D01*
X103273100Y-60444147D01*
X103118228Y-60508297D01*
X102953816Y-60541000D01*
X102786184Y-60541000D01*
X102621772Y-60508297D01*
X102466900Y-60444147D01*
X102327519Y-60351015D01*
X102208985Y-60232481D01*
X102115853Y-60093100D01*
X102051703Y-59938228D01*
X102019000Y-59773816D01*
X102019000Y-59606184D01*
X102051703Y-59441772D01*
X102115853Y-59286900D01*
X102208985Y-59147519D01*
X102327519Y-59028985D01*
X102466900Y-58935853D01*
X102621772Y-58871703D01*
X102786184Y-58839000D01*
X102953816Y-58839000D01*
X103118228Y-58871703D01*
X103118228Y-58871703D01*
G37*
G36*
X80258228Y-58871703D02*
X80413100Y-58935853D01*
X80552481Y-59028985D01*
X80671015Y-59147519D01*
X80764147Y-59286900D01*
X80828297Y-59441772D01*
X80861000Y-59606184D01*
X80861000Y-59773816D01*
X80828297Y-59938228D01*
X80764147Y-60093100D01*
X80671015Y-60232481D01*
X80552481Y-60351015D01*
X80413100Y-60444147D01*
X80258228Y-60508297D01*
X80093816Y-60541000D01*
X79926184Y-60541000D01*
X79761772Y-60508297D01*
X79606900Y-60444147D01*
X79467519Y-60351015D01*
X79348985Y-60232481D01*
X79255853Y-60093100D01*
X79191703Y-59938228D01*
X79159000Y-59773816D01*
X79159000Y-59606184D01*
X79191703Y-59441772D01*
X79255853Y-59286900D01*
X79348985Y-59147519D01*
X79467519Y-59028985D01*
X79606900Y-58935853D01*
X79761772Y-58871703D01*
X79926184Y-58839000D01*
X80093816Y-58839000D01*
X80258228Y-58871703D01*
X80258228Y-58871703D01*
G37*
G36*
X103921000Y-55613500D02*
X101819000Y-55613500D01*
X101819000Y-53606500D01*
X103921000Y-53606500D01*
X103921000Y-55613500D01*
X103921000Y-55613500D01*
G37*
G36*
X87411000Y-55613500D02*
X85309000Y-55613500D01*
X85309000Y-53606500D01*
X87411000Y-53606500D01*
X87411000Y-55613500D01*
X87411000Y-55613500D01*
G37*
G36*
X70901000Y-55613500D02*
X68799000Y-55613500D01*
X68799000Y-53606500D01*
X70901000Y-53606500D01*
X70901000Y-55613500D01*
X70901000Y-55613500D01*
G37*
G36*
X70005764Y-51072308D02*
X70094220Y-51081020D01*
X70283381Y-51138401D01*
X70457712Y-51231583D01*
X70610515Y-51356985D01*
X70735917Y-51509788D01*
X70829099Y-51684119D01*
X70886480Y-51873280D01*
X70905855Y-52070000D01*
X70886480Y-52266720D01*
X70829099Y-52455881D01*
X70735917Y-52630212D01*
X70610515Y-52783015D01*
X70457712Y-52908417D01*
X70283381Y-53001599D01*
X70094220Y-53058980D01*
X70005764Y-53067692D01*
X69946796Y-53073500D01*
X69753204Y-53073500D01*
X69694236Y-53067692D01*
X69605780Y-53058980D01*
X69416619Y-53001599D01*
X69242288Y-52908417D01*
X69089485Y-52783015D01*
X68964083Y-52630212D01*
X68870901Y-52455881D01*
X68813520Y-52266720D01*
X68794145Y-52070000D01*
X68813520Y-51873280D01*
X68870901Y-51684119D01*
X68964083Y-51509788D01*
X69089485Y-51356985D01*
X69242288Y-51231583D01*
X69416619Y-51138401D01*
X69605780Y-51081020D01*
X69694236Y-51072308D01*
X69753204Y-51066500D01*
X69946796Y-51066500D01*
X70005764Y-51072308D01*
X70005764Y-51072308D01*
G37*
G36*
X103025764Y-51072308D02*
X103114220Y-51081020D01*
X103303381Y-51138401D01*
X103477712Y-51231583D01*
X103630515Y-51356985D01*
X103755917Y-51509788D01*
X103849099Y-51684119D01*
X103906480Y-51873280D01*
X103925855Y-52070000D01*
X103906480Y-52266720D01*
X103849099Y-52455881D01*
X103755917Y-52630212D01*
X103630515Y-52783015D01*
X103477712Y-52908417D01*
X103303381Y-53001599D01*
X103114220Y-53058980D01*
X103025764Y-53067692D01*
X102966796Y-53073500D01*
X102773204Y-53073500D01*
X102714236Y-53067692D01*
X102625780Y-53058980D01*
X102436619Y-53001599D01*
X102262288Y-52908417D01*
X102109485Y-52783015D01*
X101984083Y-52630212D01*
X101890901Y-52455881D01*
X101833520Y-52266720D01*
X101814145Y-52070000D01*
X101833520Y-51873280D01*
X101890901Y-51684119D01*
X101984083Y-51509788D01*
X102109485Y-51356985D01*
X102262288Y-51231583D01*
X102436619Y-51138401D01*
X102625780Y-51081020D01*
X102714236Y-51072308D01*
X102773204Y-51066500D01*
X102966796Y-51066500D01*
X103025764Y-51072308D01*
X103025764Y-51072308D01*
G37*
G36*
X86515764Y-51072308D02*
X86604220Y-51081020D01*
X86793381Y-51138401D01*
X86967712Y-51231583D01*
X87120515Y-51356985D01*
X87245917Y-51509788D01*
X87339099Y-51684119D01*
X87396480Y-51873280D01*
X87415855Y-52070000D01*
X87396480Y-52266720D01*
X87339099Y-52455881D01*
X87245917Y-52630212D01*
X87120515Y-52783015D01*
X86967712Y-52908417D01*
X86793381Y-53001599D01*
X86604220Y-53058980D01*
X86515764Y-53067692D01*
X86456796Y-53073500D01*
X86263204Y-53073500D01*
X86204236Y-53067692D01*
X86115780Y-53058980D01*
X85926619Y-53001599D01*
X85752288Y-52908417D01*
X85599485Y-52783015D01*
X85474083Y-52630212D01*
X85380901Y-52455881D01*
X85323520Y-52266720D01*
X85304145Y-52070000D01*
X85323520Y-51873280D01*
X85380901Y-51684119D01*
X85474083Y-51509788D01*
X85599485Y-51356985D01*
X85752288Y-51231583D01*
X85926619Y-51138401D01*
X86115780Y-51081020D01*
X86204236Y-51072308D01*
X86263204Y-51066500D01*
X86456796Y-51066500D01*
X86515764Y-51072308D01*
X86515764Y-51072308D01*
G37*
G36*
X103025764Y-48532308D02*
X103114220Y-48541020D01*
X103303381Y-48598401D01*
X103477712Y-48691583D01*
X103630515Y-48816985D01*
X103755917Y-48969788D01*
X103849099Y-49144119D01*
X103906480Y-49333280D01*
X103925855Y-49530000D01*
X103906480Y-49726720D01*
X103849099Y-49915881D01*
X103755917Y-50090212D01*
X103630515Y-50243015D01*
X103477712Y-50368417D01*
X103303381Y-50461599D01*
X103114220Y-50518980D01*
X103025764Y-50527692D01*
X102966796Y-50533500D01*
X102773204Y-50533500D01*
X102714236Y-50527692D01*
X102625780Y-50518980D01*
X102436619Y-50461599D01*
X102262288Y-50368417D01*
X102109485Y-50243015D01*
X101984083Y-50090212D01*
X101890901Y-49915881D01*
X101833520Y-49726720D01*
X101814145Y-49530000D01*
X101833520Y-49333280D01*
X101890901Y-49144119D01*
X101984083Y-48969788D01*
X102109485Y-48816985D01*
X102262288Y-48691583D01*
X102436619Y-48598401D01*
X102625780Y-48541020D01*
X102714236Y-48532308D01*
X102773204Y-48526500D01*
X102966796Y-48526500D01*
X103025764Y-48532308D01*
X103025764Y-48532308D01*
G37*
G36*
X86515764Y-48532308D02*
X86604220Y-48541020D01*
X86793381Y-48598401D01*
X86967712Y-48691583D01*
X87120515Y-48816985D01*
X87245917Y-48969788D01*
X87339099Y-49144119D01*
X87396480Y-49333280D01*
X87415855Y-49530000D01*
X87396480Y-49726720D01*
X87339099Y-49915881D01*
X87245917Y-50090212D01*
X87120515Y-50243015D01*
X86967712Y-50368417D01*
X86793381Y-50461599D01*
X86604220Y-50518980D01*
X86515764Y-50527692D01*
X86456796Y-50533500D01*
X86263204Y-50533500D01*
X86204236Y-50527692D01*
X86115780Y-50518980D01*
X85926619Y-50461599D01*
X85752288Y-50368417D01*
X85599485Y-50243015D01*
X85474083Y-50090212D01*
X85380901Y-49915881D01*
X85323520Y-49726720D01*
X85304145Y-49530000D01*
X85323520Y-49333280D01*
X85380901Y-49144119D01*
X85474083Y-48969788D01*
X85599485Y-48816985D01*
X85752288Y-48691583D01*
X85926619Y-48598401D01*
X86115780Y-48541020D01*
X86204236Y-48532308D01*
X86263204Y-48526500D01*
X86456796Y-48526500D01*
X86515764Y-48532308D01*
X86515764Y-48532308D01*
G37*
G36*
X70005764Y-48532308D02*
X70094220Y-48541020D01*
X70283381Y-48598401D01*
X70457712Y-48691583D01*
X70610515Y-48816985D01*
X70735917Y-48969788D01*
X70829099Y-49144119D01*
X70886480Y-49333280D01*
X70905855Y-49530000D01*
X70886480Y-49726720D01*
X70829099Y-49915881D01*
X70735917Y-50090212D01*
X70610515Y-50243015D01*
X70457712Y-50368417D01*
X70283381Y-50461599D01*
X70094220Y-50518980D01*
X70005764Y-50527692D01*
X69946796Y-50533500D01*
X69753204Y-50533500D01*
X69694236Y-50527692D01*
X69605780Y-50518980D01*
X69416619Y-50461599D01*
X69242288Y-50368417D01*
X69089485Y-50243015D01*
X68964083Y-50090212D01*
X68870901Y-49915881D01*
X68813520Y-49726720D01*
X68794145Y-49530000D01*
X68813520Y-49333280D01*
X68870901Y-49144119D01*
X68964083Y-48969788D01*
X69089485Y-48816985D01*
X69242288Y-48691583D01*
X69416619Y-48598401D01*
X69605780Y-48541020D01*
X69694236Y-48532308D01*
X69753204Y-48526500D01*
X69946796Y-48526500D01*
X70005764Y-48532308D01*
X70005764Y-48532308D01*
G37*
G36*
X95893654Y-37742888D02*
X96204865Y-37837294D01*
X96491686Y-37990603D01*
X96743082Y-38196918D01*
X96949397Y-38448314D01*
X97102706Y-38735135D01*
X97197112Y-39046346D01*
X97228988Y-39370000D01*
X97197112Y-39693654D01*
X97102706Y-40004865D01*
X96949397Y-40291686D01*
X96743082Y-40543082D01*
X96491686Y-40749397D01*
X96204865Y-40902706D01*
X95893654Y-40997112D01*
X95651107Y-41021000D01*
X95488893Y-41021000D01*
X95246346Y-40997112D01*
X94935135Y-40902706D01*
X94648314Y-40749397D01*
X94396918Y-40543082D01*
X94190603Y-40291686D01*
X94037294Y-40004865D01*
X93942888Y-39693654D01*
X93911012Y-39370000D01*
X93942888Y-39046346D01*
X94037294Y-38735135D01*
X94190603Y-38448314D01*
X94396918Y-38196918D01*
X94648314Y-37990603D01*
X94935135Y-37837294D01*
X95246346Y-37742888D01*
X95488893Y-37719000D01*
X95651107Y-37719000D01*
X95893654Y-37742888D01*
X95893654Y-37742888D01*
G37*
G36*
X117221000Y-41021000D02*
X113919000Y-41021000D01*
X113919000Y-37719000D01*
X117221000Y-37719000D01*
X117221000Y-41021000D01*
X117221000Y-41021000D01*
G37*
G36*
X103213567Y-25344959D02*
X103344072Y-25370918D01*
X103589939Y-25472759D01*
X103810464Y-25620110D01*
X103811215Y-25620612D01*
X103999388Y-25808785D01*
X103999390Y-25808788D01*
X104147241Y-26030061D01*
X104249082Y-26275928D01*
X104301000Y-26536938D01*
X104301000Y-26803062D01*
X104249082Y-27064072D01*
X104147241Y-27309939D01*
X103999890Y-27530464D01*
X103999388Y-27531215D01*
X103811215Y-27719388D01*
X103811212Y-27719390D01*
X103589939Y-27867241D01*
X103344072Y-27969082D01*
X103213567Y-27995041D01*
X103083063Y-28021000D01*
X102816937Y-28021000D01*
X102686433Y-27995041D01*
X102555928Y-27969082D01*
X102310061Y-27867241D01*
X102088788Y-27719390D01*
X102088785Y-27719388D01*
X101900612Y-27531215D01*
X101900110Y-27530464D01*
X101752759Y-27309939D01*
X101650918Y-27064072D01*
X101599000Y-26803062D01*
X101599000Y-26536938D01*
X101650918Y-26275928D01*
X101752759Y-26030061D01*
X101900610Y-25808788D01*
X101900612Y-25808785D01*
X102088785Y-25620612D01*
X102089536Y-25620110D01*
X102310061Y-25472759D01*
X102555928Y-25370918D01*
X102686433Y-25344959D01*
X102816937Y-25319000D01*
X103083063Y-25319000D01*
X103213567Y-25344959D01*
X103213567Y-25344959D01*
G37*
G36*
X109301000Y-28021000D02*
X106599000Y-28021000D01*
X106599000Y-25319000D01*
X109301000Y-25319000D01*
X109301000Y-28021000D01*
X109301000Y-28021000D01*
G37*
M02*
