G04 #@! TF.GenerationSoftware,KiCad,Pcbnew,(5.0.2)-1*
G04 #@! TF.CreationDate,2019-07-24T01:21:19+02:00*
G04 #@! TF.ProjectId,Cern2,4365726e-322e-46b6-9963-61645f706362,rev?*
G04 #@! TF.SameCoordinates,Original*
G04 #@! TF.FileFunction,Copper,L2,Bot*
G04 #@! TF.FilePolarity,Positive*
%FSLAX46Y46*%
G04 Gerber Fmt 4.6, Leading zero omitted, Abs format (unit mm)*
G04 Created by KiCad (PCBNEW (5.0.2)-1) date 24/07/2019 01:21:19*
%MOMM*%
%LPD*%
G01*
G04 APERTURE LIST*
G04 #@! TA.AperFunction,NonConductor*
%ADD10C,0.300000*%
G04 #@! TD*
G04 #@! TA.AperFunction,NonConductor*
%ADD11C,0.400000*%
G04 #@! TD*
G04 #@! TA.AperFunction,NonConductor*
%ADD12C,0.500000*%
G04 #@! TD*
G04 #@! TA.AperFunction,ComponentPad*
%ADD13R,1.500000X1.500000*%
G04 #@! TD*
G04 #@! TA.AperFunction,ComponentPad*
%ADD14C,1.500000*%
G04 #@! TD*
G04 #@! TA.AperFunction,ComponentPad*
%ADD15O,1.700000X1.700000*%
G04 #@! TD*
G04 #@! TA.AperFunction,ComponentPad*
%ADD16R,1.700000X1.700000*%
G04 #@! TD*
G04 #@! TA.AperFunction,ComponentPad*
%ADD17O,1.600000X1.600000*%
G04 #@! TD*
G04 #@! TA.AperFunction,ComponentPad*
%ADD18C,1.600000*%
G04 #@! TD*
G04 #@! TA.AperFunction,ComponentPad*
%ADD19O,2.000000X1.905000*%
G04 #@! TD*
G04 #@! TA.AperFunction,ComponentPad*
%ADD20R,2.000000X1.905000*%
G04 #@! TD*
G04 #@! TA.AperFunction,ComponentPad*
%ADD21C,2.600000*%
G04 #@! TD*
G04 #@! TA.AperFunction,ComponentPad*
%ADD22R,2.600000X2.600000*%
G04 #@! TD*
G04 #@! TA.AperFunction,ComponentPad*
%ADD23O,3.200000X3.200000*%
G04 #@! TD*
G04 #@! TA.AperFunction,ComponentPad*
%ADD24R,3.200000X3.200000*%
G04 #@! TD*
G04 #@! TA.AperFunction,ComponentPad*
%ADD25O,1.800000X1.800000*%
G04 #@! TD*
G04 #@! TA.AperFunction,ComponentPad*
%ADD26R,1.800000X1.800000*%
G04 #@! TD*
G04 #@! TA.AperFunction,ViaPad*
%ADD27C,4.000000*%
G04 #@! TD*
G04 #@! TA.AperFunction,ViaPad*
%ADD28C,1.200000*%
G04 #@! TD*
G04 #@! TA.AperFunction,ViaPad*
%ADD29C,0.800000*%
G04 #@! TD*
G04 #@! TA.AperFunction,Conductor*
%ADD30C,0.250000*%
G04 #@! TD*
G04 #@! TA.AperFunction,Conductor*
%ADD31C,8.000000*%
G04 #@! TD*
G04 #@! TA.AperFunction,Conductor*
%ADD32C,2.000000*%
G04 #@! TD*
G04 #@! TA.AperFunction,Conductor*
%ADD33C,2.400000*%
G04 #@! TD*
G04 APERTURE END LIST*
D10*
X60848571Y-84427142D02*
X60634285Y-84498571D01*
X60277142Y-84498571D01*
X60134285Y-84427142D01*
X60062857Y-84355714D01*
X59991428Y-84212857D01*
X59991428Y-84070000D01*
X60062857Y-83927142D01*
X60134285Y-83855714D01*
X60277142Y-83784285D01*
X60562857Y-83712857D01*
X60705714Y-83641428D01*
X60777142Y-83570000D01*
X60848571Y-83427142D01*
X60848571Y-83284285D01*
X60777142Y-83141428D01*
X60705714Y-83070000D01*
X60562857Y-82998571D01*
X60205714Y-82998571D01*
X59991428Y-83070000D01*
X59562857Y-83498571D02*
X58991428Y-83498571D01*
X59348571Y-82998571D02*
X59348571Y-84284285D01*
X59277142Y-84427142D01*
X59134285Y-84498571D01*
X58991428Y-84498571D01*
X57848571Y-84498571D02*
X57848571Y-83712857D01*
X57920000Y-83570000D01*
X58062857Y-83498571D01*
X58348571Y-83498571D01*
X58491428Y-83570000D01*
X57848571Y-84427142D02*
X57991428Y-84498571D01*
X58348571Y-84498571D01*
X58491428Y-84427142D01*
X58562857Y-84284285D01*
X58562857Y-84141428D01*
X58491428Y-83998571D01*
X58348571Y-83927142D01*
X57991428Y-83927142D01*
X57848571Y-83855714D01*
X57134285Y-84498571D02*
X57134285Y-83498571D01*
X57134285Y-83784285D02*
X57062857Y-83641428D01*
X56991428Y-83570000D01*
X56848571Y-83498571D01*
X56705714Y-83498571D01*
X56420000Y-83498571D02*
X55848571Y-83498571D01*
X56205714Y-82998571D02*
X56205714Y-84284285D01*
X56134285Y-84427142D01*
X55991428Y-84498571D01*
X55848571Y-84498571D01*
X58991428Y-86467142D02*
X57848571Y-86467142D01*
X124745714Y-80688571D02*
X125602857Y-80688571D01*
X125174285Y-80688571D02*
X125174285Y-79188571D01*
X125317142Y-79402857D01*
X125460000Y-79545714D01*
X125602857Y-79617142D01*
X123388571Y-79188571D02*
X124102857Y-79188571D01*
X124174285Y-79902857D01*
X124102857Y-79831428D01*
X123960000Y-79760000D01*
X123602857Y-79760000D01*
X123460000Y-79831428D01*
X123388571Y-79902857D01*
X123317142Y-80045714D01*
X123317142Y-80402857D01*
X123388571Y-80545714D01*
X123460000Y-80617142D01*
X123602857Y-80688571D01*
X123960000Y-80688571D01*
X124102857Y-80617142D01*
X124174285Y-80545714D01*
D11*
X125602857Y-77684285D02*
X123317142Y-77684285D01*
X124460000Y-78827142D02*
X124460000Y-76541428D01*
D10*
X125602857Y-72981428D02*
X125531428Y-72910000D01*
X125388571Y-72838571D01*
X125031428Y-72838571D01*
X124888571Y-72910000D01*
X124817142Y-72981428D01*
X124745714Y-73124285D01*
X124745714Y-73267142D01*
X124817142Y-73481428D01*
X125674285Y-74338571D01*
X124745714Y-74338571D01*
X123460000Y-73338571D02*
X123460000Y-74338571D01*
X123817142Y-72767142D02*
X124174285Y-73838571D01*
X123245714Y-73838571D01*
D12*
X124245714Y-84962857D02*
X124245714Y-82677142D01*
X125602857Y-71334285D02*
X123317142Y-71334285D01*
X124460000Y-72477142D02*
X124460000Y-70191428D01*
D10*
X74905714Y-24650714D02*
X74977142Y-24722142D01*
X75191428Y-24793571D01*
X75334285Y-24793571D01*
X75548571Y-24722142D01*
X75691428Y-24579285D01*
X75762857Y-24436428D01*
X75834285Y-24150714D01*
X75834285Y-23936428D01*
X75762857Y-23650714D01*
X75691428Y-23507857D01*
X75548571Y-23365000D01*
X75334285Y-23293571D01*
X75191428Y-23293571D01*
X74977142Y-23365000D01*
X74905714Y-23436428D01*
X74048571Y-24793571D02*
X74191428Y-24722142D01*
X74262857Y-24650714D01*
X74334285Y-24507857D01*
X74334285Y-24079285D01*
X74262857Y-23936428D01*
X74191428Y-23865000D01*
X74048571Y-23793571D01*
X73834285Y-23793571D01*
X73691428Y-23865000D01*
X73620000Y-23936428D01*
X73548571Y-24079285D01*
X73548571Y-24507857D01*
X73620000Y-24650714D01*
X73691428Y-24722142D01*
X73834285Y-24793571D01*
X74048571Y-24793571D01*
X72905714Y-24793571D02*
X72905714Y-23793571D01*
X72905714Y-23293571D02*
X72977142Y-23365000D01*
X72905714Y-23436428D01*
X72834285Y-23365000D01*
X72905714Y-23293571D01*
X72905714Y-23436428D01*
X71977142Y-24793571D02*
X72120000Y-24722142D01*
X72191428Y-24579285D01*
X72191428Y-23293571D01*
X70262857Y-23293571D02*
X70262857Y-24507857D01*
X70191428Y-24650714D01*
X70120000Y-24722142D01*
X69977142Y-24793571D01*
X69691428Y-24793571D01*
X69548571Y-24722142D01*
X69477142Y-24650714D01*
X69405714Y-24507857D01*
X69405714Y-23293571D01*
X68691428Y-23793571D02*
X68691428Y-24793571D01*
X68691428Y-23936428D02*
X68620000Y-23865000D01*
X68477142Y-23793571D01*
X68262857Y-23793571D01*
X68120000Y-23865000D01*
X68048571Y-24007857D01*
X68048571Y-24793571D01*
X67334285Y-24793571D02*
X67334285Y-23793571D01*
X67334285Y-23293571D02*
X67405714Y-23365000D01*
X67334285Y-23436428D01*
X67262857Y-23365000D01*
X67334285Y-23293571D01*
X67334285Y-23436428D01*
X66834285Y-23793571D02*
X66262857Y-23793571D01*
X66620000Y-23293571D02*
X66620000Y-24579285D01*
X66548571Y-24722142D01*
X66405714Y-24793571D01*
X66262857Y-24793571D01*
X79191428Y-27343571D02*
X79191428Y-25843571D01*
X78620000Y-25843571D01*
X78477142Y-25915000D01*
X78405714Y-25986428D01*
X78334285Y-26129285D01*
X78334285Y-26343571D01*
X78405714Y-26486428D01*
X78477142Y-26557857D01*
X78620000Y-26629285D01*
X79191428Y-26629285D01*
X77048571Y-27343571D02*
X77048571Y-26557857D01*
X77120000Y-26415000D01*
X77262857Y-26343571D01*
X77548571Y-26343571D01*
X77691428Y-26415000D01*
X77048571Y-27272142D02*
X77191428Y-27343571D01*
X77548571Y-27343571D01*
X77691428Y-27272142D01*
X77762857Y-27129285D01*
X77762857Y-26986428D01*
X77691428Y-26843571D01*
X77548571Y-26772142D01*
X77191428Y-26772142D01*
X77048571Y-26700714D01*
X77262857Y-25772142D02*
X77477142Y-25986428D01*
X76548571Y-26343571D02*
X75977142Y-26343571D01*
X76334285Y-25843571D02*
X76334285Y-27129285D01*
X76262857Y-27272142D01*
X76120000Y-27343571D01*
X75977142Y-27343571D01*
X74905714Y-27272142D02*
X75048571Y-27343571D01*
X75334285Y-27343571D01*
X75477142Y-27272142D01*
X75548571Y-27129285D01*
X75548571Y-26557857D01*
X75477142Y-26415000D01*
X75334285Y-26343571D01*
X75048571Y-26343571D01*
X74905714Y-26415000D01*
X74834285Y-26557857D01*
X74834285Y-26700714D01*
X75548571Y-26843571D01*
X74191428Y-27343571D02*
X74191428Y-25843571D01*
X74048571Y-26772142D02*
X73620000Y-27343571D01*
X73620000Y-26343571D02*
X74191428Y-26915000D01*
X72120000Y-27200714D02*
X72191428Y-27272142D01*
X72405714Y-27343571D01*
X72548571Y-27343571D01*
X72762857Y-27272142D01*
X72905714Y-27129285D01*
X72977142Y-26986428D01*
X73048571Y-26700714D01*
X73048571Y-26486428D01*
X72977142Y-26200714D01*
X72905714Y-26057857D01*
X72762857Y-25915000D01*
X72548571Y-25843571D01*
X72405714Y-25843571D01*
X72191428Y-25915000D01*
X72120000Y-25986428D01*
X71477142Y-26557857D02*
X70977142Y-26557857D01*
X70762857Y-27343571D02*
X71477142Y-27343571D01*
X71477142Y-25843571D01*
X70762857Y-25843571D01*
X69262857Y-27343571D02*
X69762857Y-26629285D01*
X70120000Y-27343571D02*
X70120000Y-25843571D01*
X69548571Y-25843571D01*
X69405714Y-25915000D01*
X69334285Y-25986428D01*
X69262857Y-26129285D01*
X69262857Y-26343571D01*
X69334285Y-26486428D01*
X69405714Y-26557857D01*
X69548571Y-26629285D01*
X70120000Y-26629285D01*
X68620000Y-27343571D02*
X68620000Y-25843571D01*
X67762857Y-27343571D01*
X67762857Y-25843571D01*
X65120000Y-27343571D02*
X65977142Y-27343571D01*
X65548571Y-27343571D02*
X65548571Y-25843571D01*
X65691428Y-26057857D01*
X65834285Y-26200714D01*
X65977142Y-26272142D01*
X64477142Y-27200714D02*
X64405714Y-27272142D01*
X64477142Y-27343571D01*
X64548571Y-27272142D01*
X64477142Y-27200714D01*
X64477142Y-27343571D01*
X63477142Y-25843571D02*
X63334285Y-25843571D01*
X63191428Y-25915000D01*
X63120000Y-25986428D01*
X63048571Y-26129285D01*
X62977142Y-26415000D01*
X62977142Y-26772142D01*
X63048571Y-27057857D01*
X63120000Y-27200714D01*
X63191428Y-27272142D01*
X63334285Y-27343571D01*
X63477142Y-27343571D01*
X63620000Y-27272142D01*
X63691428Y-27200714D01*
X63762857Y-27057857D01*
X63834285Y-26772142D01*
X63834285Y-26415000D01*
X63762857Y-26129285D01*
X63691428Y-25986428D01*
X63620000Y-25915000D01*
X63477142Y-25843571D01*
X88762857Y-29893571D02*
X88762857Y-28393571D01*
X88262857Y-29465000D01*
X87762857Y-28393571D01*
X87762857Y-29893571D01*
X86405714Y-29893571D02*
X86405714Y-29107857D01*
X86477142Y-28965000D01*
X86620000Y-28893571D01*
X86905714Y-28893571D01*
X87048571Y-28965000D01*
X86405714Y-29822142D02*
X86548571Y-29893571D01*
X86905714Y-29893571D01*
X87048571Y-29822142D01*
X87120000Y-29679285D01*
X87120000Y-29536428D01*
X87048571Y-29393571D01*
X86905714Y-29322142D01*
X86548571Y-29322142D01*
X86405714Y-29250714D01*
X85048571Y-29893571D02*
X85048571Y-28393571D01*
X85048571Y-29822142D02*
X85191428Y-29893571D01*
X85477142Y-29893571D01*
X85620000Y-29822142D01*
X85691428Y-29750714D01*
X85762857Y-29607857D01*
X85762857Y-29179285D01*
X85691428Y-29036428D01*
X85620000Y-28965000D01*
X85477142Y-28893571D01*
X85191428Y-28893571D01*
X85048571Y-28965000D01*
X83762857Y-29822142D02*
X83905714Y-29893571D01*
X84191428Y-29893571D01*
X84334285Y-29822142D01*
X84405714Y-29679285D01*
X84405714Y-29107857D01*
X84334285Y-28965000D01*
X84191428Y-28893571D01*
X83905714Y-28893571D01*
X83762857Y-28965000D01*
X83691428Y-29107857D01*
X83691428Y-29250714D01*
X84405714Y-29393571D01*
X81905714Y-29893571D02*
X81905714Y-28393571D01*
X81905714Y-28965000D02*
X81762857Y-28893571D01*
X81477142Y-28893571D01*
X81334285Y-28965000D01*
X81262857Y-29036428D01*
X81191428Y-29179285D01*
X81191428Y-29607857D01*
X81262857Y-29750714D01*
X81334285Y-29822142D01*
X81477142Y-29893571D01*
X81762857Y-29893571D01*
X81905714Y-29822142D01*
X80691428Y-28893571D02*
X80334285Y-29893571D01*
X79977142Y-28893571D02*
X80334285Y-29893571D01*
X80477142Y-30250714D01*
X80548571Y-30322142D01*
X80691428Y-30393571D01*
X78262857Y-29893571D02*
X78262857Y-28393571D01*
X77691428Y-28393571D01*
X77548571Y-28465000D01*
X77477142Y-28536428D01*
X77405714Y-28679285D01*
X77405714Y-28893571D01*
X77477142Y-29036428D01*
X77548571Y-29107857D01*
X77691428Y-29179285D01*
X78262857Y-29179285D01*
X76120000Y-29893571D02*
X76120000Y-29107857D01*
X76191428Y-28965000D01*
X76334285Y-28893571D01*
X76620000Y-28893571D01*
X76762857Y-28965000D01*
X76120000Y-29822142D02*
X76262857Y-29893571D01*
X76620000Y-29893571D01*
X76762857Y-29822142D01*
X76834285Y-29679285D01*
X76834285Y-29536428D01*
X76762857Y-29393571D01*
X76620000Y-29322142D01*
X76262857Y-29322142D01*
X76120000Y-29250714D01*
X76334285Y-28322142D02*
X76548571Y-28536428D01*
X75620000Y-28893571D02*
X75048571Y-28893571D01*
X75405714Y-28393571D02*
X75405714Y-29679285D01*
X75334285Y-29822142D01*
X75191428Y-29893571D01*
X75048571Y-29893571D01*
X73977142Y-29822142D02*
X74120000Y-29893571D01*
X74405714Y-29893571D01*
X74548571Y-29822142D01*
X74620000Y-29679285D01*
X74620000Y-29107857D01*
X74548571Y-28965000D01*
X74405714Y-28893571D01*
X74120000Y-28893571D01*
X73977142Y-28965000D01*
X73905714Y-29107857D01*
X73905714Y-29250714D01*
X74620000Y-29393571D01*
X73262857Y-29893571D02*
X73262857Y-28393571D01*
X73120000Y-29322142D02*
X72691428Y-29893571D01*
X72691428Y-28893571D02*
X73262857Y-29465000D01*
X69691428Y-29893571D02*
X69762857Y-29893571D01*
X69905714Y-29822142D01*
X70120000Y-29607857D01*
X70477142Y-29179285D01*
X70620000Y-28965000D01*
X70691428Y-28750714D01*
X70691428Y-28607857D01*
X70620000Y-28465000D01*
X70477142Y-28393571D01*
X70405714Y-28393571D01*
X70262857Y-28465000D01*
X70191428Y-28607857D01*
X70191428Y-28679285D01*
X70262857Y-28822142D01*
X70334285Y-28893571D01*
X70762857Y-29179285D01*
X70834285Y-29250714D01*
X70905714Y-29393571D01*
X70905714Y-29607857D01*
X70834285Y-29750714D01*
X70762857Y-29822142D01*
X70620000Y-29893571D01*
X70405714Y-29893571D01*
X70262857Y-29822142D01*
X70191428Y-29750714D01*
X69977142Y-29465000D01*
X69905714Y-29250714D01*
X69905714Y-29107857D01*
X67905714Y-29893571D02*
X67905714Y-28393571D01*
X67334285Y-28393571D01*
X67191428Y-28465000D01*
X67120000Y-28536428D01*
X67048571Y-28679285D01*
X67048571Y-28893571D01*
X67120000Y-29036428D01*
X67191428Y-29107857D01*
X67334285Y-29179285D01*
X67905714Y-29179285D01*
X65834285Y-29822142D02*
X65977142Y-29893571D01*
X66262857Y-29893571D01*
X66405714Y-29822142D01*
X66477142Y-29679285D01*
X66477142Y-29107857D01*
X66405714Y-28965000D01*
X66262857Y-28893571D01*
X65977142Y-28893571D01*
X65834285Y-28965000D01*
X65762857Y-29107857D01*
X65762857Y-29250714D01*
X66477142Y-29393571D01*
X65334285Y-28893571D02*
X64762857Y-28893571D01*
X65120000Y-28393571D02*
X65120000Y-29679285D01*
X65048571Y-29822142D01*
X64905714Y-29893571D01*
X64762857Y-29893571D01*
X64262857Y-29893571D02*
X64262857Y-28893571D01*
X64262857Y-29179285D02*
X64191428Y-29036428D01*
X64120000Y-28965000D01*
X63977142Y-28893571D01*
X63834285Y-28893571D01*
X62191428Y-29893571D02*
X62191428Y-28393571D01*
X61334285Y-29893571D02*
X61977142Y-29036428D01*
X61334285Y-28393571D02*
X62191428Y-29250714D01*
X60477142Y-29893571D02*
X60620000Y-29822142D01*
X60691428Y-29750714D01*
X60762857Y-29607857D01*
X60762857Y-29179285D01*
X60691428Y-29036428D01*
X60620000Y-28965000D01*
X60477142Y-28893571D01*
X60262857Y-28893571D01*
X60120000Y-28965000D01*
X60048571Y-29036428D01*
X59977142Y-29179285D01*
X59977142Y-29607857D01*
X60048571Y-29750714D01*
X60120000Y-29822142D01*
X60262857Y-29893571D01*
X60477142Y-29893571D01*
X59405714Y-29822142D02*
X59262857Y-29893571D01*
X58977142Y-29893571D01*
X58834285Y-29822142D01*
X58762857Y-29679285D01*
X58762857Y-29607857D01*
X58834285Y-29465000D01*
X58977142Y-29393571D01*
X59191428Y-29393571D01*
X59334285Y-29322142D01*
X59405714Y-29179285D01*
X59405714Y-29107857D01*
X59334285Y-28965000D01*
X59191428Y-28893571D01*
X58977142Y-28893571D01*
X58834285Y-28965000D01*
X58120000Y-28893571D02*
X58120000Y-30393571D01*
X58120000Y-28965000D02*
X57977142Y-28893571D01*
X57691428Y-28893571D01*
X57548571Y-28965000D01*
X57477142Y-29036428D01*
X57405714Y-29179285D01*
X57405714Y-29607857D01*
X57477142Y-29750714D01*
X57548571Y-29822142D01*
X57691428Y-29893571D01*
X57977142Y-29893571D01*
X58120000Y-29822142D01*
X56120000Y-29893571D02*
X56120000Y-29107857D01*
X56191428Y-28965000D01*
X56334285Y-28893571D01*
X56620000Y-28893571D01*
X56762857Y-28965000D01*
X56120000Y-29822142D02*
X56262857Y-29893571D01*
X56620000Y-29893571D01*
X56762857Y-29822142D01*
X56834285Y-29679285D01*
X56834285Y-29536428D01*
X56762857Y-29393571D01*
X56620000Y-29322142D01*
X56262857Y-29322142D01*
X56120000Y-29250714D01*
X54762857Y-29822142D02*
X54905714Y-29893571D01*
X55191428Y-29893571D01*
X55334285Y-29822142D01*
X55405714Y-29750714D01*
X55477142Y-29607857D01*
X55477142Y-29179285D01*
X55405714Y-29036428D01*
X55334285Y-28965000D01*
X55191428Y-28893571D01*
X54905714Y-28893571D01*
X54762857Y-28965000D01*
X54120000Y-29893571D02*
X54120000Y-28393571D01*
X53477142Y-29893571D02*
X53477142Y-29107857D01*
X53548571Y-28965000D01*
X53691428Y-28893571D01*
X53905714Y-28893571D01*
X54048571Y-28965000D01*
X54120000Y-29036428D01*
X75905714Y-31086428D02*
X75834285Y-31015000D01*
X75691428Y-30943571D01*
X75334285Y-30943571D01*
X75191428Y-31015000D01*
X75120000Y-31086428D01*
X75048571Y-31229285D01*
X75048571Y-31372142D01*
X75120000Y-31586428D01*
X75977142Y-32443571D01*
X75048571Y-32443571D01*
X74120000Y-30943571D02*
X73977142Y-30943571D01*
X73834285Y-31015000D01*
X73762857Y-31086428D01*
X73691428Y-31229285D01*
X73620000Y-31515000D01*
X73620000Y-31872142D01*
X73691428Y-32157857D01*
X73762857Y-32300714D01*
X73834285Y-32372142D01*
X73977142Y-32443571D01*
X74120000Y-32443571D01*
X74262857Y-32372142D01*
X74334285Y-32300714D01*
X74405714Y-32157857D01*
X74477142Y-31872142D01*
X74477142Y-31515000D01*
X74405714Y-31229285D01*
X74334285Y-31086428D01*
X74262857Y-31015000D01*
X74120000Y-30943571D01*
X72191428Y-32443571D02*
X73048571Y-32443571D01*
X72620000Y-32443571D02*
X72620000Y-30943571D01*
X72762857Y-31157857D01*
X72905714Y-31300714D01*
X73048571Y-31372142D01*
X71477142Y-32443571D02*
X71191428Y-32443571D01*
X71048571Y-32372142D01*
X70977142Y-32300714D01*
X70834285Y-32086428D01*
X70762857Y-31800714D01*
X70762857Y-31229285D01*
X70834285Y-31086428D01*
X70905714Y-31015000D01*
X71048571Y-30943571D01*
X71334285Y-30943571D01*
X71477142Y-31015000D01*
X71548571Y-31086428D01*
X71620000Y-31229285D01*
X71620000Y-31586428D01*
X71548571Y-31729285D01*
X71477142Y-31800714D01*
X71334285Y-31872142D01*
X71048571Y-31872142D01*
X70905714Y-31800714D01*
X70834285Y-31729285D01*
X70762857Y-31586428D01*
X68548571Y-33015000D02*
X68620000Y-32943571D01*
X68762857Y-32729285D01*
X68834285Y-32586428D01*
X68905714Y-32372142D01*
X68977142Y-32015000D01*
X68977142Y-31729285D01*
X68905714Y-31372142D01*
X68834285Y-31157857D01*
X68762857Y-31015000D01*
X68620000Y-30800714D01*
X68548571Y-30729285D01*
X67334285Y-32372142D02*
X67477142Y-32443571D01*
X67762857Y-32443571D01*
X67905714Y-32372142D01*
X67977142Y-32300714D01*
X68048571Y-32157857D01*
X68048571Y-31729285D01*
X67977142Y-31586428D01*
X67905714Y-31515000D01*
X67762857Y-31443571D01*
X67477142Y-31443571D01*
X67334285Y-31515000D01*
X66834285Y-33015000D02*
X66762857Y-32943571D01*
X66620000Y-32729285D01*
X66548571Y-32586428D01*
X66477142Y-32372142D01*
X66405714Y-32015000D01*
X66405714Y-31729285D01*
X66477142Y-31372142D01*
X66548571Y-31157857D01*
X66620000Y-31015000D01*
X66762857Y-30800714D01*
X66834285Y-30729285D01*
D13*
G04 #@! TO.P,Q2,1*
G04 #@! TO.N,Net-(C1-Pad1)*
X90170000Y-72390000D03*
D14*
G04 #@! TO.P,Q2,3*
G04 #@! TO.N,Net-(D1-Pad2)*
X95250000Y-72390000D03*
G04 #@! TO.P,Q2,2*
G04 #@! TO.N,Net-(D1-Pad1)*
X92710000Y-72390000D03*
G04 #@! TD*
D13*
G04 #@! TO.P,Q1,1*
G04 #@! TO.N,Net-(D1-Pad1)*
X92710000Y-82550000D03*
D14*
G04 #@! TO.P,Q1,3*
G04 #@! TO.N,Net-(C1-Pad2)*
X92710000Y-87630000D03*
G04 #@! TO.P,Q1,2*
G04 #@! TO.N,Net-(Q1-Pad2)*
X92710000Y-85090000D03*
G04 #@! TD*
D15*
G04 #@! TO.P,J1,2*
G04 #@! TO.N,Net-(C1-Pad2)*
X73660000Y-86360000D03*
D16*
G04 #@! TO.P,J1,1*
G04 #@! TO.N,Net-(J1-Pad1)*
X73660000Y-83820000D03*
G04 #@! TD*
D17*
G04 #@! TO.P,R6,2*
G04 #@! TO.N,Net-(D1-Pad2)*
X80010000Y-67310000D03*
D18*
G04 #@! TO.P,R6,1*
G04 #@! TO.N,Net-(Q5-Pad1)*
X80010000Y-59690000D03*
G04 #@! TD*
D17*
G04 #@! TO.P,R5,2*
G04 #@! TO.N,Net-(D1-Pad2)*
X102870000Y-67310000D03*
D18*
G04 #@! TO.P,R5,1*
G04 #@! TO.N,Net-(Q4-Pad1)*
X102870000Y-59690000D03*
G04 #@! TD*
D17*
G04 #@! TO.P,R3,2*
G04 #@! TO.N,Net-(D1-Pad2)*
X91440000Y-67310000D03*
D18*
G04 #@! TO.P,R3,1*
G04 #@! TO.N,Net-(Q3-Pad1)*
X91440000Y-59690000D03*
G04 #@! TD*
D17*
G04 #@! TO.P,R2,2*
G04 #@! TO.N,Net-(D1-Pad1)*
X99060000Y-72390000D03*
D18*
G04 #@! TO.P,R2,1*
G04 #@! TO.N,Net-(C1-Pad1)*
X109220000Y-72390000D03*
G04 #@! TD*
D17*
G04 #@! TO.P,R1,2*
G04 #@! TO.N,Net-(J1-Pad1)*
X78740000Y-80010000D03*
D18*
G04 #@! TO.P,R1,1*
G04 #@! TO.N,Net-(Q1-Pad2)*
X88900000Y-80010000D03*
G04 #@! TD*
D19*
G04 #@! TO.P,Q5,3*
G04 #@! TO.N,Net-(C1-Pad2)*
X69850000Y-49530000D03*
G04 #@! TO.P,Q5,2*
G04 #@! TO.N,Net-(D2-Pad2)*
X69850000Y-52070000D03*
D20*
G04 #@! TO.P,Q5,1*
G04 #@! TO.N,Net-(Q5-Pad1)*
X69850000Y-54610000D03*
G04 #@! TD*
D19*
G04 #@! TO.P,Q4,3*
G04 #@! TO.N,Net-(C1-Pad2)*
X102870000Y-49530000D03*
G04 #@! TO.P,Q4,2*
G04 #@! TO.N,Net-(D2-Pad2)*
X102870000Y-52070000D03*
D20*
G04 #@! TO.P,Q4,1*
G04 #@! TO.N,Net-(Q4-Pad1)*
X102870000Y-54610000D03*
G04 #@! TD*
D19*
G04 #@! TO.P,Q3,3*
G04 #@! TO.N,Net-(C1-Pad2)*
X86360000Y-49530000D03*
G04 #@! TO.P,Q3,2*
G04 #@! TO.N,Net-(D2-Pad2)*
X86360000Y-52070000D03*
D20*
G04 #@! TO.P,Q3,1*
G04 #@! TO.N,Net-(Q3-Pad1)*
X86360000Y-54610000D03*
G04 #@! TD*
D21*
G04 #@! TO.P,L1,2*
G04 #@! TO.N,Net-(D2-Pad2)*
X102950000Y-26670000D03*
D22*
G04 #@! TO.P,L1,1*
G04 #@! TO.N,Net-(D2-Pad1)*
X107950000Y-26670000D03*
G04 #@! TD*
D21*
G04 #@! TO.P,J4,3*
G04 #@! TO.N,Net-(C1-Pad2)*
X118110000Y-83660000D03*
G04 #@! TO.P,J4,2*
G04 #@! TO.N,Net-(C1-Pad1)*
X118110000Y-78660000D03*
D22*
G04 #@! TO.P,J4,1*
G04 #@! TO.N,Net-(D2-Pad1)*
X118110000Y-73660000D03*
G04 #@! TD*
D23*
G04 #@! TO.P,D2,2*
G04 #@! TO.N,Net-(D2-Pad2)*
X95570000Y-39370000D03*
D24*
G04 #@! TO.P,D2,1*
G04 #@! TO.N,Net-(D2-Pad1)*
X115570000Y-39370000D03*
G04 #@! TD*
D25*
G04 #@! TO.P,D1,2*
G04 #@! TO.N,Net-(D1-Pad2)*
X106680000Y-80010000D03*
D26*
G04 #@! TO.P,D1,1*
G04 #@! TO.N,Net-(D1-Pad1)*
X99060000Y-80010000D03*
G04 #@! TD*
D18*
G04 #@! TO.P,C1,1*
G04 #@! TO.N,Net-(C1-Pad1)*
X74930000Y-72390000D03*
G04 #@! TO.P,C1,2*
G04 #@! TO.N,Net-(C1-Pad2)*
X69930000Y-72390000D03*
G04 #@! TD*
D27*
G04 #@! TO.N,*
X121920000Y-21590000D03*
X123190000Y-96520000D03*
X53340000Y-96520000D03*
D28*
X99060000Y-82550000D03*
D29*
X121920000Y-35560000D03*
D28*
X121920000Y-35560000D03*
D29*
X121920000Y-35560000D03*
D27*
X53340000Y-21590000D03*
G04 #@! TD*
D30*
G04 #@! TO.N,*
X66040000Y-52070000D02*
X68224990Y-52070000D01*
X64770000Y-52070000D02*
X68224990Y-52070000D01*
X68224990Y-52070000D02*
X63500000Y-52070000D01*
D31*
G04 #@! TO.N,Net-(C1-Pad2)*
X95950001Y-91840001D02*
X92710000Y-91840001D01*
X109929999Y-91840001D02*
X95950001Y-91840001D01*
D32*
X92710000Y-88900000D02*
X95650001Y-91840001D01*
D31*
X69179999Y-91840001D02*
X95650001Y-91840001D01*
D32*
X92710000Y-87630000D02*
X92710000Y-88900000D01*
D31*
X95650001Y-91840001D02*
X109929999Y-91840001D01*
D32*
X102850324Y-49530000D02*
X102860162Y-49520162D01*
X82550000Y-49530000D02*
X86360000Y-49530000D01*
X69850000Y-49530000D02*
X82550000Y-49530000D01*
X86360000Y-49530000D02*
X88900000Y-49530000D01*
X88900000Y-49530000D02*
X102850324Y-49530000D01*
X72790001Y-91840001D02*
X69179999Y-91840001D01*
X73660000Y-86360000D02*
X73660000Y-92710000D01*
X73660000Y-92710000D02*
X72790001Y-91840001D01*
D31*
X66040000Y-88700002D02*
X66040000Y-72390000D01*
X69179999Y-91840001D02*
X66040000Y-88700002D01*
X72390000Y-45720000D02*
X87630000Y-45720000D01*
X66040000Y-72390000D02*
X57444128Y-63794128D01*
X57444128Y-63794128D02*
X57444128Y-42885872D01*
X57444128Y-42885872D02*
X69555872Y-42885872D01*
X69555872Y-42885872D02*
X72390000Y-45720000D01*
X115410000Y-86360000D02*
X118110000Y-86360000D01*
X93980000Y-91440000D02*
X110330000Y-91440000D01*
X110330000Y-91440000D02*
X115410000Y-86360000D01*
G04 #@! TO.N,Net-(D2-Pad1)*
X118110000Y-41910000D02*
X118110000Y-71359999D01*
X115570000Y-39370000D02*
X118110000Y-41910000D01*
X110250001Y-31510001D02*
X110250001Y-26670000D01*
X115570000Y-39370000D02*
X115570000Y-36830000D01*
X115570000Y-36830000D02*
X110250001Y-31510001D01*
D33*
G04 #@! TO.N,Net-(C1-Pad1)*
X109220000Y-74930000D02*
X109220000Y-72390000D01*
X118110000Y-78660000D02*
X112950000Y-78660000D01*
X112950000Y-78660000D02*
X109220000Y-74930000D01*
D32*
X74930000Y-63500000D02*
X74930000Y-72390000D01*
X106680000Y-63500000D02*
X74930000Y-63500000D01*
X109220000Y-72390000D02*
X109220000Y-66040000D01*
X109220000Y-66040000D02*
X106680000Y-63500000D01*
X74930000Y-72390000D02*
X90170000Y-72390000D01*
G04 #@! TO.N,Net-(D1-Pad1)*
X99060000Y-72390000D02*
X99060000Y-80010000D01*
X92710000Y-82550000D02*
X92710000Y-76200000D01*
X92710000Y-80010000D02*
X99060000Y-80010000D01*
X92710000Y-72390000D02*
X92710000Y-80010000D01*
G04 #@! TO.N,Net-(Q1-Pad2)*
X88900000Y-80010000D02*
X88900000Y-85090000D01*
X88900000Y-85090000D02*
X92710000Y-85090000D01*
G04 #@! TO.N,Net-(D1-Pad2)*
X102870000Y-67310000D02*
X91440000Y-67310000D01*
X91440000Y-67310000D02*
X80010000Y-67310000D01*
X104140000Y-68580000D02*
X102870000Y-67310000D01*
X106680000Y-80010000D02*
X104140000Y-77470000D01*
X104140000Y-77470000D02*
X104140000Y-68580000D01*
X95250000Y-67310000D02*
X91440000Y-67310000D01*
X95250000Y-72390000D02*
X95250000Y-67310000D01*
G04 #@! TO.N,Net-(D2-Pad2)*
X97169999Y-40969999D02*
X97825871Y-40969999D01*
X95570000Y-39370000D02*
X97169999Y-40969999D01*
X103845872Y-52070000D02*
X102870000Y-52070000D01*
X95570000Y-39370000D02*
X97832741Y-39370000D01*
X86360000Y-52070000D02*
X102870000Y-52070000D01*
X69850000Y-52070000D02*
X86360000Y-52070000D01*
D31*
X95570000Y-39370000D02*
X102609508Y-39370000D01*
D32*
X102609508Y-39370000D02*
X106860171Y-43620663D01*
X102909990Y-52109990D02*
X106640010Y-52109990D01*
X102870000Y-52070000D02*
X102909990Y-52109990D01*
X106640010Y-47029990D02*
X109220000Y-44450000D01*
X109220000Y-44450000D02*
X109220000Y-41910000D01*
X106640010Y-52109990D02*
X106640010Y-47029990D01*
X106640010Y-52109990D02*
X107910010Y-52109990D01*
X107910010Y-52109990D02*
X107950000Y-52070000D01*
X107950000Y-52070000D02*
X107950000Y-46990000D01*
X109220000Y-52070000D02*
X107950000Y-52070000D01*
X109220000Y-44450000D02*
X109220000Y-52070000D01*
X106640010Y-43400502D02*
X105410000Y-42170492D01*
X106640010Y-47029990D02*
X106640010Y-43400502D01*
D31*
X95570000Y-32700000D02*
X101600000Y-26670000D01*
X95570000Y-39370000D02*
X95570000Y-32700000D01*
X106419508Y-43180000D02*
X106680000Y-43180000D01*
X102609508Y-39370000D02*
X106419508Y-43180000D01*
X97790000Y-34290000D02*
X105410000Y-41910000D01*
X97790000Y-31750000D02*
X97790000Y-34290000D01*
D32*
G04 #@! TO.N,Net-(Q3-Pad1)*
X86360000Y-54610000D02*
X91440000Y-59690000D01*
G04 #@! TO.N,Net-(Q4-Pad1)*
X102870000Y-59690000D02*
X102870000Y-54610000D01*
G04 #@! TO.N,Net-(Q5-Pad1)*
X74930000Y-59690000D02*
X69850000Y-54610000D01*
X80010000Y-59690000D02*
X74930000Y-59690000D01*
G04 #@! TO.N,Net-(J1-Pad1)*
X73660000Y-82720000D02*
X73660000Y-83820000D01*
X76370000Y-80010000D02*
X73660000Y-82720000D01*
X78740000Y-80010000D02*
X76370000Y-80010000D01*
G04 #@! TD*
M02*
