G04 #@! TF.GenerationSoftware,KiCad,Pcbnew,(5.0.2)-1*
G04 #@! TF.CreationDate,2019-07-23T23:18:17+02:00*
G04 #@! TF.ProjectId,Cern2,4365726e-322e-46b6-9963-61645f706362,rev?*
G04 #@! TF.SameCoordinates,Original*
G04 #@! TF.FileFunction,Profile,NP*
%FSLAX46Y46*%
G04 Gerber Fmt 4.6, Leading zero omitted, Abs format (unit mm)*
G04 Created by KiCad (PCBNEW (5.0.2)-1) date 23/07/2019 23:18:17*
%MOMM*%
%LPD*%
G01*
G04 APERTURE LIST*
%ADD10C,0.050000*%
G04 APERTURE END LIST*
D10*
X88900000Y-158750000D02*
X196850000Y-158750000D01*
X88900000Y-29210000D02*
X88900000Y-158750000D01*
X196850000Y-29210000D02*
X88900000Y-29210000D01*
X196850000Y-158750000D02*
X196850000Y-29210000D01*
M02*
