module gitlab.com/pastabox/go-sdk/log

go 1.20

require github.com/rs/zerolog v1.29.1

require (
	github.com/mattn/go-colorable v0.1.13 // indirect
	github.com/mattn/go-isatty v0.0.18 // indirect
	golang.org/x/sys v0.7.0 // indirect
)
