<?xml version="1.0" encoding="UTF-8" standalone="no"?>
<svg
   xmlns:dc="http://purl.org/dc/elements/1.1/"
   xmlns:cc="http://creativecommons.org/ns#"
   xmlns:rdf="http://www.w3.org/1999/02/22-rdf-syntax-ns#"
   xmlns:svg="http://www.w3.org/2000/svg"
   xmlns="http://www.w3.org/2000/svg"
   xmlns:xlink="http://www.w3.org/1999/xlink"
   xmlns:sodipodi="http://sodipodi.sourceforge.net/DTD/sodipodi-0.dtd"
   xmlns:inkscape="http://www.inkscape.org/namespaces/inkscape"
   version="1.1"
   x="0px"
   y="0px"
   viewBox="0 0 192 192"
   enable-background="new 0 0 128 128"
   xml:space="preserve"
   id="svg2"
   inkscape:version="0.92.1 r15371"
   sodipodi:docname="icon_w.svg"
   width="200"
   height="200"
   inkscape:export-filename="/home/xdev/src/frontend/src/pashinin/assets/img/icon.svg.png"
   inkscape:export-xdpi="96"
   inkscape:export-ydpi="96"><metadata
     id="metadata14"><rdf:RDF><cc:Work
         rdf:about=""><dc:format>image/svg+xml</dc:format><dc:type
           rdf:resource="http://purl.org/dc/dcmitype/StillImage" /><dc:title></dc:title></cc:Work></rdf:RDF></metadata><defs
     id="defs12"><linearGradient
       inkscape:collect="always"
       id="linearGradient4185"><stop
         style="stop-color:#324578;stop-opacity:1"
         offset="0"
         id="stop4187" /><stop
         style="stop-color:#709fff;stop-opacity:1"
         offset="1"
         id="stop4189" /></linearGradient><linearGradient
       inkscape:collect="always"
       xlink:href="#linearGradient4185"
       id="linearGradient4191"
       x1="100"
       y1="200"
       x2="100"
       y2="0"
       gradientUnits="userSpaceOnUse"
       gradientTransform="translate(-21.460393,-7.4023942)" /></defs><sodipodi:namedview
     pagecolor="#ffffff"
     bordercolor="#000000"
     borderopacity="1"
     objecttolerance="10"
     gridtolerance="10"
     guidetolerance="10"
     inkscape:pageopacity="0"
     inkscape:pageshadow="2"
     inkscape:window-width="1914"
     inkscape:window-height="1036"
     id="namedview10"
     showgrid="false"
     inkscape:zoom="2.8284271"
     inkscape:cx="80.238754"
     inkscape:cy="95.538817"
     inkscape:window-x="1280"
     inkscape:window-y="20"
     inkscape:window-maximized="0"
     inkscape:current-layer="svg2"
     borderlayer="true"
     inkscape:showpageshadow="false"
     inkscape:snap-page="true"
     inkscape:snap-bbox="true"
     inkscape:snap-grids="true"
     inkscape:snap-object-midpoints="true"
     units="px"
     fit-margin-top="0"
     fit-margin-left="0"
     fit-margin-right="0"
     fit-margin-bottom="0"><inkscape:grid
       type="xygrid"
       id="grid4181"
       originx="-21.460392"
       originy="-5.0975769"
       spacingx="1"
       spacingy="1" /></sodipodi:namedview><rect
     style="display:none;opacity:1;fill:url(#linearGradient4191);fill-opacity:1;stroke-width:0;stroke-miterlimit:4;stroke-dasharray:none"
     id="rect4183"
     width="200.04237"
     height="200.00647"
     x="-21.502758"
     y="-7.4023952"
     ry="13.483486"><title
       id="title4257">Rounded rect</title></rect><text
     xml:space="preserve"
     style="font-style:normal;font-variant:normal;font-weight:normal;font-stretch:normal;font-size:140.23876953px;line-height:0%;font-family:sans-serif;-inkscape-font-specification:'sans-serif, Normal';font-variant-ligatures:normal;font-variant-caps:normal;font-variant-numeric:normal;font-feature-settings:normal;text-align:start;letter-spacing:0px;word-spacing:0px;writing-mode:lr-tb;text-anchor:start;opacity:0.96700003;fill:#fdffff;fill-opacity:1;stroke:none;stroke-width:11.6856842px;stroke-linecap:butt;stroke-linejoin:miter;stroke-opacity:1;"
     x="17.515583"
     y="138.88287"
     id="text4157"
     transform="scale(0.91493795,1.0929703)"><tspan
       sodipodi:role="line"
       id="tspan4159"
       x="17.515583"
       y="138.88287"
       style="font-style:normal;font-variant:normal;font-weight:normal;font-stretch:normal;font-size:140.23876953px;line-height:125%;font-family:sans-serif;-inkscape-font-specification:'sans-serif, Normal';font-variant-ligatures:normal;font-variant-caps:normal;font-variant-numeric:normal;font-feature-settings:normal;text-align:start;writing-mode:lr-tb;text-anchor:start;fill:#fdffff;fill-opacity:1;stroke-width:11.6856842px;">01</tspan></text>
</svg>