<?xml version="1.0" standalone="no"?>
<!DOCTYPE svg PUBLIC "-//W3C//DTD SVG 20010904//EN"
 "http://www.w3.org/TR/2001/REC-SVG-20010904/DTD/svg10.dtd">
<svg version="1.0" xmlns="http://www.w3.org/2000/svg"
 width="700.000000pt" height="700.000000pt" viewBox="0 0 700.000000 700.000000"
 preserveAspectRatio="xMidYMid meet">
<metadata>
Created by potrace 1.11, written by Peter Selinger 2001-2013
</metadata>
<g transform="translate(0.000000,700.000000) scale(0.100000,-0.100000)"
fill="#000000" stroke="none">
<path d="M3114 6345 c-2 -5 -21 -66 -43 -135 -22 -69 -63 -197 -91 -285 -28
-88 -85 -266 -126 -395 -42 -129 -91 -283 -110 -342 -19 -60 -49 -156 -68
-215 -19 -60 -55 -173 -81 -253 -142 -442 -287 -897 -290 -912 -2 -9 -9 -26
-15 -37 -6 -12 -9 -21 -6 -21 2 0 -4 -24 -14 -52 -10 -29 -55 -168 -100 -308
-45 -140 -115 -361 -157 -490 -102 -319 -155 -484 -207 -648 -214 -670 -247
-774 -311 -972 -32 -96 -58 -179 -59 -185 -1 -5 -26 -84 -56 -175 -29 -91 -60
-190 -70 -220 l-17 -55 2207 0 2207 0 -7 25 c-8 26 -50 156 -118 370 -22 69
-75 233 -116 365 -42 132 -83 258 -90 280 -8 22 -25 76 -39 120 -37 119 -155
490 -182 570 -12 39 -48 151 -80 250 -31 99 -76 241 -100 315 -64 199 -182
571 -217 680 -16 52 -42 133 -58 180 -15 47 -46 146 -69 220 -24 74 -49 153
-56 175 -8 22 -44 135 -80 250 -37 116 -104 327 -150 470 -133 413 -226 706
-241 760 -8 28 -18 57 -21 65 -3 8 -7 20 -9 25 -2 6 -23 73 -48 150 -24 77
-65 205 -90 284 -25 79 -48 147 -52 150 -10 11 -766 7 -770 -4z m496 -1250
c50 -165 108 -356 130 -425 21 -69 61 -201 90 -295 28 -93 69 -226 90 -295 39
-126 169 -554 217 -710 14 -47 38 -125 53 -175 16 -49 40 -130 55 -180 15 -49
38 -124 50 -165 32 -102 79 -256 175 -570 44 -146 94 -308 110 -360 16 -52 47
-153 69 -225 22 -71 54 -174 70 -229 17 -54 29 -101 27 -105 -3 -5 -2486 -7
-2493 -2 -2 1 -12 -31 126 421 62 201 159 520 217 710 58 190 117 381 131 425
14 44 29 94 33 110 9 31 22 75 85 280 40 131 126 414 155 510 10 33 60 195
110 360 51 165 96 316 101 335 6 19 13 42 16 50 3 8 7 20 8 25 2 6 59 196 129
423 69 227 126 420 127 430 1 35 30 -48 119 -343z"/>
</g>
</svg>
