Nom Prénom	M117 Inst. l'infr. inform. d'une entreprise	M301 Appliquer les outils bureautiques	M304 Installer et configurer un PC mono-poste	M403 Impl. des procédures programmables	Moyenne	Mathématiques.	Sciences naturelles.	Moyenne	Pratique Mécanique	Pratique Assemblage Montage Câblage (a)	Pratique Assemblage Montage Câblage (b)	Pratique Programmation	Pratique Technique de mesure	Pratique Technique numérique	Technique de dessin	Moyenne
François Blanc	3.5	5.0	4.5	4.0	4.3	4.5	3.5	4.0	5.0	4.5	4.5	4.0	2.5	4.5	5.0	4.3
Pierre Rémy	5.5	5.5	5.5	6.0	5.6	5.0	5.5	5.3	5.5	5.5	5.5	5.5	5.0	5.0	4.5	5.2
Arao Jone	4.5	3.5	4.5	5.0	4.4	3.5	4.5	4.0	4.0	3.5	3.5	4.0	3.0	4.0	4.5	3.8
Barbey Lucie	4.5	4.0	5.0	5.0	4.6	4.0	5.0	4.5	5.0	5.5	5.5	4.5	4.5	4.5	4.5	4.9
Barbu Alain	4.5	1.0	5.0	5.0	3.9	4.0	4.0	4.0	4.5	4.5	5.0	5.0	4.5	5.0	4.5	4.7
Erneste Joseph	4.0	5.0	4.5	4.0	4.4	3.0	4.5	3.8	4.5	5.0	5.0	5.0	5.0	4.5	4.5	4.8
Fossil Clément	5.5	5.5	5.0	5.5	5.4	4.5	5.0	4.8	5.5	5.0	5.0	5.0	4.5	4.0	5.5	4.9
Main Pierre	4.5	5.5	5.5	5.0	5.1	5.0	4.0	4.5	3.5	4.5	4.5	4.0	4.0	3.5	4.0	4.0
Dumont Lucien	4.0	4.5	4.0	3.5	4.0	3.5	4.0	3.8	5.0	4.5	4.5	4.0	3.5	4.5	4.5	4.4
Jean Luc	3.5	5.5	4.5	3.5	4.3	3.0	4.0	3.5	5.0	4.5	5.5	3.0	4.5	5.0	5.0	4.6
Méty Antoine	4.0	5.0	5.5	5.5	5.0	2.5	4.0	3.3	4.5	4.5	4.5	5.5	3.5	4.5	4.0	4.4
Mifroid Stéphane	5.0	5.0	4.5	5.5	5.0	5.5	5.5	5.5	3.5	5.0	5.0	5.5	4.5	5.0	5.5	4.9
Neme Ruben	5.0	5.0	5.5	4.5	5.0	3.5	4.0	3.8	4.0	5.0	5.0	4.0	4.5	4.0	4.0	4.4
Péro Alban	5.0	5.0	5.5	5.5	5.3	5.0	5.0	5.0	5.5	5.0	4.5	6.0	5.5	4.5	4.0	5.0
Prec Tobias	4.5	5.0	5.0	5.5	5.0	4.5	5.5	5.0	5.0	5.0	5.0	5.5	4.5	4.5	4.5	4.9
Rose Sophie	5.0	5.5	5.5	6.0	5.5	6.0	5.0	5.5	4.5	5.0	5.0	5.5	5.0	4.5	4.5	4.9
Spoke Patrick	6.0	5.5	5.5	6.0	5.8	6.0	5.5	5.8	5.0	5.0	5.0	5.5	5.5	5.0	5.5	5.2
Rigolo Hervé	4.0	4.0	3.5	3.5	3.8	4.5	3.5	4.0	4.5	4.0	4.5	3.0	4.5	4.5	4.5	4.2
Taberne Marcial	5.0	4.5	5.5	5.5	5.1	4.5	5.5	5.0	5.0	5.0	5.0	5.0	6.0	4.0	4.5	4.9
Zul Zoé	3.5	4.0	5.0	5.0	4.4	2.5	4.0	3.3	4.0	4.0	4.0	5.0	4.0	4.5	2.5	4.0