// Jest Snapshot v1, https://goo.gl/fbAQLP

exports[`Test home route does the snapshot match 1`] = `
<div>
  <header>
    <div
      class="container"
    >
      <nav
        class="navbar navbar-expand-md navbar-light"
      >
        <span
          class="pt-3 navbar-brand"
        >
          <a
            href="/"
          >
            <img
              alt="Logo"
              class=""
              src="/img/logo.png"
            />
          </a>
        </span>
        <button
          aria-controls="basic-navbar-nav"
          aria-label="Toggle navigation"
          class="navbar-toggler collapsed"
          type="button"
        >
          <span
            class="navbar-toggler-icon"
          />
        </button>
        <div
          class="navbar-collapse collapse"
          id="basic-navbar-nav"
        >
          <div
            class="ml-auto mt-2 navbar-nav"
          >
            <a
              class="nav-link"
              href="#"
              role="button"
            >
              <b
                href="/"
              >
                JavaScript Testing Frameworks
                <br />
                   for automated Testing
              </b>
            </a>
          </div>
        </div>
      </nav>
    </div>
  </header>
  <main>
    <img
      alt="jumbo"
      class="img-fluid"
      src="/img/jumbotron.jpg"
    />
    <div
      class="col-8 mt-5 mx-auto jumbotron"
    >
      <h1>
        Automated software testing
      </h1>
      <p>
        Playground app for JavaScript testing libraries and frameworks used for automated software testing.
         
      </p>
    </div>
    <div
      class="container"
    >
      <div
        class="row-cols-1 row-cols-md-2 row-cols-xl-3 row"
      />
    </div>
    <div
      class="parallax paralsec"
    />
    <div
      class="container"
    >
      <div
        class="mt-3 p-3 mx-auto"
      >
        <h2>
          What is automated testing?
        </h2>
        <p>
          Automated testing helps to increase the quality of software by validate its functioning before it is moved to production.
        </p>
        <p>
          Predefined scripts for unit testing are executing during the deployment flow by the ci/cd pipeline automatically. E2E testing scripts then help the qa team to easily test the software, create the necessary reports and compare the results with the expected target.
        </p>
        <p>
          This procedure results in several benefits such as faster delivery, reducing manual testing efforts and higher software quality
        </p>
      </div>
    </div>
  </main>
  <footer
    class="footer mt-auto mx-auto py-3 bg-light"
  >
    <div
      class="container text-center"
    >
      <span
        class="text-muted text-center"
      >
        JacaScript testing guidelines - demo workspace
      </span>
    </div>
  </footer>
</div>
`;
