{
  "kind": "collectionType",
  "collectionName": "planets",
  "info": {
    "singularName": "planet",
    "pluralName": "planets",
    "displayName": "planet",
    "description": ""
  },
  "options": {
    "draftAndPublish": true
  },
  "pluginOptions": {},
  "attributes": {
    "name": {
      "type": "string"
    },
    "diameter": {
      "type": "integer"
    },
    "gravity": {
      "type": "string"
    },
    "terrain": {
      "type": "string"
    },
    "climate": {
      "type": "string"
    },
    "residents": {
      "type": "relation",
      "relation": "manyToMany",
      "target": "api::resident.resident",
      "inversedBy": "planets"
    }
  }
}
