{
  "kind": "collectionType",
  "collectionName": "residents",
  "info": {
    "singularName": "resident",
    "pluralName": "residents",
    "displayName": "resident",
    "description": ""
  },
  "options": {
    "draftAndPublish": true
  },
  "pluginOptions": {},
  "attributes": {
    "name": {
      "type": "string"
    },
    "planets": {
      "type": "relation",
      "relation": "manyToMany",
      "target": "api::planet.planet",
      "mappedBy": "residents"
    },
    "size": {
      "type": "decimal"
    },
    "sex": {
      "type": "string"
    },
    "birthday": {
      "type": "date"
    }
  }
}
