{
  "root": "apps/backend",
  "projectType": "application",
  "sourceRoot": "apps/backend/src",
  "targets": {
    "serve": {
      "executor": "@nx-extend/strapi:serve"
    },
    "build": {
      "executor": "@nx-extend/strapi:build",
      "configurations": {
        "production": {
          "production": true
        }
      }
    }
  },
  "tags": []
}
