{
  "__example_queues": [
    {
      "name": "ping",
      "port": 6381,
      "host": "127.0.0.1",
      "hostId": "Bull"
    }
  ],
  "queues": [
    {
      "name": "ping",
      "port": 6381,
      "host": "127.0.0.1",
      "hostId": "Bull"
    }
  ]
}
