<svg width="328" height="312" viewBox="0 0 328 312" fill="none" xmlns="http://www.w3.org/2000/svg">
<path d="M4.04199 50.214L88.18 50.083V4H165.865V50.083H246.181V113.283H160.599V307.887H88.18V114.987H4.06999L4.04199 50.214Z" fill="#AB1917" stroke="#AF231B" stroke-width="7"/>
<path d="M68.36 86.05C68.36 97.987 58.682 107.662 46.751 107.662C34.812 107.662 25.136 97.986 25.136 86.05C25.136 74.116 34.812 64.44 46.751 64.44C58.682 64.44 68.36 74.116 68.36 86.05Z" fill="white" stroke="#AF231B" stroke-width="7"/>
<path d="M4.06999 114.954L87.502 114.987L87.455 209.686L70.875 209.628V307.786H22.666V209.94L4 209.891L4.06999 114.954Z" fill="white" stroke="#AF231B" stroke-width="7"/>
<path d="M291.848 113.283V247.246H323.373L311.171 306.743H199.298L200.054 113.25L291.848 113.283Z" fill="#AB1917" stroke="#AF231B" stroke-width="7"/>
<path d="M216.105 259.464L252.343 259.576L245.456 307.842H160.599V113.283L245.952 113.241L251.997 163.507H215.891V189.332H243.738V232.722H216.184L216.105 259.464Z" fill="white" stroke="#AF231B" stroke-width="7"/>
</svg>
