# Object Export From Tinkercad Server 2015

mtllib obj.mtl

o obj_0
v 96 		71.374 		33.467
v 96 		66.217 		36.095
v 96 		60.5 		37
v 96 		54.783 		36.095
v 96 		49.626 		33.467
v -70 		11 		74.51
v -70.98 		11.048 		74.51
v 96 		78.095 		12.783
v 96 		79 		18.5
v 96 		78.095 		24.217
v -69.02 		11.048 		74.51
v 96 		75.467 		29.374
v -68.049 		11.192 		74.51
v 96 		45.533 		29.374
v 96 		42.905 		24.217
v 96 		42 		18.5
v 96 		42.905 		12.783
v -67.097 		11.431 		74.51
v 96 		66.217 		0.905
v 96 		71.374 		3.533
v 96 		75.467 		7.626
v -66.173 		11.761 		74.51
v 96 		45.533 		7.626
v 96 		49.626 		3.533
v 96 		54.783 		0.905
v 96 		60.5 		0
v -37 		30.5344 		74.51
v -37.097 		30.569 		74.51
v 96 		5 		10
v 96 		5 		0
v 96 		35 		0
v 96 		35 		10
v -84 		35 		10
v -84 		35 		0
v -84 		5 		0
v -38.049 		30.808 		74.51
v -84 		5 		10
v -65.536 		12.0626 		74.51
v -39.02 		30.952 		74.51
v -76.344 		13.27 		74.51
v -77.071 		28.071 		100
v -77.73 		27.344 		100
v -78.315 		26.556 		100
v -78.819 		25.714 		100
v -79.239 		24.827 		100
v -77 		13.8646 		74.51
v -40 		31 		74.51
v -40.96 		30.953 		74.51
v -79.569 		23.903 		100
v -79.808 		22.951 		100
v -79.952 		21.98 		100
v -80 		21 		100
v -79.952 		20.02 		100
v -79.808 		19.049 		100
v -40.98 		30.952 		74.51
v -79.569 		18.097 		100
v -79.239 		17.173 		100
v -41.951 		30.808 		74.51
v -78.819 		16.286 		100
v -78.315 		15.444 		100
v -77.73 		14.656 		100
v -77.071 		13.929 		100
v -42.903 		30.569 		74.51
v -75.556 		12.685 		74.51
v -43.827 		30.239 		74.51
v -74.714 		12.181 		74.51
v -44.714 		29.819 		74.51
v -73.827 		11.761 		74.51
v -45.556 		29.315 		74.51
v -73.728 		11.7256 		74.51
v -46 		28.9854 		74.51
v -60.761 		24.827 		74.51
v -60.6714 		24.576 		74.51
v -40 		11 		74.51
v -40.96 		11.047 		74.51
v -61.181 		25.714 		74.51
v -39.02 		11.048 		74.51
v -38.049 		11.192 		74.51
v -61.685 		26.556 		74.51
v -37.097 		11.431 		74.51
v -62.27 		27.344 		74.51
v -37 		11.4656 		74.51
v -62.929 		28.071 		74.51
v -45.556 		12.685 		74.51
v -63.656 		28.73 		74.51
v -44.714 		12.181 		74.51
v -64.444 		29.315 		74.51
v -43.827 		11.761 		74.51
v -65.286 		29.819 		74.51
v -42.903 		11.431 		74.51
v -65.536 		29.9374 		74.51
v -41.951 		11.192 		74.51
v -60.761 		17.173 		74.51
v -61.1346 		16.384 		74.51
v -40.98 		11.048 		74.51
v -60.431 		18.097 		74.51
v -60.192 		19.049 		74.51
v -60.048 		20.02 		74.51
v -60 		21 		74.51
v -60.048 		21.98 		74.51
v -60.192 		22.951 		74.51
v -60.431 		23.903 		74.51
v -66.173 		30.239 		74.51
v -67.097 		30.569 		74.51
v -68.049 		30.808 		74.51
v -69.02 		30.952 		74.51
v -70 		31 		74.51
v -70.98 		30.952 		74.51
v -71.951 		30.808 		74.51
v -72.903 		30.569 		74.51
v -73.728 		30.2744 		74.51
v -73.827 		30.239 		74.51
v -74.714 		29.819 		74.51
v -75.556 		29.315 		74.51
v -76.344 		28.73 		74.51
v -77 		28.1354 		74.51
v -65.286 		12.181 		74.51
v -64.444 		12.685 		74.51
v -63.656 		13.27 		74.51
v -62.929 		13.929 		74.51
v -62.27 		14.656 		74.51
v -61.685 		15.444 		74.51
v -61.181 		16.286 		74.51
v -72.903 		11.431 		74.51
v -71.951 		11.192 		74.51
v -77.071 		28.071 		74.51
v -77.73 		27.344 		74.51
v -78.315 		26.556 		74.51
v -78.819 		25.714 		74.51
v -79.239 		24.827 		74.51
v -79.3286 		24.576 		74.51
v -80 		21 		74.51
v -79.952 		20.02 		74.51
v -79.808 		19.049 		74.51
v -79.569 		18.097 		74.51
v -79.239 		17.173 		74.51
v -78.8654 		16.384 		74.51
v -79.569 		23.903 		74.51
v -79.808 		22.951 		74.51
v -79.952 		21.98 		74.51
v -8.192 		11.1708 		74.51
v -9.02 		11.048 		74.51
v -78.819 		16.286 		74.51
v -78.315 		15.444 		74.51
v -77.73 		14.656 		74.51
v -77.071 		13.929 		74.51
v -18.819 		16.286 		74.51
v -18.8654 		16.384 		74.51
v -18.315 		15.444 		74.51
v -17.73 		14.656 		74.51
v -17.071 		13.929 		74.51
v -16.384 		13.3063 		74.51
v -37 		35 		40
v 51.618 		19.824 		120
v 51.176 		19.382 		120
v 51.902 		20.382 		120
v 48.098 		20.382 		120
v 48.382 		19.824 		120
v 48.824 		19.382 		120
v 49.382 		19.098 		120
v 50 		19 		120
v -37 		30.5344 		10
v -37.097 		30.569 		10
v -38.049 		30.808 		10
v -39.02 		30.952 		10
v -40 		31 		10
v -40.96 		30.953 		10
v -40.98 		30.952 		10
v -41.951 		30.808 		10
v -42.903 		30.569 		10
v -43.827 		30.239 		10
v -44.714 		29.819 		10
v -45.556 		29.315 		10
v -46 		28.9854 		10
v -40.96 		11.047 		10
v -40 		11 		10
v -39.02 		11.048 		10
v -38.049 		11.192 		10
v -37.097 		11.431 		10
v -37 		11.4656 		10
v -45.556 		12.685 		10
v -44.714 		12.181 		10
v -43.827 		11.761 		10
v -42.903 		11.431 		10
v -41.951 		11.192 		10
v -40.98 		11.048 		10
v -37 		35 		10
v -37 		80 		40
v -37 		79 		18.5
v -37 		60.5 		37
v 59.3286 		24.576 		10
v 59.239 		24.827 		10
v 58.819 		25.714 		10
v 58.315 		26.556 		10
v 57.73 		27.344 		10
v 57.071 		28.071 		10
v 56.344 		28.73 		10
v 55.556 		29.315 		10
v 54.714 		29.819 		10
v -77 		28.1354 		10
v -77.071 		28.071 		10
v -77.73 		27.344 		10
v 53.827 		30.239 		10
v -78.315 		26.556 		10
v 52.903 		30.569 		10
v -78.819 		25.714 		10
v 51.951 		30.808 		10
v -79.239 		24.827 		10
v -79.3286 		24.576 		10
v 50.98 		30.952 		10
v -80 		21 		10
v -79.952 		20.02 		10
v 50 		31 		10
v -79.808 		19.049 		10
v -79.569 		18.097 		10
v 49.152 		30.9585 		10
v -79.239 		17.173 		10
v 58.8654 		16.384 		10
v -78.8654 		16.384 		10
v 59.239 		17.173 		10
v -79.569 		23.903 		10
v 59.569 		18.097 		10
v -79.808 		22.951 		10
v 59.808 		19.049 		10
v -79.952 		21.98 		10
v 59.952 		20.02 		10
v -78.819 		16.286 		10
v 60 		21 		10
v -78.315 		15.444 		10
v 59.952 		21.98 		10
v -77.73 		14.656 		10
v -77.071 		13.929 		10
v 59.808 		22.951 		10
v -77 		13.8646 		10
v -77 		80 		40
v 59.569 		23.903 		10
v -77 		35 		10
v -77 		35 		40
v -46.344 		28.73 		100
v -47.071 		28.071 		100
v -47.73 		27.344 		100
v -48.315 		26.556 		100
v -48.819 		25.714 		100
v 49.02 		30.952 		10
v 48.049 		30.808 		10
v -37 		48.927 		32.768
v -37 		49.626 		33.467
v -49.239 		24.827 		100
v -49.569 		23.903 		100
v -49.808 		22.951 		100
v -49.952 		21.98 		100
v -50 		21 		100
v -49.952 		20.02 		100
v -49.808 		19.049 		100
v -49.569 		18.097 		100
v -49.239 		17.173 		100
v -37 		54.783 		36.095
v -48.819 		16.286 		100
v -48.315 		15.444 		100
v -47.73 		14.656 		100
v -47.071 		13.929 		100
v -46.344 		13.27 		100
v -37 		66.217 		36.095
v -37 		71.374 		33.467
v -37 		75.467 		29.374
v -37 		78.095 		24.217
v -37 		78.095 		12.783
v -37 		42 		18.5
v -37 		42.905 		24.217
v -37 		45.533 		29.374
v -37 		42.905 		12.783
v -70 		11 		10
v -46 		5 		10
v -50 		21 		10
v -60 		35 		10
v -60 		21 		10
v -48.8654 		16.384 		10
v -49.152 		16.9893 		10
v -46.344 		28.73 		10
v -47.071 		28.071 		10
v -47.73 		27.344 		10
v -48.315 		26.556 		10
v -48.819 		25.714 		10
v -49.152 		25.0107 		10
v -49.952 		20.02 		10
v -49.808 		19.049 		10
v -49.569 		18.097 		10
v -49.239 		17.173 		10
v -49.239 		24.827 		10
v -49.569 		23.903 		10
v -49.808 		22.951 		10
v -49.952 		21.98 		10
v -49.152 		16.9893 		74.51
v -48.8654 		16.384 		74.51
v -48.819 		16.286 		10
v -48.315 		15.444 		10
v -46.344 		28.73 		74.51
v -47.73 		14.656 		10
v -47.071 		13.929 		10
v -47.071 		28.071 		74.51
v -46.344 		13.27 		10
v -47.73 		27.344 		74.51
v -48.315 		26.556 		74.51
v -70 		31 		10
v -48.819 		25.714 		74.51
v -60.761 		24.827 		10
v -60.6714 		24.576 		10
v -49.152 		25.0107 		74.51
v -61.181 		25.714 		10
v -50 		21 		74.51
v -49.952 		20.02 		74.51
v -61.685 		26.556 		10
v -62.27 		27.344 		10
v -49.808 		19.049 		74.51
v -62.929 		28.071 		10
v -49.569 		18.097 		74.51
v -63.656 		28.73 		10
v -64.444 		29.315 		10
v -49.239 		17.173 		74.51
v -65.286 		29.819 		10
v -65.536 		29.9374 		10
v -60.761 		17.173 		10
v -61.1346 		16.384 		10
v -49.239 		24.827 		74.51
v -60.431 		18.097 		10
v -49.569 		23.903 		74.51
v -60.192 		19.049 		10
v -49.808 		22.951 		74.51
v -49.952 		21.98 		74.51
v -48.819 		16.286 		74.51
v -48.315 		15.444 		74.51
v -47.73 		14.656 		74.51
v -47.071 		13.929 		74.51
v -46.344 		13.27 		74.51
v 47.097 		30.569 		10
v 46.173 		30.239 		10
v 45.286 		29.819 		10
v 44.444 		29.315 		10
v 43.656 		28.73 		10
v 42.929 		28.071 		10
v 42.27 		27.344 		10
v -60.048 		20.02 		10
v -60.048 		21.98 		10
v -60.192 		22.951 		10
v -60.431 		23.903 		10
v -66.173 		30.239 		10
v -67.097 		30.569 		10
v -68.049 		30.808 		10
v -69.02 		30.952 		10
v -70.98 		30.952 		10
v -71.951 		30.808 		10
v -72.903 		30.569 		10
v -73.728 		30.2744 		10
v -73.827 		30.239 		10
v -74.714 		29.819 		10
v -75.556 		29.315 		10
v -76.344 		28.73 		10
v -65.286 		12.181 		10
v -65.536 		12.0626 		10
v -64.444 		12.685 		10
v -63.656 		13.27 		10
v -62.929 		13.929 		10
v -62.27 		14.656 		10
v -61.685 		15.444 		10
v -61.181 		16.286 		10
v -72.903 		11.431 		10
v -73.728 		11.7256 		10
v -71.951 		11.192 		10
v -70.98 		11.048 		10
v -69.02 		11.048 		10
v -68.049 		11.192 		10
v -67.097 		11.431 		10
v -66.173 		11.761 		10
v -76.344 		13.27 		10
v -75.556 		12.685 		10
v -70 		23 		120
v -70.618 		22.902 		120
v -71.176 		22.618 		120
v -71.618 		22.176 		120
v -71.902 		21.618 		120
v -72 		21 		120
v -68 		21 		120
v -68.098 		21.618 		120
v -68.382 		22.176 		120
v -68.824 		22.618 		120
v -69.382 		22.902 		120
v -68.382 		19.824 		120
v -68.098 		20.382 		120
v -71.902 		20.382 		120
v -71.618 		19.824 		120
v -71.176 		19.382 		120
v -70.618 		19.098 		120
v -70 		19 		120
v -69.382 		19.098 		120
v -68.824 		19.382 		120
v -74.714 		12.181 		10
v -73.827 		11.761 		10
v -37 		5 		10
v 78 		5 		10
v 60 		11 		10
v 50 		11 		10
v 30 		11 		10
v 20 		11 		10
v 0 		11 		10
v -10 		11 		10
v -20 		35 		10
v -30 		21 		10
v -20 		21 		10
v 10 		35 		10
v 0 		21 		10
v 41.685 		26.556 		10
v 10 		21 		10
v 41.181 		25.714 		10
v 40.761 		24.827 		10
v 30 		35 		10
v 30 		21 		10
v 40.6714 		24.576 		10
v 40 		21 		10
v 40.048 		20.02 		10
v 70 		35 		10
v 70 		21 		10
v 77.097 		30.569 		10
v 78 		30.7957 		10
v 76.173 		30.239 		10
v 75.286 		29.819 		10
v 74.444 		29.315 		10
v 73.728 		28.7835 		10
v 73.656 		28.73 		10
v 72.929 		28.071 		10
v 72.27 		27.344 		10
v 71.685 		26.556 		10
v 71.181 		25.714 		10
v 70.761 		24.827 		10
v 70.6714 		24.576 		10
v 70.048 		20.02 		10
v 70.192 		19.049 		10
v 70.431 		18.097 		10
v 70.761 		17.173 		10
v 71.1346 		16.384 		10
v 70.431 		23.903 		10
v 70.192 		22.951 		10
v 70.048 		21.98 		10
v 71.181 		16.286 		10
v 40.192 		19.049 		10
v 71.685 		15.444 		10
v 40.431 		18.097 		10
v 72.27 		14.656 		10
v 72.929 		13.929 		10
v 40.761 		17.173 		10
v 73.656 		13.27 		10
v 41.1346 		16.384 		10
v 74.444 		12.685 		10
v 75.286 		12.181 		10
v 40.431 		23.903 		10
v 76.173 		11.761 		10
v 40.192 		22.951 		10
v 77.097 		11.431 		10
v 40.048 		21.98 		10
v 78 		11.2043 		10
v 49.152 		11.0415 		10
v 50.98 		11.048 		10
v 51.951 		11.192 		10
v 52.903 		11.431 		10
v 53.827 		11.761 		10
v 54.714 		12.181 		10
v 55.556 		12.685 		10
v 56.344 		13.27 		10
v 57.071 		13.929 		10
v 57.73 		14.656 		10
v 58.315 		15.444 		10
v 58.819 		16.286 		10
v 82.903 		30.569 		100
v 41.181 		16.286 		10
v 89.808 		19.049 		100
v 41.685 		15.444 		10
v 89.952 		20.02 		100
v 42.27 		14.656 		10
v 90 		21 		100
v 42.929 		13.929 		10
v 89.952 		21.98 		100
v 89.808 		22.951 		100
v 43.656 		13.27 		10
v 89.569 		23.903 		100
v 44.444 		12.685 		10
v 45.286 		12.181 		10
v 46.173 		11.761 		10
v 47.097 		11.431 		10
v 48.049 		11.192 		10
v 49.02 		11.048 		10
v 20 		23 		120
v 19.382 		22.902 		120
v 18.824 		22.618 		120
v 18.382 		22.176 		120
v 18.098 		21.618 		120
v 18 		21 		120
v 22 		21 		120
v 21.902 		21.618 		120
v 21.618 		22.176 		120
v 21.176 		22.618 		120
v 20.618 		22.902 		120
v 21.618 		19.824 		120
v 21.902 		20.382 		120
v 18.098 		20.382 		120
v 18.382 		19.824 		120
v 18.824 		19.382 		120
v 19.382 		19.098 		120
v 20 		19 		120
v 20.618 		19.098 		120
v 21.176 		19.382 		120
v -0.761 		24.827 		10
v -1.181 		25.714 		10
v -1.685 		26.556 		10
v -2.27 		27.344 		10
v -2.929 		28.071 		10
v -3.656 		28.73 		10
v -4.444 		29.315 		10
v -5.286 		29.819 		10
v -6.173 		30.239 		10
v -7.097 		30.569 		10
v -8.049 		30.808 		10
v -8.192 		30.8292 		10
v -1.1346 		16.384 		10
v -0.761 		17.173 		10
v -0.431 		18.097 		10
v -0.192 		19.049 		10
v -0.048 		20.02 		10
v -0.048 		21.98 		10
v -0.192 		22.951 		10
v -0.431 		23.903 		10
v -9.02 		30.952 		10
v -10 		31 		10
v -10.98 		30.952 		10
v -11.951 		30.808 		10
v -12.903 		30.569 		10
v -13.827 		30.239 		10
v -14.714 		29.819 		10
v -15.556 		29.315 		10
v -16.344 		28.73 		10
v -16.384 		28.6937 		10
v -19.952 		20.02 		10
v -19.808 		19.049 		10
v -19.569 		18.097 		10
v -19.239 		17.173 		10
v -18.8654 		16.384 		10
v -17.071 		28.071 		10
v -17.73 		27.344 		10
v -18.315 		26.556 		10
v -18.819 		25.714 		10
v -19.239 		24.827 		10
v -19.569 		23.903 		10
v -19.808 		22.951 		10
v -19.952 		21.98 		10
v -8.192 		11.1708 		10
v -8.049 		11.192 		10
v -7.097 		11.431 		10
v -6.173 		11.761 		10
v -5.286 		12.181 		10
v -4.444 		12.685 		10
v -3.656 		13.27 		10
v -2.929 		13.929 		10
v -2.27 		14.656 		10
v -1.685 		15.444 		10
v -1.181 		16.286 		10
v -16.384 		13.3063 		10
v -16.344 		13.27 		10
v -15.556 		12.685 		10
v -14.714 		12.181 		10
v -13.827 		11.761 		10
v -12.903 		11.431 		10
v -11.951 		11.192 		10
v -10.98 		11.048 		10
v -9.02 		11.048 		10
v -18.819 		16.286 		10
v -18.315 		15.444 		10
v -17.73 		14.656 		10
v -17.071 		13.929 		10
v -30.431 		23.903 		100
v -30.761 		24.827 		100
v -31.181 		25.714 		100
v -31.685 		26.556 		100
v -32.27 		27.344 		100
v -30.761 		17.173 		100
v -30.431 		18.097 		100
v -30.192 		19.049 		100
v -30.048 		20.02 		100
v -30 		21 		100
v -30.048 		21.98 		100
v -30.192 		22.951 		100
v -34.444 		29.315 		100
v -35.286 		29.819 		100
v -36.173 		30.239 		100
v -32.929 		28.071 		100
v -33.656 		28.73 		100
v -32.27 		14.656 		100
v -31.685 		15.444 		100
v -31.181 		16.286 		100
v -36.173 		11.761 		100
v -35.286 		12.181 		100
v -34.444 		12.685 		100
v -33.656 		13.27 		100
v -32.929 		13.929 		100
v 89.3286 		24.576 		74.51
v 89.239 		24.827 		74.51
v 88.819 		25.714 		74.51
v 88.315 		26.556 		74.51
v 87.73 		27.344 		74.51
v 87.071 		28.071 		74.51
v 86.344 		28.73 		74.51
v 85.556 		29.315 		74.51
v 84.714 		29.819 		74.51
v 83.827 		30.239 		74.51
v 82.903 		30.569 		74.51
v 82 		30.7957 		74.51
v -31.1346 		16.384 		74.51
v -30.761 		17.173 		74.51
v 89.7957 		19 		74.51
v 89.808 		19.049 		74.51
v 89.952 		20.02 		74.51
v -30.431 		18.097 		74.51
v 90 		21 		74.51
v -30.192 		19.049 		74.51
v 89.952 		21.98 		74.51
v -30.048 		20.02 		74.51
v 89.808 		22.951 		74.51
v 89.569 		23.903 		74.51
v -30 		21 		74.51
v -30.048 		21.98 		74.51
v -30.192 		22.951 		74.51
v -30.431 		23.903 		74.51
v -30.761 		24.827 		74.51
v -31.181 		25.714 		74.51
v -31.685 		26.556 		74.51
v -32.27 		27.344 		74.51
v -32.768 		27.8934 		74.51
v 29.3286 		24.576 		10
v 29.239 		24.827 		10
v 28.819 		25.714 		10
v 28.315 		26.556 		10
v 27.73 		27.344 		10
v 27.071 		28.071 		10
v 26.344 		28.73 		10
v 25.556 		29.315 		10
v 24.714 		29.819 		10
v 24.576 		29.8843 		10
v 23.827 		30.239 		10
v 22.903 		30.569 		10
v 21.951 		30.808 		10
v 20.98 		30.952 		10
v 20 		31 		10
v 19.02 		30.952 		10
v 18.049 		30.808 		10
v 17.097 		30.569 		10
v 28.8654 		16.384 		10
v 29.239 		17.173 		10
v 29.569 		18.097 		10
v 29.808 		19.049 		10
v 29.952 		20.02 		10
v 51.9175 		20.48 		100
v 52 		21 		100
v 51.902 		21.618 		100
v 51.618 		22.176 		100
v 51.176 		22.618 		100
v 50.618 		22.902 		100
v 50 		23 		100
v 49.382 		22.902 		100
v 49.152 		22.7849 		100
v 48.824 		22.618 		100
v 48.382 		22.176 		100
v 48.098 		21.618 		100
v 48 		21 		100
v 48.0825 		20.48 		100
v 50 		19 		100
v 50.618 		19.098 		100
v 51.176 		19.382 		100
v 51.618 		19.824 		100
v 51.902 		20.382 		100
v 48.098 		20.382 		100
v 48.382 		19.824 		100
v 48.824 		19.382 		100
v 49.152 		19.2151 		100
v 49.382 		19.098 		100
v 53.827 		30.239 		100
v 52.903 		30.569 		100
v 59.239 		24.827 		100
v 58.819 		25.714 		100
v 58.315 		26.556 		100
v 57.73 		27.344 		100
v 57.071 		28.071 		100
v 56.344 		28.73 		100
v 55.556 		29.315 		100
v 54.714 		29.819 		100
v 50 		31 		100
v 51.951 		30.808 		100
v 50.98 		30.952 		100
v 59.239 		17.173 		100
v 59.569 		18.097 		100
v 60 		21 		100
v 59.952 		21.98 		100
v 59.808 		22.951 		100
v 59.569 		23.903 		100
v 59.808 		19.049 		100
v 59.952 		20.02 		100
v 89.3286 		24.576 		10
v 89.239 		24.827 		10
v 88.819 		25.714 		10
v 88.315 		26.556 		10
v 87.73 		27.344 		10
v 87.071 		28.071 		10
v 86.344 		28.73 		10
v 85.556 		29.315 		10
v 84.714 		29.819 		10
v 83.827 		30.239 		10
v 82.903 		30.569 		10
v 82 		30.7957 		10
v 89.7957 		19 		10
v 89.808 		19.049 		10
v 89.952 		20.02 		10
v 90 		21 		10
v 89.952 		21.98 		10
v 89.808 		22.951 		10
v 89.569 		23.903 		10
v 47.097 		30.569 		100
v 46.173 		30.239 		100
v 45.286 		29.819 		100
v 44.444 		29.315 		100
v 43.656 		28.73 		100
v 42.929 		28.071 		100
v 42.27 		27.344 		100
v 41.685 		26.556 		100
v 41.181 		25.714 		100
v 40.761 		24.827 		100
v 81.951 		30.808 		100
v 49.02 		30.952 		100
v 48.049 		30.808 		100
v 80 		31 		100
v 79.02 		30.952 		100
v 78.049 		30.808 		100
v 80.98 		30.952 		100
v 80 		23 		100
v 40.431 		23.903 		100
v 40.192 		22.951 		100
v 40.048 		21.98 		100
v 40 		21 		100
v 40.048 		20.02 		100
v 40.192 		19.049 		100
v 40.431 		18.097 		100
v 40.761 		17.173 		100
v 29.952 		21.98 		10
v 29.808 		22.951 		10
v 77.097 		30.569 		100
v 76.173 		30.239 		100
v 29.569 		23.903 		10
v 75.286 		29.819 		100
v 74.444 		29.315 		100
v 73.656 		28.73 		100
v 72.929 		28.071 		100
v 72.27 		27.344 		100
v 71.685 		26.556 		100
v 71.181 		25.714 		100
v 70.761 		24.827 		100
v 16.173 		30.239 		10
v 15.286 		29.819 		10
v 14.444 		29.315 		10
v 70.431 		23.903 		100
v 70.192 		22.951 		100
v 70.048 		21.98 		100
v 70 		21 		100
v 70.048 		20.02 		100
v 70.192 		19.049 		100
v 70.431 		18.097 		100
v 13.656 		28.73 		10
v 70.761 		17.173 		100
v 78 		21 		100
v 12.929 		28.071 		10
v 56.344 		13.27 		100
v 57.071 		13.929 		100
v 57.73 		14.656 		100
v 58.315 		15.444 		100
v 58.819 		16.286 		100
v 12.27 		27.344 		10
v 50 		11 		100
v 50.98 		11.048 		100
v 51.951 		11.192 		100
v 52.903 		11.431 		100
v 53.827 		11.761 		100
v 54.714 		12.181 		100
v 55.556 		12.685 		100
v 11.685 		26.556 		10
v 11.181 		25.714 		10
v 71.181 		16.286 		100
v 71.685 		15.444 		100
v 72.27 		14.656 		100
v 72.929 		13.929 		100
v 73.656 		13.27 		100
v 74.444 		12.685 		100
v 75.286 		12.181 		100
v 76.173 		11.761 		100
v 77.097 		11.431 		100
v 10.761 		24.827 		10
v 41.181 		16.286 		100
v 41.685 		15.444 		100
v 42.27 		14.656 		100
v 42.929 		13.929 		100
v 43.656 		13.27 		100
v 44.444 		12.685 		100
v 45.286 		12.181 		100
v 46.173 		11.761 		100
v 47.097 		11.431 		100
v 10.048 		20.02 		10
v 48.049 		11.192 		100
v 49.02 		11.048 		100
v 10.192 		19.049 		10
v 10.431 		18.097 		10
v 10.761 		17.173 		10
v 11.1346 		16.384 		10
v 10.431 		23.903 		10
v 10.192 		22.951 		10
v 10.048 		21.98 		10
v 24.714 		12.181 		10
v 24.576 		12.1157 		10
v 25.556 		12.685 		10
v 26.344 		13.27 		10
v 27.071 		13.929 		10
v 27.73 		14.656 		10
v 28.315 		15.444 		10
v 28.819 		16.286 		10
v 17.097 		11.431 		10
v 16.384 		11.6856 		10
v 18.049 		11.192 		10
v 19.02 		11.048 		10
v 20.98 		11.048 		10
v 21.951 		11.192 		10
v 22.903 		11.431 		10
v 23.827 		11.761 		10
v 11.181 		16.286 		10
v 11.685 		15.444 		10
v 12.27 		14.656 		10
v 12.929 		13.929 		10
v 13.656 		13.27 		10
v 14.444 		12.685 		10
v 15.286 		12.181 		10
v 16.173 		11.761 		10
v -10 		23 		120
v -10.618 		22.902 		120
v -11.176 		22.618 		120
v -11.618 		22.176 		120
v -11.902 		21.618 		120
v -12 		21 		120
v -8 		21 		120
v -8.098 		21.618 		120
v -8.382 		22.176 		120
v -8.824 		22.618 		120
v -9.382 		22.902 		120
v -8.382 		19.824 		120
v -8.098 		20.382 		120
v -11.902 		20.382 		120
v -11.618 		19.824 		120
v -11.176 		19.382 		120
v -10.618 		19.098 		120
v -10 		19 		120
v -9.382 		19.098 		120
v -8.824 		19.382 		120
v 21.9175 		20.48 		100
v 22 		21 		100
v 21.902 		21.618 		100
v 21.618 		22.176 		100
v 21.176 		22.618 		100
v 20.618 		22.902 		100
v 20 		23 		100
v 19.382 		22.902 		100
v 18.824 		22.618 		100
v 18.382 		22.176 		100
v 18.098 		21.618 		100
v 18 		21 		100
v 18.0825 		20.48 		100
v 20 		19 		100
v 20.618 		19.098 		100
v 21.176 		19.382 		100
v 21.618 		19.824 		100
v 21.902 		20.382 		100
v 18.098 		20.382 		100
v 18.382 		19.824 		100
v 18.824 		19.382 		100
v 19.382 		19.098 		100
v 27.73 		27.344 		100
v 27.071 		28.071 		100
v 26.344 		28.73 		100
v 25.556 		29.315 		100
v 24.714 		29.819 		100
v 29.239 		24.827 		100
v 28.819 		25.714 		100
v 28.315 		26.556 		100
v 17.097 		30.569 		100
v 23.827 		30.239 		100
v 22.903 		30.569 		100
v 20 		31 		100
v 19.02 		30.952 		100
v 18.049 		30.808 		100
v 21.951 		30.808 		100
v 20.98 		30.952 		100
v -68.0825 		20.48 		100
v -68 		21 		100
v -68.098 		21.618 		100
v -68.382 		22.176 		100
v -68.824 		22.618 		100
v 29.239 		17.173 		100
v 29.569 		18.097 		100
v -69.382 		22.902 		100
v -70 		23 		100
v -70.618 		22.902 		100
v 30 		21 		100
v 29.952 		21.98 		100
v 29.808 		22.951 		100
v -71.176 		22.618 		100
v 29.569 		23.903 		100
v -71.618 		22.176 		100
v 29.808 		19.049 		100
v 29.952 		20.02 		100
v -71.902 		21.618 		100
v -72 		21 		100
v -71.9175 		20.48 		100
v -70 		19 		100
v -69.382 		19.098 		100
v -68.824 		19.382 		100
v -68.382 		19.824 		100
v -68.098 		20.382 		100
v -71.902 		20.382 		100
v -71.618 		19.824 		100
v -71.176 		19.382 		100
v -70.618 		19.098 		100
v -62.27 		27.344 		100
v -62.929 		28.071 		100
v -63.656 		28.73 		100
v -64.444 		29.315 		100
v -65.286 		29.819 		100
v -60.761 		24.827 		100
v -61.181 		25.714 		100
v -61.685 		26.556 		100
v -60.761 		17.173 		100
v -60.431 		18.097 		100
v -60 		21 		100
v -60.048 		21.98 		100
v -60.192 		22.951 		100
v -60.431 		23.903 		100
v 81.951 		30.808 		74.51
v 81.92 		30.8126 		74.51
v 80.98 		30.952 		74.51
v 80 		31 		74.51
v 79.02 		30.952 		74.51
v -30.761 		17.173 		10
v 78.049 		30.808 		74.51
v -31.1346 		16.384 		10
v -30.431 		18.097 		10
v 78 		30.7957 		74.51
v -30.192 		19.049 		10
v -30.048 		20.02 		10
v -30.048 		21.98 		10
v -30.192 		22.951 		10
v -30.431 		23.903 		10
v -30.761 		24.827 		10
v -31.181 		25.714 		10
v -31.685 		26.556 		10
v -32.27 		27.344 		10
v -32.768 		27.8934 		10
v -32.929 		28.071 		10
v -33.656 		28.73 		10
v -34.444 		29.315 		10
v -32.929 		28.071 		74.51
v -35.286 		29.819 		10
v -36.173 		30.239 		10
v -33.656 		28.73 		74.51
v -34.444 		29.315 		74.51
v -32.27 		14.656 		10
v -32.768 		14.1066 		10
v -35.286 		29.819 		74.51
v -36.173 		30.239 		74.51
v -31.685 		15.444 		10
v -31.181 		16.286 		10
v -32.27 		14.656 		74.51
v -32.768 		14.1066 		74.51
v -31.685 		15.444 		74.51
v -31.181 		16.286 		74.51
v -36.173 		11.761 		10
v -35.286 		12.181 		10
v -34.444 		12.685 		10
v -36.173 		11.761 		74.51
v -33.656 		13.27 		10
v -35.286 		12.181 		74.51
v -32.929 		13.929 		10
v -34.444 		12.685 		74.51
v 80 		11 		10
v -33.656 		13.27 		74.51
v -32.929 		13.929 		74.51
v 89.239 		17.173 		10
v 88.8654 		16.384 		10
v 89.569 		18.097 		10
v 81.951 		11.192 		10
v 81.92 		11.1874 		10
v 82.903 		11.431 		10
v 83.827 		11.761 		10
v 84.714 		12.181 		10
v 85.556 		12.685 		10
v 86.344 		13.27 		10
v 87.071 		13.929 		10
v 87.73 		14.656 		10
v 88.315 		15.444 		10
v 88.819 		16.286 		10
v 78.049 		11.192 		10
v 79.02 		11.048 		10
v 80.98 		11.048 		10
v 81.951 		30.808 		10
v 81.92 		30.8126 		10
v 80.98 		30.952 		10
v 80 		31 		10
v 79.02 		30.952 		10
v 78.049 		30.808 		10
v 80 		23 		120
v 79.382 		22.902 		120
v 78.824 		22.618 		120
v 78.382 		22.176 		120
v 78.098 		21.618 		120
v 78 		21 		120
v 82 		21 		120
v 81.902 		21.618 		120
v 81.618 		22.176 		120
v 81.176 		22.618 		120
v 80.618 		22.902 		120
v 81.618 		19.824 		120
v 81.902 		20.382 		120
v 78.098 		20.382 		120
v 78.382 		19.824 		120
v 78.824 		19.382 		120
v 79.382 		19.098 		120
v 80 		19 		120
v 80.618 		19.098 		120
v 81.176 		19.382 		120
v -77 		80 		0
v -77 		35 		0
v -37 		35 		0
v -37 		80 		0
v -37 		60.5 		0
v -37 		75.467 		7.626
v -37 		71.374 		3.533
v -37 		66.217 		0.905
v -37 		54.783 		0.905
v -37 		49.626 		3.533
v -37 		45.533 		7.626
v -8.0825 		20.48 		100
v -8 		21 		100
v -8.098 		21.618 		100
v -8.192 		21.8027 		100
v -8.382 		22.176 		100
v -8.824 		22.618 		100
v -9.382 		22.902 		100
v -10 		23 		100
v -10.618 		22.902 		100
v -11.176 		22.618 		100
v -11.618 		22.176 		100
v -11.902 		21.618 		100
v -12 		21 		100
v 77.097 		30.569 		74.51
v 76.173 		30.239 		74.51
v 75.286 		29.819 		74.51
v 74.444 		29.315 		74.51
v 73.656 		28.73 		74.51
v 72.929 		28.071 		74.51
v 72.27 		27.344 		74.51
v 71.685 		26.556 		74.51
v 71.181 		25.714 		74.51
v 70.761 		24.827 		74.51
v 70.6714 		24.576 		74.51
v 70 		21 		74.51
v 70.048 		20.02 		74.51
v 70.192 		19.049 		74.51
v 70.431 		18.097 		74.51
v 70.761 		17.173 		74.51
v 71.1346 		16.384 		74.51
v 70.431 		23.903 		74.51
v 70.192 		22.951 		74.51
v 70.048 		21.98 		74.51
v 71.181 		16.286 		74.51
v 71.685 		15.444 		74.51
v 72.27 		14.656 		74.51
v 72.929 		13.929 		74.51
v 73.656 		13.27 		74.51
v 89.239 		17.173 		100
v 89.569 		18.097 		100
v -60.192 		19.049 		100
v -60.048 		20.02 		100
v -72.903 		30.569 		100
v 80 		19 		100
v -66.173 		30.239 		100
v -67.097 		30.569 		100
v 86.344 		13.27 		100
v 87.071 		13.929 		100
v 87.73 		14.656 		100
v 88.315 		15.444 		100
v 88.819 		16.286 		100
v 81.951 		11.192 		100
v 82.903 		11.431 		100
v 83.827 		11.761 		100
v 84.714 		12.181 		100
v 85.556 		12.685 		100
v -70 		31 		100
v -70.98 		30.952 		100
v -71.951 		30.808 		100
v 80 		11 		100
v -68.049 		30.808 		100
v 80.98 		11.048 		100
v -69.02 		30.952 		100
v 78.049 		11.192 		100
v 79.02 		11.048 		100
v -73.827 		30.239 		100
v -74.714 		29.819 		100
v -75.556 		29.315 		100
v -76.344 		28.73 		100
v -63.656 		13.27 		100
v -62.929 		13.929 		100
v -62.27 		14.656 		100
v -61.685 		15.444 		100
v -61.181 		16.286 		100
v -65.286 		12.181 		100
v -64.444 		12.685 		100
v -72.903 		11.431 		100
v -70 		11 		100
v -69.02 		11.048 		100
v -68.049 		11.192 		100
v -67.097 		11.431 		100
v -66.173 		11.761 		100
v -71.951 		11.192 		100
v -70.98 		11.048 		100
v -76.344 		13.27 		100
v -75.556 		12.685 		100
v -74.714 		12.181 		100
v -73.827 		11.761 		100
v 16.173 		30.239 		100
v 15.286 		29.819 		100
v 14.444 		29.315 		100
v 13.656 		28.73 		100
v 12.929 		28.071 		100
v 12.27 		27.344 		100
v 11.685 		26.556 		100
v 11.181 		25.714 		100
v 10.761 		24.827 		100
v -11.9175 		20.48 		100
v 10.431 		23.903 		100
v 10.192 		22.951 		100
v 10.048 		21.98 		100
v 10 		21 		100
v 10.048 		20.02 		100
v 10.192 		19.049 		100
v 10.431 		18.097 		100
v 10.761 		17.173 		100
v -10 		19 		100
v -9.382 		19.098 		100
v -8.824 		19.382 		100
v 26.344 		13.27 		100
v 27.071 		13.929 		100
v 27.73 		14.656 		100
v 28.315 		15.444 		100
v 28.819 		16.286 		100
v 24.714 		12.181 		100
v -8.382 		19.824 		100
v 25.556 		12.685 		100
v -8.098 		20.382 		100
v 17.097 		11.431 		100
v -8.192 		20.1973 		100
v 20 		11 		100
v 20.98 		11.048 		100
v 21.951 		11.192 		100
v 22.903 		11.431 		100
v 23.827 		11.761 		100
v 18.049 		11.192 		100
v 19.02 		11.048 		100
v -11.902 		20.382 		100
v -11.618 		19.824 		100
v 13.656 		13.27 		100
v 14.444 		12.685 		100
v 15.286 		12.181 		100
v 16.173 		11.761 		100
v 11.181 		16.286 		100
v 11.685 		15.444 		100
v 12.27 		14.656 		100
v 12.929 		13.929 		100
v -11.176 		19.382 		100
v -10.618 		19.098 		100
v -6.173 		30.239 		100
v -7.097 		30.569 		100
v -0.761 		24.827 		100
v -1.181 		25.714 		100
v -1.685 		26.556 		100
v -2.27 		27.344 		100
v -2.929 		28.071 		100
v -3.656 		28.73 		100
v -4.444 		29.315 		100
v -5.286 		29.819 		100
v 74.444 		12.685 		74.51
v -8.049 		30.808 		100
v 75.286 		12.181 		74.51
v -0.761 		17.173 		100
v -0.431 		18.097 		100
v 76.173 		11.761 		74.51
v 77.097 		11.431 		74.51
v 0 		21 		100
v -0.048 		21.98 		100
v -0.192 		22.951 		100
v -0.431 		23.903 		100
v 78 		11.2043 		74.51
v -0.192 		19.049 		100
v -0.048 		20.02 		100
v -12.903 		30.569 		100
v -13.827 		30.239 		100
v -14.714 		29.819 		100
v -15.556 		29.315 		100
v -16.344 		28.73 		100
v -10 		31 		100
v -10.98 		30.952 		100
v -11.951 		30.808 		100
v -9.02 		30.952 		100
v 82 		21 		100
v 81.9175 		20.48 		100
v 81.902 		21.618 		100
v 81.618 		22.176 		100
v 81.176 		22.618 		100
v 80.618 		22.902 		100
v 79.382 		22.902 		100
v 78.824 		22.618 		100
v 78.382 		22.176 		100
v 78.098 		21.618 		100
v 78.0825 		20.48 		100
v 80.618 		19.098 		100
v 81.176 		19.382 		100
v 81.618 		19.824 		100
v 81.902 		20.382 		100
v 78.098 		20.382 		100
v 78.382 		19.824 		100
v 78.824 		19.382 		100
v 79.382 		19.098 		100
v -40 		23 		120
v -40.618 		22.902 		120
v -41.176 		22.618 		120
v -41.618 		22.176 		120
v -41.902 		21.618 		120
v -42 		21 		120
v -38 		21 		120
v -38.098 		21.618 		120
v -38.382 		22.176 		120
v -38.824 		22.618 		120
v -39.382 		22.902 		120
v -38.382 		19.824 		120
v -38.098 		20.382 		120
v -41.902 		20.382 		120
v -41.618 		19.824 		120
v -41.176 		19.382 		120
v -40.618 		19.098 		120
v -40 		19 		120
v -39.382 		19.098 		120
v -38.824 		19.382 		120
v -17.071 		28.071 		100
v -17.73 		27.344 		100
v -18.315 		26.556 		100
v -18.819 		25.714 		100
v -19.239 		24.827 		100
v -19.569 		23.903 		100
v -19.808 		22.951 		100
v -19.952 		21.98 		100
v -20 		21 		100
v -19.952 		20.02 		100
v -19.808 		19.049 		100
v -19.569 		18.097 		100
v -19.239 		17.173 		100
v -3.656 		13.27 		100
v -2.929 		13.929 		100
v -2.27 		14.656 		100
v -1.685 		15.444 		100
v -1.181 		16.286 		100
v -8.049 		11.192 		100
v -7.097 		11.431 		100
v -6.173 		11.761 		100
v -5.286 		12.181 		100
v -4.444 		12.685 		100
v -16.344 		13.27 		100
v -15.556 		12.685 		100
v -14.714 		12.181 		100
v -13.827 		11.761 		100
v -12.903 		11.431 		100
v -10 		11 		100
v -9.02 		11.048 		100
v -11.951 		11.192 		100
v -10.98 		11.048 		100
v -18.819 		16.286 		100
v -18.315 		15.444 		100
v -17.73 		14.656 		100
v -17.071 		13.929 		100
v 59.3286 		24.576 		74.51
v 59.239 		24.827 		74.51
v 58.819 		25.714 		74.51
v 58.315 		26.556 		74.51
v 57.73 		27.344 		74.51
v 57.071 		28.071 		74.51
v 56.344 		28.73 		74.51
v 55.556 		29.315 		74.51
v 54.714 		29.819 		74.51
v 53.827 		30.239 		74.51
v 52.903 		30.569 		74.51
v 51.951 		30.808 		74.51
v 50.98 		30.952 		74.51
v 50 		31 		74.51
v 50 		23 		120
v 49.382 		22.902 		120
v 48.824 		22.618 		120
v 48.382 		22.176 		120
v 48.098 		21.618 		120
v 48 		21 		120
v 52 		21 		120
v 51.902 		21.618 		120
v 49.152 		30.9585 		74.51
v 51.618 		22.176 		120
v 51.176 		22.618 		120
v 50.618 		22.902 		120
v 58.8654 		16.384 		74.51
v 59.239 		17.173 		74.51
v 59.569 		18.097 		74.51
v 50.618 		19.098 		120
v 59.808 		19.049 		74.51
v 59.952 		20.02 		74.51
v 60 		21 		74.51
v 59.952 		21.98 		74.51
v 59.808 		22.951 		74.51
v 59.569 		23.903 		74.51
v 49.02 		30.952 		74.51
v 48.049 		30.808 		74.51
v 47.097 		30.569 		74.51
v 46.173 		30.239 		74.51
v 45.286 		29.819 		74.51
v 44.444 		29.315 		74.51
v 43.656 		28.73 		74.51
v 42.929 		28.071 		74.51
v 42.27 		27.344 		74.51
v 41.685 		26.556 		74.51
v 41.181 		25.714 		74.51
v 40.761 		24.827 		74.51
v 40.6714 		24.576 		74.51
v 40 		21 		74.51
v 40.048 		20.02 		74.51
v 40.192 		19.049 		74.51
v 40.431 		18.097 		74.51
v 40.761 		17.173 		74.51
v 41.1346 		16.384 		74.51
v 40.431 		23.903 		74.51
v 40.192 		22.951 		74.51
v 40.048 		21.98 		74.51
v 49.152 		11.0415 		74.51
v 50 		11 		74.51
v 50.98 		11.048 		74.51
v 51.951 		11.192 		74.51
v 52.903 		11.431 		74.51
v 53.827 		11.761 		74.51
v 54.714 		12.181 		74.51
v 55.556 		12.685 		74.51
v 56.344 		13.27 		74.51
v 57.071 		13.929 		74.51
v 57.73 		14.656 		74.51
v 58.315 		15.444 		74.51
v 58.819 		16.286 		74.51
v 41.181 		16.286 		74.51
v 41.685 		15.444 		74.51
v 42.27 		14.656 		74.51
v 88.8654 		16.384 		74.51
v 89.239 		17.173 		74.51
v 89.569 		18.097 		74.51
v 81.92 		11.1874 		74.51
v 81.951 		11.192 		74.51
v 82.903 		11.431 		74.51
v 83.827 		11.761 		74.51
v 84.714 		12.181 		74.51
v 85.556 		12.685 		74.51
v 86.344 		13.27 		74.51
v 87.071 		13.929 		74.51
v 87.73 		14.656 		74.51
v 88.315 		15.444 		74.51
v 88.819 		16.286 		74.51
v 78.049 		11.192 		74.51
v 79.02 		11.048 		74.51
v 80 		11 		74.51
v 80.98 		11.048 		74.51
v 42.929 		13.929 		74.51
v 43.656 		13.27 		74.51
v 44.444 		12.685 		74.51
v 45.286 		12.181 		74.51
v 46.173 		11.761 		74.51
v 47.097 		11.431 		74.51
v 48.049 		11.192 		74.51
v 49.02 		11.048 		74.51
v 29.3286 		24.576 		74.51
v 29.239 		24.827 		74.51
v 28.819 		25.714 		74.51
v 28.315 		26.556 		74.51
v 27.73 		27.344 		74.51
v 27.071 		28.071 		74.51
v 26.344 		28.73 		74.51
v 25.556 		29.315 		74.51
v 24.714 		29.819 		74.51
v 24.576 		29.8843 		74.51
v 23.827 		30.239 		74.51
v 22.903 		30.569 		74.51
v 21.951 		30.808 		74.51
v 20.98 		30.952 		74.51
v 20 		31 		74.51
v 19.02 		30.952 		74.51
v 18.049 		30.808 		74.51
v 17.097 		30.569 		74.51
v 28.8654 		16.384 		74.51
v 29.239 		17.173 		74.51
v 29.569 		18.097 		74.51
v 29.808 		19.049 		74.51
v 29.952 		20.02 		74.51
v 30 		21 		74.51
v 29.952 		21.98 		74.51
v 29.808 		22.951 		74.51
v 29.569 		23.903 		74.51
v 16.173 		30.239 		74.51
v 15.286 		29.819 		74.51
v 14.444 		29.315 		74.51
v 13.656 		28.73 		74.51
v 12.929 		28.071 		74.51
v 12.27 		27.344 		74.51
v 11.685 		26.556 		74.51
v 11.181 		25.714 		74.51
v 10.761 		24.827 		74.51
v 10 		21 		74.51
v 10.048 		20.02 		74.51
v 10.192 		19.049 		74.51
v 10.431 		18.097 		74.51
v 10.761 		17.173 		74.51
v 11.1346 		16.384 		74.51
v 10.431 		23.903 		74.51
v 10.192 		22.951 		74.51
v 10.048 		21.98 		74.51
v 24.576 		12.1157 		74.51
v 24.714 		12.181 		74.51
v 25.556 		12.685 		74.51
v 26.344 		13.27 		74.51
v 27.071 		13.929 		74.51
v 27.73 		14.656 		74.51
v 28.315 		15.444 		74.51
v 28.819 		16.286 		74.51
v 17.097 		11.431 		74.51
v 16.384 		11.6856 		74.51
v 18.049 		11.192 		74.51
v 19.02 		11.048 		74.51
v 20 		11 		74.51
v 20.98 		11.048 		74.51
v 21.951 		11.192 		74.51
v 22.903 		11.431 		74.51
v 23.827 		11.761 		74.51
v 11.181 		16.286 		74.51
v 11.685 		15.444 		74.51
v 12.27 		14.656 		74.51
v 12.929 		13.929 		74.51
v 13.656 		13.27 		74.51
v 14.444 		12.685 		74.51
v 15.286 		12.181 		74.51
v 16.173 		11.761 		74.51
v -38.0825 		20.48 		100
v -38 		21 		100
v -38.098 		21.618 		100
v -38.382 		22.176 		100
v -38.824 		22.618 		100
v -39.382 		22.902 		100
v -40 		23 		100
v 83.827 		30.239 		100
v -40.618 		22.902 		100
v 89.239 		24.827 		100
v 88.819 		25.714 		100
v 88.315 		26.556 		100
v 87.73 		27.344 		100
v 87.071 		28.071 		100
v 86.344 		28.73 		100
v 85.556 		29.315 		100
v 84.714 		29.819 		100
v -41.176 		22.618 		100
v -41.618 		22.176 		100
v -41.902 		21.618 		100
v -42 		21 		100
v -41.9175 		20.48 		100
v -40 		19 		100
v -39.382 		19.098 		100
v -38.824 		19.382 		100
v -38.382 		19.824 		100
v -38.098 		20.382 		100
v -41.902 		20.382 		100
v -41.618 		19.824 		100
v -41.176 		19.382 		100
v -40.618 		19.098 		100
v -37.097 		30.569 		100
v -40 		31 		100
v -38.049 		30.808 		100
v -39.02 		30.952 		100
v -42.903 		30.569 		100
v -43.827 		30.239 		100
v -44.714 		29.819 		100
v -45.556 		29.315 		100
v -40.98 		30.952 		100
v -41.951 		30.808 		100
v -40 		11 		100
v -39.02 		11.048 		100
v -38.049 		11.192 		100
v -37.097 		11.431 		100
v -45.556 		12.685 		100
v -44.714 		12.181 		100
v -43.827 		11.761 		100
v -42.903 		11.431 		100
v -41.951 		11.192 		100
v -40.98 		11.048 		100
v -0.761 		24.827 		74.51
v -1.181 		25.714 		74.51
v -1.685 		26.556 		74.51
v -2.27 		27.344 		74.51
v -2.929 		28.071 		74.51
v -3.656 		28.73 		74.51
v -4.444 		29.315 		74.51
v -5.286 		29.819 		74.51
v -6.173 		30.239 		74.51
v -7.097 		30.569 		74.51
v -8.049 		30.808 		74.51
v -8.192 		30.8292 		74.51
v -1.1346 		16.384 		74.51
v -0.761 		17.173 		74.51
v -0.431 		18.097 		74.51
v -0.192 		19.049 		74.51
v -0.048 		20.02 		74.51
v 0 		21 		74.51
v -0.048 		21.98 		74.51
v -0.192 		22.951 		74.51
v -0.431 		23.903 		74.51
v -9.02 		30.952 		74.51
v -10 		31 		74.51
v -10.98 		30.952 		74.51
v -11.951 		30.808 		74.51
v -12.903 		30.569 		74.51
v -13.827 		30.239 		74.51
v -14.714 		29.819 		74.51
v -15.556 		29.315 		74.51
v -16.344 		28.73 		74.51
v -16.384 		28.6937 		74.51
v -20 		21 		74.51
v -19.952 		20.02 		74.51
v -19.808 		19.049 		74.51
v -19.569 		18.097 		74.51
v -19.239 		17.173 		74.51
v -17.071 		28.071 		74.51
v -17.73 		27.344 		74.51
v -18.315 		26.556 		74.51
v -18.819 		25.714 		74.51
v -19.239 		24.827 		74.51
v -19.569 		23.903 		74.51
v -19.808 		22.951 		74.51
v -19.952 		21.98 		74.51
v -8.049 		11.192 		74.51
v -7.097 		11.431 		74.51
v -6.173 		11.761 		74.51
v -5.286 		12.181 		74.51
v -4.444 		12.685 		74.51
v -3.656 		13.27 		74.51
v -2.929 		13.929 		74.51
v -2.27 		14.656 		74.51
v -1.685 		15.444 		74.51
v -1.181 		16.286 		74.51
v -16.344 		13.27 		74.51
v -15.556 		12.685 		74.51
v -14.714 		12.181 		74.51
v -13.827 		11.761 		74.51
v -12.903 		11.431 		74.51
v -11.951 		11.192 		74.51
v -10.98 		11.048 		74.51
v -10 		11 		74.51
# 1577 vertices

g group_0_1855578

usemtl color_1855578
s 0

f 47 	167 	48
f 165 	47 	39
f 95 	175 	75
f 116 	115 	126
f 130 	208 	131
f 92 	185 	95
f 136 	217 	137
f 165 	39 	36
f 172 	173 	67
f 28 	163 	36
f 164 	165 	36
f 168 	169 	55
f 65 	172 	67
f 69 	67 	173
f 181 	182 	84
f 185 	92 	90
f 74 	75 	176
f 186 	175 	95
f 110 	353 	111
f 74 	176 	77
f 86 	182 	88
f 186 	95 	185
f 164 	36 	163
f 55 	48 	168
f 146 	232 	46
f 68 	397 	70
f 86 	84 	182
f 183 	88 	182
f 90 	88 	183
f 272 	6 	7
f 272 	11 	6
f 202 	127 	201
f 129 	208 	130
f 138 	131 	221
f 58 	169 	63
f 170 	171 	63
f 214 	215 	134
f 217 	136 	135
f 217 	219 	137
f 208 	209 	131
f 223 	139 	221
f 223 	140 	139
f 168 	48 	167
f 231 	145 	144
f 123 	365 	94
f 231 	232 	145
f 232 	234 	46
f 126 	201 	127
f 202 	204 	127
f 214 	134 	133
f 135 	215 	217
f 138 	221 	139
f 204 	206 	128
f 206 	208 	129
f 76 	312 	79
f 312 	81 	79
f 135 	134 	215
f 176 	75 	175
f 81 	315 	83
f 315 	85 	83
f 77 	177 	78
f 178 	179 	78
f 143 	137 	219
f 227 	144 	143
f 184 	90 	183
f 327 	97 	96
f 90 	184 	185
f 97 	327 	98
f 229 	144 	227
f 276 	100 	99
f 344 	101 	100
f 146 	145 	232
f 77 	176 	177
f 344 	102 	101
f 178 	78 	177
f 89 	320 	91
f 132 	211 	133
f 351 	109 	108
f 28 	27 	163
f 165 	166 	47
f 47 	166 	167
f 58 	55 	169
f 170 	63 	169
f 65 	63 	171
f 171 	172 	65
f 128 	127 	204
f 129 	128 	206
f 221 	131 	209
f 80 	78 	179
f 983 	986 	180
f 144 	229 	231
f 227 	143 	219
f 374 	40 	234
f 212 	133 	211
f 212 	214 	133
f 223 	225 	140
f 132 	140 	211
f 225 	211 	140
f 69 	173 	71
f 109 	351 	110
f 112 	111 	354
f 115 	200 	126
f 294 	293 	330
f 305 	283 	308
f 319 	278 	293
f 1569 	563 	1528
f 107 	304 	108
f 350 	351 	108
f 354 	113 	112
f 114 	356 	115
f 142 	572 	141
f 365 	123 	122
f 365 	323 	94
f 372 	22 	18
f 22 	359 	38
f 18 	13 	372
f 375 	396 	64
f 397 	367 	70
f 279 	280 	297
f 332 	298 	333
f 530 	1527 	521
f 531 	532 	1538
f 535 	1542 	534
f 173 	174 	71
f 1550 	541 	542
f 542 	1551 	1550
f 147 	148 	544
f 1438 	1437 	817
f 817 	1439 	1438
f 408 	1547 	552
f 1426 	771 	774
f 1426 	774 	780
f 1431 	412 	809
f 1567 	561 	562
f 572 	142 	405
f 303 	302 	282
f 572 	553 	141
f 1561 	555 	556
f 282 	305 	303
f 310 	274 	311
f 1569 	562 	563
f 563 	522 	1528
f 279 	297 	174
f 297 	71 	174
f 300 	280 	302
f 302 	281 	282
f 573 	149 	147
f 149 	575 	150
f 150 	575 	151
f 576 	151 	575
f 565 	152 	564
f 576 	564 	151
f 514 	515 	1520
f 516 	1522 	515
f 314 	286 	316
f 287 	319 	316
f 518 	1524 	1523
f 283 	284 	308
f 289 	290 	324
f 1529 	523 	524
f 310 	329 	274
f 296 	331 	330
f 296 	298 	331
f 295 	296 	330
f 332 	331 	298
f 1538 	530 	531
f 1539 	1538 	532
f 1543 	535 	536
f 536 	537 	1543
f 1520 	513 	514
f 324 	308 	284
f 326 	324 	290
f 290 	328 	326
f 291 	292 	328
f 1539 	532 	533
f 293 	277 	330
f 299 	334 	333
f 181 	84 	334
f 1548 	540 	541
f 301 	181 	334
f 300 	297 	280
f 281 	302 	280
f 305 	282 	283
f 545 	546 	1552
f 289 	324 	284
f 274 	285 	311
f 285 	286 	311
f 314 	311 	286
f 287 	316 	286
f 287 	288 	319
f 277 	293 	278
f 288 	278 	319
f 473 	1366 	451
f 401 	1354 	460
f 1566 	559 	560
f 560 	561 	1566
f 1529 	1528 	522
f 570 	1575 	1574
f 570 	571 	1575
f 1576 	571 	405
f 1561 	554 	555
f 1567 	1566 	561
f 523 	1529 	522
f 1574 	569 	570
f 554 	141 	553
f 573 	147 	544
f 1523 	516 	517
f 517 	518 	1523
f 525 	526 	1532
f 526 	410 	1532
f 545 	1552 	539
f 408 	540 	1548
f 542 	543 	1551
f 543 	544 	1551
f 1552 	1546 	539
f 1555 	547 	548
f 548 	549 	1555
f 1557 	549 	550
f 550 	551 	1557
f 568 	569 	1574
f 1576 	1575 	571
f 149 	573 	574
f 574 	575 	149
f 835 	1457 	815
f 625 	721 	602
f 705 	706 	604
f 1439 	817 	818
f 1431 	1439 	412
f 818 	412 	1439
f 328 	290 	291
f 329 	328 	292
f 292 	274 	329
f 295 	330 	277
f 333 	298 	299
f 299 	301 	334
f 309 	76 	306
f 1453 	831 	832
f 85 	315 	317
f 709 	710 	608
f 610 	712 	611
f 712 	612 	611
f 721 	703 	602
f 102 	307 	73
f 705 	604 	603
f 605 	604 	706
f 706 	606 	605
f 347 	348 	104
f 819 	1441 	820
f 1458 	1457 	836
f 836 	1459 	1458
f 356 	114 	113
f 718 	622 	620
f 357 	200 	115
f 721 	625 	624
f 827 	1449 	828
f 709 	608 	607
f 366 	368 	124
f 609 	608 	710
f 710 	610 	609
f 7 	369 	272
f 718 	620 	618
f 40 	374 	64
f 66 	396 	68
f 704 	705 	603
f 72 	306 	76
f 76 	309 	312
f 85 	317 	87
f 610 	710 	711
f 610 	711 	712
f 93 	94 	323
f 93 	322 	96
f 327 	96 	325
f 617 	716 	618
f 622 	719 	624
f 344 	100 	343
f 721 	624 	720
f 81 	312 	313
f 707 	708 	606
f 708 	709 	607
f 325 	96 	322
f 713 	714 	612
f 717 	718 	618
f 98 	327 	342
f 720 	624 	719
f 342 	276 	98
f 99 	98 	276
f 343 	100 	276
f 603 	602 	703
f 72 	73 	306
f 606 	706 	707
f 347 	104 	103
f 607 	606 	708
f 105 	104 	348
f 348 	349 	105
f 106 	105 	349
f 349 	107 	106
f 612 	712 	713
f 352 	353 	110
f 357 	115 	356
f 320 	321 	91
f 350 	108 	304
f 110 	351 	352
f 354 	111 	353
f 201 	126 	200
f 117 	38 	358
f 117 	358 	118
f 360 	118 	358
f 361 	119 	360
f 121 	363 	122
f 365 	122 	364
f 125 	368 	7
f 11 	370 	13
f 13 	371 	372
f 358 	38 	359
f 375 	64 	374
f 397 	68 	396
f 369 	7 	368
f 40 	46 	234
f 66 	64 	396
f 124 	70 	367
f 81 	313 	315
f 317 	318 	87
f 89 	87 	320
f 318 	320 	87
f 103 	91 	321
f 322 	93 	323
f 717 	618 	716
f 622 	718 	719
f 345 	102 	344
f 345 	307 	102
f 306 	73 	307
f 704 	603 	703
f 321 	346 	103
f 346 	347 	103
f 107 	349 	304
f 354 	355 	113
f 355 	356 	113
f 118 	360 	119
f 361 	362 	119
f 120 	119 	362
f 121 	120 	363
f 363 	120 	362
f 364 	122 	363
f 125 	124 	368
f 11 	272 	370
f 371 	13 	370
f 22 	372 	373
f 359 	22 	373
f 366 	124 	367
f 636 	1396 	635
f 1437 	799 	816
f 1437 	816 	817
f 823 	1444 	822
f 824 	1444 	823
f 1453 	403 	831
f 836 	837 	1459
f 837 	838 	1459
f 840 	1462 	839
f 841 	1462 	840
f 612 	714 	613
f 945 	1012 	946
f 1016 	951 	949
f 945 	613 	714
f 947 	946 	1013
f 1013 	948 	947
f 1011 	1012 	945
f 948 	1013 	1014
f 1014 	1015 	948
f 1011 	945 	714
f 1013 	946 	1012
f 949 	1015 	1016
f 422 	1061 	423
f 949 	948 	1015
f 982 	952 	614
f 615 	950 	619
f 959 	960 	629
f 969 	976 	975
f 976 	162 	27
f 80 	180 	82
f 959 	629 	628
f 630 	629 	960
f 630 	960 	631
f 633 	964 	634
f 972 	969 	975
f 970 	162 	976
f 967 	972 	966
f 969 	970 	976
f 615 	614 	950
f 993 	974 	980
f 984 	988 	986
f 990 	985 	992
f 987 	993 	992
f 619 	950 	953
f 619 	953 	621
f 956 	407 	623
f 957 	627 	407
f 957 	958 	627
f 631 	961 	632
f 633 	632 	962
f 963 	964 	633
f 968 	965 	971
f 968 	634 	965
f 966 	971 	965
f 971 	966 	972
f 972 	967 	969
f 163 	27 	162
f 979 	973 	981
f 977 	978 	981
f 983 	984 	986
f 179 	180 	80
f 986 	82 	180
f 984 	985 	988
f 987 	992 	985
f 993 	987 	989
f 989 	974 	993
f 953 	955 	621
f 623 	621 	956
f 955 	956 	621
f 626 	623 	407
f 626 	407 	627
f 628 	627 	958
f 958 	959 	628
f 631 	960 	961
f 962 	632 	961
f 963 	633 	962
f 965 	634 	964
f 979 	980 	973
f 977 	981 	973
f 982 	981 	978
f 978 	952 	982
f 950 	614 	952
f 990 	988 	985
f 973 	980 	974
f 951 	1016 	954
f 438 	439 	1076
f 1076 	439 	1077
f 1016 	423 	954
f 428 	1066 	1065
f 441 	1080 	1079
f 1062 	424 	1063
f 425 	1064 	1063
f 1070 	433 	1071
f 441 	1079 	1078
f 429 	1067 	1066
f 1072 	421 	1073
f 1075 	437 	1076
f 1062 	1061 	424
f 1064 	427 	1065
f 1066 	428 	429
f 1068 	1067 	431
f 431 	1069 	1068
f 433 	434 	1071
f 440 	441 	1078
f 1082 	447 	1083
f 447 	1084 	1083
f 450 	1085 	1084
f 1197 	1085 	450
f 453 	1199 	1197
f 1202 	1199 	453
f 457 	1203 	1202
f 457 	459 	1203
f 1061 	954 	423
f 422 	424 	1061
f 425 	1063 	424
f 1069 	431 	432
f 432 	433 	1069
f 1075 	1074 	437
f 438 	1076 	437
f 421 	1072 	1080
f 426 	427 	1064
f 1078 	1071 	434
f 1074 	1073 	436
f 436 	437 	1074
f 1081 	1077 	439
f 1082 	1081 	445
f 443 	445 	1081
f 445 	447 	1082
f 1202 	455 	457
f 426 	1064 	425
f 428 	1065 	427
f 1067 	429 	430
f 1067 	430 	431
f 1070 	1069 	433
f 440 	1078 	434
f 421 	435 	1073
f 435 	436 	1073
f 441 	442 	1080
f 442 	421 	1080
f 443 	1081 	439
f 447 	448 	1084
f 448 	450 	1084
f 450 	452 	1197
f 1197 	452 	453
f 1202 	453 	455
f 1371 	715 	616
f 1386 	998 	1372
f 999 	1000 	1374
f 1377 	1002 	1378
f 1003 	1379 	1378
f 1382 	1007 	1369
f 1385 	991 	1386
f 1010 	998 	1386
f 716 	616 	715
f 617 	616 	716
f 1007 	995 	1369
f 994 	996 	1370
f 1375 	1374 	1000
f 1375 	1000 	1376
f 1002 	1377 	1376
f 1003 	1378 	1002
f 1005 	1380 	1379
f 1006 	1381 	1005
f 1008 	1383 	1208
f 1203 	459 	1208
f 1008 	1384 	1383
f 1010 	1386 	991
f 1371 	1370 	996
f 715 	1371 	996
f 994 	1370 	995
f 999 	1374 	1373
f 1376 	1001 	1002
f 1005 	1379 	1004
f 1380 	1005 	1381
f 1006 	1007 	1381
f 1384 	1009 	1385
f 998 	997 	1373
f 1373 	1372 	998
f 997 	999 	1373
f 1376 	1000 	1001
f 1004 	1379 	1003
f 1342 	414 	1343
f 469 	470 	1363
f 1403 	643 	1404
f 1382 	1381 	1007
f 1370 	1369 	995
f 1008 	1208 	459
f 1384 	1008 	1009
f 991 	1385 	1009
f 233 	1329 	1328
f 233 	236 	1329
f 1330 	236 	1295
f 1435 	815 	1436
f 841 	842 	1463
f 1308 	216 	1317
f 244 	1332 	1331
f 1447 	826 	1413
f 1421 	752 	1395
f 643 	644 	1404
f 648 	1409 	1408
f 654 	1415 	1414
f 469 	1363 	1362
f 1365 	218 	1321
f 1423 	762 	1424
f 812 	813 	1433
f 194 	1298 	1297
f 1299 	1298 	195
f 1423 	1422 	762
f 761 	762 	1422
f 763 	1424 	762
f 1424 	763 	1425
f 771 	1425 	763
f 771 	1426 	1425
f 780 	1427 	1426
f 1427 	780 	1428
f 788 	1428 	780
f 1428 	788 	1429
f 789 	1429 	788
f 789 	799 	1429
f 1430 	1429 	799
f 799 	1437 	1430
f 1431 	809 	1432
f 1432 	809 	1433
f 812 	1433 	809
f 1434 	1433 	813
f 1434 	813 	1435
f 814 	1435 	813
f 814 	815 	1435
f 1457 	1436 	815
f 224 	226 	1325
f 1330 	1329 	236
f 822 	1444 	1443
f 236 	191 	1295
f 1296 	1295 	192
f 1414 	1413 	654
f 192 	1297 	1296
f 194 	195 	1298
f 1299 	195 	1300
f 196 	1300 	195
f 196 	197 	1300
f 1302 	1301 	198
f 198 	1303 	1302
f 1441 	1440 	820
f 1442 	1441 	821
f 819 	821 	1441
f 1442 	821 	1443
f 822 	1443 	821
f 1307 	1306 	210
f 1307 	210 	1308
f 824 	1445 	1444
f 824 	825 	1445
f 1446 	1445 	825
f 1447 	1446 	826
f 825 	826 	1446
f 826 	653 	1413
f 1449 	827 	1448
f 1448 	827 	1450
f 829 	1450 	827
f 1450 	829 	1451
f 830 	1451 	829
f 830 	403 	1451
f 1452 	1451 	403
f 1453 	1452 	403
f 832 	1454 	1453
f 833 	1455 	1454
f 833 	1454 	832
f 833 	834 	1455
f 1456 	1455 	834
f 1440 	1456 	834
f 834 	820 	1440
f 1331 	1317 	244
f 835 	836 	1457
f 1334 	1333 	336
f 838 	1460 	1459
f 838 	839 	1460
f 1461 	1460 	839
f 1334 	336 	1335
f 839 	1462 	1461
f 841 	1463 	1462
f 1464 	1463 	842
f 842 	828 	1464
f 1464 	828 	1449
f 1341 	414 	1342
f 640 	1400 	1399
f 1346 	446 	1347
f 643 	1403 	1402
f 446 	1348 	1347
f 414 	417 	1343
f 648 	1408 	1407
f 650 	1410 	1409
f 1411 	1410 	651
f 650 	651 	1410
f 651 	1412 	1411
f 761 	1422 	652
f 1412 	652 	1422
f 1333 	335 	336
f 1415 	655 	1416
f 656 	1416 	655
f 657 	1417 	1416
f 657 	1416 	656
f 339 	340 	1337
f 1417 	657 	1418
f 416 	1418 	657
f 1418 	416 	1419
f 748 	1419 	416
f 341 	1339 	340
f 748 	749 	1419
f 1420 	1419 	749
f 749 	752 	1420
f 1421 	1420 	752
f 1341 	1340 	413
f 752 	635 	1395
f 413 	414 	1341
f 1396 	1395 	635
f 1397 	1396 	637
f 636 	637 	1396
f 638 	1398 	637
f 1397 	637 	1398
f 639 	1399 	638
f 1398 	638 	1399
f 1346 	444 	446
f 640 	1399 	639
f 640 	641 	1401
f 640 	1401 	1400
f 1401 	641 	1402
f 642 	1402 	641
f 642 	643 	1402
f 1405 	1404 	644
f 645 	1405 	644
f 645 	646 	1405
f 1406 	1405 	646
f 646 	647 	1407
f 646 	1407 	1406
f 1394 	489 	1353
f 647 	648 	1407
f 401 	461 	1354
f 1355 	1354 	461
f 648 	649 	1409
f 462 	1356 	461
f 1355 	461 	1356
f 1409 	649 	650
f 462 	463 	1356
f 1357 	1356 	463
f 464 	1358 	463
f 1357 	463 	1358
f 1412 	651 	652
f 464 	465 	1358
f 1359 	1358 	465
f 466 	1360 	465
f 1359 	465 	1360
f 654 	1413 	653
f 466 	467 	1360
f 1361 	1360 	467
f 1415 	654 	655
f 468 	1362 	467
f 1361 	467 	1362
f 1362 	468 	469
f 1364 	1363 	470
f 1364 	470 	1365
f 471 	1365 	470
f 471 	218 	1365
f 1348 	451 	1349
f 1366 	1349 	451
f 1367 	1366 	475
f 473 	475 	1366
f 1368 	1367 	477
f 475 	477 	1367
f 477 	479 	1387
f 477 	1387 	1368
f 482 	1388 	1387
f 482 	1387 	479
f 484 	1389 	482
f 1388 	482 	1389
f 484 	485 	1389
f 1390 	1389 	485
f 486 	1391 	485
f 1390 	485 	1391
f 487 	1392 	1391
f 487 	1391 	486
f 487 	488 	1392
f 1393 	1392 	488
f 1393 	488 	1394
f 489 	1394 	488
f 489 	460 	1353
f 1354 	1353 	460
f 1536 	529 	1516
f 511 	1517 	1516
f 510 	511 	1516
f 511 	512 	1517
f 1518 	1517 	512
f 1518 	512 	1519
f 513 	1519 	512
f 1520 	1519 	513
f 1520 	515 	1521
f 1304 	203 	1305
f 515 	1522 	1521
f 516 	1523 	1522
f 213 	216 	1308
f 1525 	1524 	519
f 518 	519 	1524
f 1322 	1321 	220
f 220 	1323 	1322
f 519 	520 	1526
f 519 	1526 	1525
f 224 	1325 	1323
f 1326 	1325 	226
f 520 	1527 	1526
f 1326 	226 	1327
f 524 	1530 	1529
f 525 	1531 	1530
f 525 	1530 	524
f 525 	1532 	1531
f 410 	1533 	1532
f 1297 	192 	193
f 527 	1534 	1533
f 410 	527 	1533
f 528 	1535 	1534
f 528 	1534 	527
f 193 	194 	1297
f 528 	529 	1535
f 1536 	1535 	529
f 510 	1516 	529
f 1537 	1527 	530
f 520 	521 	1527
f 1301 	1300 	197
f 530 	1538 	1537
f 1301 	197 	198
f 1539 	533 	1540
f 199 	1303 	198
f 1541 	1540 	534
f 533 	534 	1540
f 1304 	1303 	203
f 199 	203 	1303
f 534 	1542 	1541
f 205 	1305 	203
f 535 	1543 	1542
f 1305 	205 	1306
f 207 	1306 	205
f 1543 	537 	1544
f 1545 	1544 	538
f 537 	538 	1544
f 207 	210 	1306
f 1545 	538 	1546
f 538 	539 	1546
f 1308 	210 	213
f 408 	1548 	1547
f 244 	1317 	216
f 1548 	541 	1549
f 220 	1321 	218
f 541 	1550 	1549
f 222 	1323 	220
f 224 	1323 	222
f 1551 	544 	148
f 1327 	226 	228
f 1552 	546 	1553
f 230 	1328 	228
f 1327 	228 	1328
f 546 	547 	1554
f 546 	1554 	1553
f 233 	1328 	230
f 547 	1555 	1554
f 1555 	549 	1556
f 192 	1295 	191
f 549 	1557 	1556
f 1557 	551 	1558
f 1559 	1558 	552
f 551 	552 	1558
f 1332 	335 	1333
f 552 	1547 	1559
f 554 	1560 	141
f 1561 	1560 	554
f 1335 	336 	337
f 556 	1562 	1561
f 337 	338 	1335
f 557 	1563 	1562
f 557 	1562 	556
f 1336 	338 	1337
f 557 	558 	1563
f 1564 	1563 	558
f 1338 	1337 	340
f 1564 	558 	1565
f 559 	1565 	558
f 1566 	1565 	559
f 562 	1568 	1567
f 1340 	411 	413
f 1569 	1568 	562
f 565 	1570 	152
f 151 	564 	152
f 566 	1571 	1570
f 566 	1570 	565
f 419 	1345 	418
f 1344 	418 	1345
f 566 	567 	1571
f 1572 	1571 	567
f 419 	444 	1345
f 1572 	567 	1573
f 568 	1573 	567
f 568 	1574 	1573
f 405 	1577 	1576
f 1350 	454 	1351
f 456 	1351 	454
f 142 	1577 	405
f 1351 	456 	1352
f 458 	1352 	456
f 1344 	1352 	418
f 458 	418 	1352
f 1332 	244 	245
f 1332 	245 	335
f 1336 	1335 	338
f 339 	1337 	338
f 1338 	340 	1339
f 1339 	341 	1340
f 411 	1340 	341
f 1346 	1345 	444
f 1348 	446 	449
f 449 	451 	1348
f 1350 	1343 	417
f 454 	1350 	417
# 867 faces

g group_0_2829873

usemtl color_2829873
s 0

f 29 	30 	31
f 32 	29 	31
f 33 	34 	35
f 33 	35 	37
f 212 	211 	37
f 33 	211 	225
f 357 	356 	33
f 33 	356 	237
f 33 	201 	200
f 201 	33 	202
f 202 	33 	204
f 204 	33 	206
f 206 	33 	208
f 208 	33 	209
f 33 	37 	211
f 212 	37 	214
f 214 	37 	215
f 215 	37 	217
f 217 	37 	219
f 209 	33 	221
f 225 	223 	33
f 221 	33 	223
f 227 	219 	37
f 229 	227 	37
f 234 	232 	37
f 229 	37 	231
f 231 	37 	232
f 375 	374 	37
f 371 	370 	273
f 292 	291 	344
f 327 	325 	287
f 288 	287 	325
f 277 	278 	323
f 295 	277 	323
f 323 	365 	295
f 298 	296 	365
f 280 	275 	281
f 307 	345 	290
f 291 	290 	345
f 285 	274 	276
f 672 	673 	161
f 275 	289 	284
f 275 	284 	283
f 282 	275 	283
f 173 	275 	174
f 275 	312 	289
f 309 	306 	289
f 306 	307 	289
f 290 	289 	307
f 286 	285 	342
f 287 	286 	327
f 675 	676 	154
f 342 	327 	286
f 296 	295 	365
f 322 	323 	278
f 345 	344 	291
f 276 	342 	285
f 349 	275 	304
f 321 	275 	346
f 348 	347 	275
f 318 	317 	275
f 237 	304 	275
f 274 	292 	343
f 344 	343 	292
f 315 	313 	275
f 309 	289 	312
f 315 	275 	317
f 312 	275 	313
f 321 	320 	275
f 318 	275 	320
f 273 	299 	365
f 299 	298 	365
f 662 	663 	1319
f 343 	276 	274
f 278 	288 	322
f 325 	322 	288
f 346 	275 	347
f 348 	275 	349
f 354 	353 	237
f 237 	350 	304
f 350 	237 	351
f 351 	237 	352
f 352 	237 	353
f 354 	237 	355
f 357 	33 	200
f 355 	237 	356
f 373 	273 	359
f 358 	359 	273
f 372 	273 	373
f 358 	273 	360
f 360 	273 	361
f 361 	273 	362
f 362 	273 	363
f 365 	364 	273
f 675 	154 	155
f 363 	273 	364
f 1315 	156 	658
f 368 	366 	37
f 368 	37 	369
f 272 	369 	37
f 272 	37 	370
f 37 	273 	370
f 371 	273 	372
f 396 	375 	37
f 669 	1313 	668
f 234 	37 	374
f 672 	161 	160
f 662 	1319 	661
f 1311 	667 	668
f 155 	674 	675
f 156 	154 	676
f 157 	677 	158
f 379 	382 	378
f 380 	382 	379
f 377 	378 	382
f 381 	388 	380
f 376 	377 	382
f 383 	386 	382
f 384 	386 	383
f 385 	386 	384
f 376 	382 	386
f 678 	679 	158
f 382 	380 	388
f 381 	389 	388
f 387 	388 	389
f 387 	389 	390
f 387 	390 	391
f 387 	391 	392
f 387 	392 	393
f 387 	393 	394
f 387 	394 	395
f 1310 	666 	1311
f 396 	37 	397
f 366 	367 	37
f 397 	37 	367
f 674 	155 	673
f 400 	462 	399
f 401 	460 	399
f 402 	831 	399
f 398 	399 	403
f 398 	403 	830
f 398 	830 	404
f 404 	572 	398
f 405 	571 	398
f 568 	567 	398
f 566 	565 	398
f 573 	977 	574
f 398 	575 	987
f 398 	180 	179
f 157 	1314 	671
f 542 	541 	955
f 407 	956 	540
f 524 	523 	814
f 525 	524 	813
f 451 	449 	654
f 415 	638 	413
f 341 	340 	415
f 339 	338 	415
f 337 	336 	415
f 226 	435 	228
f 222 	436 	224
f 442 	228 	421
f 222 	220 	437
f 432 	431 	192
f 420 	192 	431
f 430 	429 	420
f 1016 	420 	423
f 422 	420 	424
f 425 	420 	426
f 427 	426 	420
f 427 	420 	428
f 425 	424 	420
f 428 	420 	429
f 432 	192 	433
f 430 	420 	431
f 433 	191 	434
f 421 	228 	435
f 436 	222 	437
f 435 	224 	436
f 437 	400 	438
f 438 	400 	439
f 434 	236 	440
f 440 	233 	441
f 441 	233 	442
f 443 	400 	445
f 439 	400 	443
f 445 	400 	447
f 447 	400 	448
f 448 	400 	450
f 450 	400 	452
f 400 	399 	452
f 453 	452 	399
f 455 	453 	399
f 457 	455 	399
f 335 	245 	415
f 216 	213 	415
f 210 	420 	213
f 415 	213 	420
f 420 	197 	196
f 195 	420 	196
f 191 	433 	192
f 192 	420 	193
f 193 	420 	194
f 420 	198 	197
f 194 	420 	195
f 203 	199 	420
f 198 	420 	199
f 207 	205 	420
f 203 	420 	205
f 210 	207 	420
f 493 	496 	492
f 494 	496 	493
f 491 	492 	496
f 495 	502 	494
f 496 	497 	491
f 490 	491 	497
f 498 	500 	497
f 499 	500 	498
f 490 	497 	500
f 496 	494 	502
f 495 	503 	502
f 501 	502 	503
f 501 	503 	504
f 501 	504 	505
f 501 	505 	506
f 501 	506 	507
f 501 	507 	508
f 501 	508 	509
f 914 	379 	378
f 920 	921 	381
f 929 	392 	391
f 905 	908 	385
f 377 	910 	378
f 871 	493 	492
f 381 	380 	920
f 393 	923 	394
f 923 	395 	394
f 874 	875 	495
f 883 	506 	505
f 903 	384 	383
f 905 	385 	384
f 386 	385 	908
f 908 	376 	386
f 867 	868 	499
f 914 	378 	910
f 491 	870 	492
f 495 	494 	874
f 507 	877 	508
f 877 	509 	508
f 865 	498 	497
f 867 	499 	498
f 500 	499 	868
f 868 	490 	500
f 871 	492 	870
f 883 	505 	504
f 497 	496 	865
f 678 	158 	677
f 679 	680 	159
f 665 	666 	1310
f 159 	158 	679
f 1316 	659 	660
f 1316 	660 	661
f 224 	435 	226
f 228 	442 	230
f 230 	442 	233
f 236 	434 	191
f 233 	440 	236
f 245 	244 	415
f 216 	415 	244
f 337 	415 	338
f 339 	415 	340
f 335 	415 	336
f 659 	1315 	658
f 636 	413 	637
f 635 	417 	636
f 752 	417 	635
f 341 	415 	411
f 411 	415 	413
f 160 	159 	680
f 413 	636 	414
f 160 	681 	672
f 414 	636 	417
f 418 	416 	419
f 416 	657 	419
f 444 	419 	656
f 657 	656 	419
f 656 	655 	446
f 446 	444 	656
f 454 	417 	752
f 752 	749 	454
f 456 	454 	749
f 458 	456 	749
f 460 	489 	399
f 1310 	664 	665
f 401 	399 	461
f 461 	399 	462
f 462 	400 	463
f 667 	1311 	666
f 463 	400 	464
f 464 	400 	465
f 465 	400 	466
f 466 	400 	467
f 220 	218 	437
f 467 	400 	468
f 468 	400 	469
f 400 	437 	471
f 677 	157 	671
f 469 	400 	470
f 218 	471 	437
f 470 	400 	471
f 655 	654 	446
f 449 	446 	654
f 475 	402 	477
f 477 	402 	479
f 479 	402 	482
f 482 	402 	484
f 484 	402 	485
f 485 	402 	486
f 486 	402 	487
f 489 	488 	402
f 487 	402 	488
f 681 	160 	680
f 402 	399 	489
f 511 	788 	409
f 650 	649 	409
f 415 	409 	649
f 415 	649 	648
f 648 	647 	415
f 638 	415 	639
f 637 	413 	638
f 642 	641 	415
f 644 	643 	415
f 639 	415 	640
f 640 	415 	641
f 642 	415 	643
f 415 	645 	644
f 645 	415 	646
f 646 	415 	647
f 650 	409 	651
f 475 	473 	402
f 826 	825 	473
f 653 	826 	473
f 825 	402 	473
f 473 	451 	653
f 654 	653 	451
f 418 	458 	748
f 416 	418 	748
f 749 	748 	458
f 761 	652 	409
f 762 	761 	409
f 652 	651 	409
f 762 	409 	763
f 510 	799 	511
f 763 	409 	771
f 529 	799 	510
f 771 	409 	774
f 774 	409 	780
f 780 	409 	788
f 788 	511 	789
f 789 	511 	799
f 527 	410 	412
f 809 	412 	526
f 410 	526 	412
f 526 	525 	809
f 812 	809 	525
f 799 	529 	816
f 529 	528 	816
f 817 	816 	528
f 818 	817 	528
f 820 	402 	819
f 834 	402 	820
f 832 	402 	833
f 819 	402 	821
f 821 	402 	822
f 822 	402 	823
f 823 	402 	824
f 824 	402 	825
f 830 	829 	404
f 827 	404 	829
f 403 	399 	831
f 831 	402 	832
f 929 	391 	390
f 833 	402 	834
f 835 	404 	836
f 813 	812 	525
f 836 	404 	837
f 837 	404 	838
f 383 	382 	903
f 838 	404 	839
f 839 	404 	840
f 840 	404 	841
f 841 	404 	842
f 827 	828 	404
f 842 	404 	828
f 532 	531 	406
f 531 	530 	406
f 530 	409 	406
f 409 	518 	517
f 409 	517 	516
f 516 	515 	409
f 513 	512 	409
f 511 	409 	512
f 870 	491 	490
f 513 	409 	514
f 514 	409 	515
f 520 	519 	409
f 873 	494 	493
f 518 	409 	519
f 520 	409 	521
f 507 	876 	877
f 815 	814 	522
f 522 	563 	835
f 835 	815 	522
f 523 	522 	814
f 879 	880 	501
f 528 	527 	818
f 814 	813 	524
f 412 	818 	527
f 530 	521 	409
f 881 	882 	503
f 532 	406 	533
f 533 	406 	534
f 534 	406 	535
f 876 	507 	506
f 535 	406 	536
f 536 	406 	537
f 960 	548 	961
f 537 	406 	538
f 496 	864 	865
f 408 	552 	957
f 957 	407 	408
f 540 	408 	407
f 538 	406 	539
f 539 	406 	545
f 961 	547 	406
f 545 	406 	546
f 959 	549 	960
f 546 	406 	547
f 490 	869 	870
f 547 	961 	548
f 548 	960 	549
f 549 	959 	550
f 550 	959 	551
f 959 	958 	551
f 552 	551 	958
f 494 	873 	874
f 910 	377 	376
f 847 	849 	846
f 845 	846 	849
f 844 	845 	849
f 848 	855 	847
f 849 	850 	844
f 843 	844 	850
f 851 	852 	850
f 853 	850 	852
f 843 	850 	853
f 555 	554 	404
f 553 	404 	554
f 555 	404 	556
f 556 	404 	557
f 509 	878 	501
f 849 	847 	855
f 848 	856 	855
f 854 	855 	856
f 854 	856 	857
f 854 	857 	858
f 854 	858 	859
f 854 	859 	860
f 854 	860 	861
f 854 	861 	862
f 557 	404 	558
f 558 	404 	559
f 559 	404 	560
f 560 	404 	561
f 404 	835 	562
f 561 	404 	562
f 503 	495 	875
f 563 	562 	835
f 564 	398 	565
f 566 	398 	567
f 570 	569 	398
f 568 	398 	569
f 864 	496 	863
f 919 	380 	379
f 393 	922 	923
f 490 	868 	869
f 925 	926 	387
f 872 	873 	493
f 927 	928 	389
f 922 	393 	392
f 382 	902 	903
f 376 	909 	910
f 884 	506 	883
f 884 	876 	506
f 380 	919 	920
f 498 	866 	867
f 395 	924 	387
f 389 	381 	921
f 902 	382 	901
f 881 	503 	875
f 376 	908 	909
f 504 	503 	882
f 916 	919 	379
f 882 	883 	504
f 502 	863 	496
f 498 	865 	866
f 930 	392 	929
f 930 	922 	392
f 872 	493 	871
f 384 	904 	905
f 509 	877 	878
f 879 	501 	878
f 502 	501 	880
f 502 	880 	863
f 927 	389 	921
f 1057 	846 	845
f 390 	389 	928
f 928 	929 	390
f 1060 	1145 	848
f 388 	901 	382
f 384 	903 	904
f 1185 	859 	858
f 916 	379 	914
f 1053 	852 	851
f 1054 	853 	1053
f 395 	923 	924
f 925 	387 	924
f 844 	1056 	845
f 388 	387 	926
f 388 	926 	901
f 848 	847 	1060
f 860 	1155 	861
f 1155 	862 	861
f 570 	398 	571
f 404 	553 	572
f 405 	398 	572
f 543 	952 	544
f 574 	973 	575
f 575 	398 	576
f 576 	398 	564
f 962 	961 	406
f 970 	969 	187
f 1050 	1051 	850
f 977 	573 	978
f 950 	952 	543
f 978 	544 	952
f 1053 	851 	1052
f 950 	543 	953
f 543 	542 	953
f 852 	1053 	853
f 955 	953 	542
f 1054 	843 	853
f 956 	955 	541
f 541 	540 	956
f 958 	957 	552
f 1057 	845 	1056
f 962 	406 	963
f 963 	406 	964
f 406 	966 	965
f 964 	406 	965
f 406 	187 	969
f 966 	406 	967
f 967 	406 	969
f 989 	575 	974
f 974 	575 	973
f 973 	574 	977
f 180 	398 	983
f 983 	398 	984
f 985 	398 	987
f 984 	398 	985
f 987 	575 	989
f 544 	978 	573
f 1009 	399 	991
f 29 	999 	399
f 1002 	1001 	29
f 995 	29 	994
f 994 	29 	996
f 996 	29 	715
f 1000 	999 	29
f 998 	399 	997
f 997 	399 	999
f 1000 	29 	1001
f 1006 	1005 	29
f 1002 	29 	1003
f 1007 	1006 	29
f 1003 	29 	1004
f 1004 	29 	1005
f 1007 	29 	995
f 459 	457 	399
f 459 	399 	1008
f 1009 	1008 	399
f 1010 	399 	998
f 991 	399 	1010
f 717 	29 	718
f 703 	32 	704
f 721 	32 	703
f 705 	704 	32
f 705 	32 	706
f 32 	711 	710
f 706 	32 	707
f 707 	32 	708
f 708 	32 	709
f 711 	32 	712
f 1020 	1023 	1019
f 1021 	1023 	1020
f 1018 	1019 	1023
f 1022 	1029 	1021
f 1017 	1018 	1023
f 1024 	1027 	1023
f 1025 	1027 	1024
f 1026 	1027 	1025
f 1017 	1023 	1027
f 1023 	1021 	1029
f 1022 	1030 	1029
f 1028 	1029 	1030
f 1028 	1030 	1031
f 1028 	1031 	1032
f 1028 	1032 	1033
f 1028 	1033 	1034
f 1028 	1034 	1035
f 1028 	1035 	1036
f 709 	32 	710
f 713 	712 	32
f 713 	32 	714
f 715 	29 	716
f 32 	718 	29
f 716 	29 	717
f 718 	32 	719
f 721 	720 	32
f 719 	32 	720
f 32 	420 	1013
f 1014 	1013 	420
f 1015 	1014 	420
f 1011 	714 	32
f 1011 	32 	1012
f 1013 	1012 	32
f 1016 	1015 	420
f 423 	420 	422
f 1185 	858 	857
f 179 	178 	398
f 176 	175 	398
f 398 	186 	273
f 181 	301 	273
f 187 	165 	164
f 163 	187 	164
f 970 	187 	162
f 275 	169 	187
f 163 	162 	187
f 850 	849 	1050
f 851 	850 	1051
f 166 	165 	187
f 166 	187 	167
f 167 	187 	168
f 168 	187 	169
f 169 	275 	170
f 170 	275 	171
f 171 	275 	172
f 275 	280 	279
f 1056 	844 	843
f 172 	275 	173
f 282 	281 	275
f 279 	174 	275
f 175 	186 	398
f 176 	398 	177
f 177 	398 	178
f 1059 	847 	846
f 273 	301 	299
f 860 	1154 	1155
f 181 	273 	182
f 185 	184 	273
f 182 	273 	183
f 183 	273 	184
f 185 	273 	186
f 1163 	1167 	854
f 1175 	1176 	856
f 34 	1038 	35
f 1038 	1039 	35
f 30 	35 	1039
f 30 	1039 	31
f 399 	398 	30
f 29 	399 	30
f 35 	30 	398
f 398 	273 	35
f 273 	37 	35
f 1154 	860 	859
f 849 	1049 	1050
f 843 	1055 	1056
f 847 	1059 	1060
f 862 	1156 	854
f 856 	848 	1145
f 1049 	849 	1048
f 843 	1054 	1055
f 237 	1038 	34
f 237 	34 	33
f 406 	409 	1039
f 187 	406 	1039
f 409 	415 	1039
f 31 	1039 	415
f 415 	420 	31
f 420 	32 	31
f 1058 	1059 	846
f 1186 	859 	1185
f 1186 	1154 	859
f 1175 	856 	1145
f 857 	856 	1176
f 1176 	1185 	857
f 855 	1048 	849
f 1052 	851 	1051
f 1058 	846 	1057
f 1017 	739 	1018
f 1228 	1229 	1020
f 1235 	1236 	1030
f 1223 	1026 	1025
f 1022 	1230 	1030
f 1222 	1223 	1024
f 739 	1017 	1027
f 1226 	1019 	1018
f 1228 	1020 	1019
f 1031 	1030 	1236
f 1236 	1032 	1031
f 1023 	1220 	1024
f 1025 	1024 	1223
f 1226 	1018 	739
f 1021 	1020 	1229
f 1229 	1022 	1021
f 1034 	1091 	1035
f 1036 	1232 	1028
f 1233 	1234 	1028
f 1032 	1236 	1237
f 862 	1155 	1156
f 1163 	854 	1156
f 1165 	855 	1167
f 855 	854 	1167
f 855 	1165 	1048
f 1222 	1024 	1220
f 1229 	773 	1022
f 1233 	1028 	1232
f 773 	1230 	1022
f 1237 	1033 	1032
f 1029 	1221 	1023
f 1224 	1225 	1026
f 1036 	1035 	1232
f 1091 	1034 	1033
f 1027 	1026 	1225
f 1225 	739 	1027
f 1235 	1030 	1230
f 1029 	1028 	1234
f 1234 	1221 	1029
f 1026 	1223 	1224
f 1019 	1226 	1227
f 1227 	1228 	1019
f 1091 	1231 	1035
f 1035 	1231 	1232
f 1220 	1023 	1221
f 1237 	1238 	1033
f 1238 	1091 	1033
f 1243 	1245 	1242
f 1241 	1242 	1245
f 1240 	1241 	1245
f 1244 	1251 	1243
f 1245 	1246 	1240
f 1239 	1240 	1246
f 1247 	1248 	1246
f 1249 	1246 	1248
f 1239 	1246 	1249
f 1245 	1243 	1251
f 1244 	1252 	1251
f 1250 	1251 	1252
f 1250 	1252 	1253
f 1250 	1253 	1254
f 1250 	1254 	1255
f 1250 	1255 	1256
f 1250 	1256 	1257
f 1250 	1257 	1258
f 1313 	156 	1312
f 1311 	1312 	156
f 1310 	1311 	156
f 1314 	156 	1313
f 1309 	1310 	156
f 1309 	156 	1315
f 1309 	1315 	1316
f 1318 	1319 	1316
f 1320 	1316 	1319
f 1309 	1316 	1320
f 1314 	157 	156
f 154 	156 	157
f 154 	157 	158
f 154 	158 	159
f 154 	159 	160
f 154 	160 	161
f 154 	161 	1324
f 154 	1324 	155
f 676 	658 	156
f 659 	1316 	1315
f 661 	1318 	1316
f 1319 	1318 	661
f 1319 	663 	1320
f 1309 	1320 	664
f 663 	664 	1320
f 1309 	664 	1310
f 1311 	668 	1312
f 668 	1313 	1312
f 1314 	1313 	670
f 669 	670 	1313
f 670 	671 	1314
f 161 	673 	1324
f 155 	1324 	673
f 1482 	1242 	1241
f 1485 	1486 	1244
f 1494 	1255 	1254
f 1247 	1468 	1248
f 1469 	1470 	1248
f 1240 	1473 	1241
f 1244 	1243 	1485
f 1256 	1488 	1257
f 1488 	1258 	1257
f 1468 	1247 	1467
f 1469 	1248 	1468
f 1249 	1248 	1470
f 1470 	1239 	1249
f 1482 	1241 	1473
f 1494 	1254 	1253
f 1246 	1245 	1467
f 1246 	1467 	1247
f 1473 	1240 	1239
f 1484 	1243 	1242
f 1256 	1487 	1488
f 1490 	1491 	1250
f 1492 	1493 	1252
f 1487 	1256 	1255
f 1245 	1466 	1467
f 1239 	1471 	1473
f 1243 	1484 	1485
f 1258 	1489 	1250
f 1252 	1244 	1486
f 1466 	1245 	1465
f 1239 	1470 	1471
f 1483 	1484 	1242
f 1495 	1255 	1494
f 1495 	1487 	1255
f 1492 	1252 	1486
f 1253 	1252 	1493
f 1493 	1494 	1253
f 1251 	1465 	1245
f 1483 	1242 	1482
f 1258 	1488 	1489
f 1490 	1250 	1489
f 1251 	1250 	1491
f 1251 	1491 	1465
# 849 faces

g group_0_11107152

usemtl color_11107152
s 0

f 1040 	188 	189
f 189 	267 	1040
f 188 	1040 	235
f 188 	153 	190
f 190 	263 	188
f 235 	153 	188
f 235 	237 	238
f 247 	153 	246
f 190 	153 	257
f 247 	257 	153
f 263 	264 	188
f 188 	264 	265
f 188 	265 	266
f 188 	266 	189
f 1042 	1040 	267
f 246 	153 	270
f 268 	187 	271
f 235 	238 	153
f 153 	275 	187
f 238 	237 	275
f 238 	275 	153
f 1040 	1037 	235
f 1037 	1041 	1038
f 1040 	1041 	1037
f 1041 	1039 	1038
f 1038 	237 	1037
f 235 	1037 	237
f 1042 	1043 	1040
f 1043 	1044 	1040
f 1041 	1040 	1044
f 1041 	1045 	1039
f 1046 	1047 	1039
f 1045 	1046 	1039
f 271 	187 	1047
f 1039 	1047 	187
f 153 	187 	268
f 268 	269 	153
f 269 	270 	153
# 38 faces

g group_0_16089887

usemtl color_16089887
s 0

f 2 	3 	1
f 1 	3 	4
f 1 	4 	5
f 12 	14 	10
f 10 	14 	9
f 5 	14 	1
f 1 	14 	12
f 8 	9 	15
f 15 	9 	14
f 17 	23 	16
f 23 	24 	16
f 15 	19 	20
f 15 	20 	21
f 15 	21 	8
f 15 	16 	26
f 25 	26 	16
f 19 	15 	26
f 24 	25 	16
f 263 	2 	1
f 269 	268 	15
f 4 	257 	5
f 190 	257 	3
f 190 	3 	263
f 2 	263 	3
f 189 	266 	9
f 189 	9 	8
f 16 	15 	268
f 269 	15 	14
f 16 	268 	17
f 247 	246 	5
f 1 	12 	265
f 10 	266 	12
f 17 	268 	271
f 270 	14 	246
f 247 	5 	257
f 4 	3 	257
f 1 	264 	263
f 1 	265 	264
f 265 	12 	266
f 10 	9 	266
f 8 	267 	189
f 8 	21 	267
f 14 	270 	269
f 14 	5 	246
f 1047 	24 	23
f 17 	271 	23
f 1042 	267 	21
f 271 	1047 	23
f 1042 	21 	1043
f 20 	1043 	21
f 1044 	1043 	19
f 20 	19 	1043
f 19 	1041 	1044
f 26 	1041 	19
f 1041 	26 	25
f 25 	1045 	1041
f 25 	24 	1046
f 25 	1046 	1045
f 1047 	1046 	24
# 59 faces

g group_0_-1038980810

usemtl color_-1038980810
s 0

f 44 	916 	43
f 42 	43 	916
f 45 	919 	44
f 51 	920 	50
f 52 	920 	51
f 53 	920 	52
f 54 	920 	53
f 50 	919 	49
f 61 	928 	60
f 62 	928 	61
f 126 	42 	41
f 128 	43 	42
f 128 	44 	43
f 44 	130 	45
f 130 	131 	45
f 52 	132 	133
f 52 	133 	53
f 133 	54 	53
f 54 	135 	56
f 135 	57 	56
f 57 	137 	59
f 42 	126 	127
f 127 	128 	42
f 44 	129 	130
f 54 	133 	134
f 134 	135 	54
f 57 	135 	136
f 136 	137 	57
f 49 	45 	131
f 138 	50 	49
f 132 	52 	51
f 60 	59 	144
f 144 	61 	60
f 62 	61 	146
f 144 	145 	61
f 61 	145 	146
f 146 	46 	62
f 44 	128 	129
f 138 	49 	131
f 50 	138 	139
f 51 	50 	140
f 139 	140 	50
f 140 	132 	51
f 59 	137 	143
f 59 	143 	144
f 40 	1132 	46
f 1484 	1483 	243
f 243 	248 	1484
f 1484 	250 	1485
f 249 	1484 	248
f 250 	1484 	249
f 251 	1485 	250
f 252 	1485 	251
f 253 	1485 	252
f 254 	1485 	253
f 255 	1492 	254
f 256 	1492 	255
f 258 	1492 	256
f 261 	262 	1494
f 262 	1510 	1494
f 1510 	1511 	1494
f 239 	300 	240
f 300 	241 	240
f 242 	305 	243
f 248 	243 	308
f 305 	308 	243
f 330 	258 	293
f 241 	300 	302
f 302 	242 	241
f 252 	310 	311
f 252 	311 	253
f 311 	254 	253
f 248 	308 	324
f 248 	324 	249
f 326 	249 	324
f 250 	249 	328
f 326 	328 	249
f 251 	250 	329
f 328 	329 	250
f 329 	310 	252
f 329 	252 	251
f 256 	293 	258
f 330 	259 	258
f 259 	332 	260
f 332 	261 	260
f 293 	294 	330
f 297 	300 	239
f 242 	302 	303
f 303 	305 	242
f 254 	311 	314
f 314 	316 	255
f 314 	255 	254
f 316 	319 	256
f 316 	256 	255
f 319 	293 	256
f 259 	330 	331
f 331 	332 	259
f 261 	332 	333
f 333 	334 	261
f 262 	261 	334
f 84 	262 	334
f 579 	1467 	578
f 580 	1468 	579
f 581 	1468 	580
f 578 	1467 	577
f 1466 	1465 	584
f 584 	585 	1466
f 585 	586 	1466
f 586 	587 	1466
f 1467 	1466 	588
f 577 	1467 	588
f 591 	1470 	590
f 590 	1469 	589
f 589 	1469 	593
f 583 	584 	1491
f 1465 	1491 	584
f 582 	583 	1491
f 595 	596 	1490
f 600 	601 	1489
f 1491 	1490 	596
f 596 	582 	1491
f 599 	600 	1489
f 593 	1469 	592
f 582 	615 	583
f 619 	584 	583
f 627 	628 	587
f 631 	632 	579
f 596 	614 	582
f 619 	583 	615
f 623 	585 	584
f 586 	585 	623
f 627 	587 	586
f 588 	587 	628
f 588 	628 	577
f 629 	577 	628
f 624 	481 	480
f 578 	577 	629
f 481 	624 	483
f 631 	579 	578
f 625 	602 	483
f 580 	579 	632
f 632 	633 	580
f 581 	580 	633
f 592 	581 	634
f 633 	634 	581
f 971 	972 	593
f 609 	1480 	608
f 609 	610 	1480
f 971 	593 	592
f 589 	593 	972
f 972 	590 	589
f 617 	474 	616
f 28 	1496 	27
f 618 	476 	474
f 618 	474 	617
f 478 	476 	618
f 601 	980 	594
f 622 	480 	478
f 981 	595 	594
f 981 	594 	979
f 595 	981 	596
f 982 	596 	981
f 624 	480 	622
f 625 	483 	624
f 603 	1474 	602
f 988 	990 	598
f 599 	990 	600
f 992 	601 	600
f 979 	594 	980
f 988 	598 	597
f 599 	598 	990
f 992 	600 	990
f 615 	582 	614
f 478 	618 	620
f 619 	621 	584
f 478 	620 	622
f 621 	623 	584
f 623 	626 	586
f 626 	627 	586
f 630 	578 	629
f 631 	578 	630
f 686 	687 	661
f 683 	663 	682
f 687 	688 	661
f 662 	661 	688
f 688 	689 	662
f 689 	690 	662
f 691 	662 	690
f 682 	663 	691
f 696 	676 	695
f 806 	807 	681
f 778 	675 	777
f 684 	685 	660
f 661 	660 	685
f 700 	684 	660
f 699 	700 	660
f 697 	659 	702
f 692 	733 	664
f 660 	659 	699
f 658 	701 	659
f 697 	698 	659
f 698 	699 	659
f 685 	686 	661
f 693 	663 	683
f 662 	691 	663
f 694 	664 	693
f 663 	693 	664
f 694 	692 	664
f 672 	681 	810
f 673 	672 	783
f 674 	776 	675
f 701 	676 	696
f 676 	701 	658
f 675 	779 	676
f 702 	659 	701
f 680 	806 	681
f 724 	665 	723
f 725 	667 	724
f 726 	667 	725
f 727 	667 	726
f 728 	668 	727
f 729 	668 	728
f 730 	668 	729
f 731 	669 	730
f 738 	739 	732
f 733 	734 	664
f 665 	664 	734
f 723 	665 	722
f 722 	665 	734
f 750 	751 	1226
f 1226 	739 	737
f 736 	737 	739
f 735 	736 	739
f 1225 	732 	739
f 612 	613 	472
f 742 	743 	670
f 743 	744 	670
f 744 	745 	670
f 671 	670 	745
f 746 	677 	745
f 747 	677 	746
f 741 	742 	670
f 670 	669 	741
f 740 	741 	669
f 740 	669 	731
f 947 	735 	738
f 665 	724 	666
f 666 	724 	667
f 667 	727 	668
f 668 	730 	669
f 671 	745 	677
f 678 	677 	800
f 747 	800 	677
f 807 	808 	681
f 753 	1226 	751
f 754 	1227 	753
f 755 	1227 	754
f 756 	1227 	755
f 757 	1228 	756
f 758 	1228 	757
f 759 	1228 	758
f 1226 	753 	1227
f 678 	803 	679
f 679 	806 	680
f 773 	1229 	765
f 764 	765 	1229
f 766 	773 	765
f 767 	773 	766
f 768 	773 	767
f 769 	773 	768
f 770 	1235 	769
f 772 	1235 	770
f 760 	764 	1229
f 759 	760 	1229
f 1229 	1228 	759
f 737 	750 	1226
f 779 	675 	778
f 695 	676 	779
f 777 	675 	776
f 783 	784 	673
f 784 	785 	673
f 785 	786 	673
f 776 	674 	775
f 674 	673 	786
f 786 	787 	674
f 775 	674 	787
f 792 	1236 	791
f 793 	1236 	792
f 794 	1237 	793
f 795 	1237 	794
f 796 	1237 	795
f 790 	791 	1236
f 797 	1238 	796
f 798 	1238 	797
f 802 	678 	801
f 803 	678 	802
f 804 	679 	803
f 805 	679 	804
f 800 	801 	678
f 806 	679 	805
f 808 	810 	681
f 810 	811 	672
f 782 	783 	672
f 781 	782 	672
f 811 	781 	672
f 1067 	1068 	757
f 682 	1305 	683
f 888 	867 	887
f 889 	867 	888
f 891 	892 	866
f 887 	867 	886
f 886 	866 	885
f 885 	866 	892
f 895 	868 	894
f 893 	870 	898
f 897 	898 	869
f 896 	897 	869
f 869 	900 	896
f 1138 	1139 	871
f 917 	880 	907
f 907 	880 	906
f 1168 	1169 	876
f 1161 	879 	1160
f 906 	880 	1161
f 890 	891 	865
f 915 	890 	865
f 866 	865 	891
f 894 	868 	889
f 863 	917 	864
f 911 	864 	918
f 866 	886 	867
f 899 	868 	895
f 865 	864 	913
f 911 	912 	864
f 912 	913 	864
f 913 	915 	865
f 867 	889 	868
f 900 	869 	899
f 868 	899 	869
f 869 	898 	870
f 893 	1136 	870
f 732 	472 	613
f 945 	946 	732
f 732 	946 	738
f 934 	905 	933
f 938 	904 	937
f 935 	905 	934
f 933 	905 	932
f 932 	904 	931
f 931 	904 	938
f 736 	735 	949
f 948 	949 	735
f 949 	737 	736
f 948 	735 	947
f 949 	951 	737
f 945 	732 	613
f 947 	738 	946
f 634 	968 	592
f 968 	971 	592
f 590 	972 	975
f 975 	976 	591
f 975 	591 	590
f 1496 	591 	27
f 596 	982 	614
f 1509 	82 	597
f 988 	597 	986
f 993 	601 	992
f 980 	601 	993
f 772 	1077 	790
f 1081 	791 	790
f 795 	1197 	796
f 1199 	797 	796
f 683 	1305 	693
f 1306 	693 	1305
f 1306 	1307 	693
f 696 	1323 	701
f 1325 	1326 	701
f 737 	954 	750
f 750 	1061 	751
f 1062 	751 	1061
f 1062 	753 	751
f 754 	753 	1064
f 1064 	755 	754
f 731 	1343 	740
f 758 	757 	1068
f 1350 	741 	740
f 1068 	759 	758
f 770 	769 	1075
f 1075 	772 	770
f 760 	1071 	764
f 1078 	765 	764
f 951 	954 	737
f 1061 	750 	954
f 1062 	1063 	753
f 1063 	1064 	753
f 755 	1064 	1065
f 1065 	756 	755
f 1067 	757 	756
f 767 	1072 	768
f 769 	768 	1074
f 1073 	1074 	768
f 1074 	1075 	769
f 1075 	1076 	772
f 765 	1078 	1079
f 1079 	766 	765
f 1076 	1077 	772
f 791 	1081 	1082
f 792 	791 	1083
f 1082 	1083 	791
f 1083 	793 	792
f 1085 	794 	793
f 1197 	795 	794
f 1197 	794 	1085
f 1199 	796 	1197
f 1203 	798 	797
f 1111 	798 	1208
f 1208 	798 	1203
f 1065 	1066 	756
f 1066 	1067 	756
f 759 	1068 	1069
f 1069 	1070 	760
f 1069 	760 	759
f 1070 	1071 	760
f 1078 	764 	1071
f 1073 	768 	1072
f 1081 	790 	1077
f 766 	1079 	1080
f 767 	766 	1072
f 1080 	1072 	766
f 793 	1083 	1084
f 944 	903 	943
f 943 	902 	942
f 942 	902 	941
f 941 	902 	1089
f 476 	1220 	474
f 914 	910 	1114
f 1238 	1111 	1091
f 1112 	1107 	1091
f 1112 	1091 	1111
f 1093 	908 	1092
f 1096 	1233 	1095
f 1097 	1233 	1096
f 1098 	1233 	1097
f 1086 	1234 	1098
f 1095 	1232 	1094
f 1099 	1100 	1231
f 1100 	1101 	1231
f 1101 	1102 	1231
f 1103 	1232 	1102
f 1094 	1232 	1103
f 1113 	1114 	910
f 1090 	1113 	910
f 1106 	1090 	910
f 1231 	1091 	1099
f 1109 	1099 	1091
f 1107 	1109 	1091
f 1111 	1238 	798
f 1116 	41 	914
f 916 	914 	41
f 41 	42 	916
f 49 	919 	45
f 1115 	1116 	914
f 1370 	1087 	1086
f 1099 	1109 	1372
f 1114 	1115 	914
f 60 	928 	59
f 927 	57 	59
f 57 	927 	56
f 56 	927 	54
f 919 	50 	920
f 1130 	1131 	922
f 1126 	1127 	922
f 1108 	908 	1093
f 1092 	908 	935
f 937 	903 	936
f 1125 	1126 	922
f 1376 	1377 	1102
f 1110 	1104 	909
f 901 	1088 	902
f 902 	943 	903
f 1380 	1381 	1096
f 903 	937 	904
f 904 	932 	905
f 905 	935 	908
f 909 	908 	1108
f 909 	1108 	1110
f 1104 	1105 	909
f 1105 	1106 	909
f 910 	909 	1106
f 1386 	1109 	1107
f 916 	44 	919
f 1386 	1372 	1109
f 920 	54 	921
f 1131 	1125 	922
f 1088 	926 	940
f 1122 	1123 	924
f 1089 	902 	1088
f 936 	903 	944
f 926 	1088 	901
f 1120 	1121 	925
f 1087 	616 	474
f 921 	54 	927
f 1132 	1133 	929
f 1099 	1373 	1100
f 1374 	1100 	1373
f 927 	59 	928
f 1101 	1100 	1374
f 928 	62 	929
f 62 	1132 	929
f 1376 	1102 	1101
f 922 	930 	1130
f 1103 	1102 	1377
f 1103 	1377 	1094
f 1378 	1094 	1377
f 1119 	1120 	925
f 926 	925 	1121
f 1121 	939 	926
f 940 	926 	939
f 1118 	1119 	925
f 1117 	1118 	924
f 925 	924 	1118
f 1095 	1094 	1378
f 1135 	930 	1134
f 1380 	1096 	1095
f 1097 	1096 	1381
f 1129 	1122 	923
f 1128 	1129 	923
f 924 	923 	1122
f 1123 	1117 	924
f 1127 	1128 	923
f 923 	922 	1127
f 1130 	930 	1124
f 930 	929 	1134
f 1124 	930 	1135
f 1133 	1134 	929
f 747 	1349 	800
f 1366 	801 	800
f 805 	1389 	806
f 1390 	807 	806
f 811 	1353 	781
f 684 	700 	1295
f 115 	126 	1116
f 684 	1296 	685
f 1300 	688 	687
f 1300 	689 	688
f 694 	693 	1307
f 1307 	692 	694
f 1323 	696 	695
f 1325 	701 	1323
f 702 	701 	1326
f 702 	1326 	697
f 1328 	698 	697
f 699 	698 	1328
f 1330 	1295 	700
f 1296 	684 	1295
f 1297 	1298 	685
f 1298 	687 	686
f 689 	1300 	1301
f 1301 	1302 	690
f 1301 	690 	689
f 691 	690 	1303
f 1302 	1303 	690
f 76 	937 	936
f 76 	938 	937
f 1303 	682 	691
f 682 	1304 	1305
f 1136 	1137 	870
f 871 	870 	1137
f 1137 	1138 	871
f 874 	1151 	875
f 1169 	1170 	876
f 918 	864 	917
f 1171 	1172 	877
f 878 	1158 	879
f 880 	917 	863
f 879 	1161 	880
f 875 	1151 	881
f 1152 	1153 	881
f 1181 	1182 	882
f 1153 	1181 	881
f 1173 	1174 	876
f 882 	881 	1181
f 883 	1179 	884
f 884 	1173 	876
f 110 	111 	1090
f 1139 	1140 	871
f 872 	871 	1140
f 1140 	1141 	872
f 1141 	1142 	872
f 1142 	1143 	872
f 873 	872 	1143
f 1143 	1144 	873
f 1144 	1146 	873
f 1146 	1147 	873
f 874 	873 	1147
f 1148 	874 	1147
f 1149 	874 	1148
f 1150 	874 	1149
f 1151 	874 	1150
f 1152 	881 	1151
f 41 	1116 	126
f 935 	91 	1092
f 1159 	879 	1158
f 1160 	879 	1159
f 1164 	1157 	878
f 1157 	1158 	878
f 103 	104 	1092
f 1093 	104 	1108
f 105 	106 	1108
f 1172 	1162 	877
f 1170 	1171 	877
f 878 	877 	1162
f 1162 	1164 	878
f 877 	876 	1170
f 1173 	884 	1166
f 1168 	876 	1174
f 110 	1090 	1106
f 882 	1184 	883
f 1180 	884 	1179
f 1166 	884 	1180
f 1179 	883 	1178
f 1183 	882 	1182
f 1184 	882 	1183
f 1177 	883 	1184
f 1178 	883 	1177
f 113 	1115 	1114
f 115 	1116 	1115
f 1191 	1192 	1052
f 1188 	1054 	1187
f 1192 	1193 	1052
f 1053 	1052 	1193
f 1193 	1194 	1053
f 1194 	1195 	1053
f 1196 	1053 	1195
f 1187 	1054 	1196
f 793 	1084 	1085
f 1202 	797 	1199
f 1203 	797 	1202
f 1198 	1054 	1188
f 1051 	1050 	1190
f 1052 	1051 	1190
f 1163 	1276 	1167
f 1204 	1049 	1210
f 899 	1407 	900
f 1408 	896 	900
f 1165 	1209 	1048
f 1048 	1209 	1049
f 1050 	1049 	1206
f 1204 	1205 	1049
f 1205 	1206 	1049
f 1422 	1136 	893
f 1210 	1049 	1209
f 1167 	1276 	1165
f 1418 	911 	918
f 912 	911 	1418
f 1058 	1057 	1259
f 1058 	1262 	1059
f 1059 	1265 	1060
f 1154 	1277 	1155
f 1283 	1284 	1185
f 1284 	1285 	1186
f 1186 	1289 	1154
f 1422 	1137 	1136
f 1211 	1056 	1218
f 1217 	1218 	1055
f 1216 	1217 	1055
f 1216 	1055 	1219
f 1189 	1190 	1050
f 1206 	1207 	1050
f 1219 	1055 	1198
f 1190 	1191 	1052
f 1207 	1189 	1050
f 1053 	1196 	1054
f 1054 	1198 	1055
f 1055 	1218 	1056
f 1211 	1212 	1056
f 1057 	1056 	1213
f 1323 	695 	1322
f 1435 	1436 	1153
f 1447 	1413 	1161
f 1182 	1458 	1183
f 1459 	1184 	1183
f 915 	1395 	890
f 1397 	891 	1396
f 1400 	886 	885
f 1400 	1401 	886
f 887 	1402 	888
f 1402 	889 	888
f 894 	1405 	895
f 899 	895 	1407
f 1406 	1407 	895
f 1408 	900 	1407
f 1410 	897 	896
f 1410 	1411 	897
f 906 	1414 	907
f 1415 	1416 	907
f 917 	1416 	918
f 918 	1417 	1418
f 1212 	1213 	1056
f 1396 	890 	1395
f 890 	1396 	891
f 1213 	1214 	1057
f 1215 	1259 	1057
f 1397 	1398 	891
f 1214 	1215 	1057
f 892 	1398 	885
f 1400 	885 	1399
f 887 	886 	1401
f 1401 	1402 	887
f 1402 	1403 	889
f 1279 	1280 	1155
f 1201 	1165 	1200
f 1403 	1404 	889
f 894 	889 	1404
f 1406 	895 	1405
f 898 	897 	1411
f 1411 	893 	898
f 906 	1161 	1413
f 1415 	907 	1414
f 478 	480 	1220
f 917 	907 	1416
f 480 	481 	1220
f 1417 	918 	1416
f 912 	1419 	913
f 1224 	1481 	1225
f 1420 	1421 	913
f 738 	735 	739
f 1423 	1138 	1137
f 1227 	756 	1228
f 1428 	1142 	1141
f 1143 	1142 	1429
f 1428 	1429 	1142
f 1429 	1144 	1143
f 773 	769 	1230
f 1231 	1102 	1232
f 1232 	1095 	1233
f 1435 	1153 	1152
f 1438 	1147 	1146
f 1148 	1147 	1439
f 1438 	1439 	1147
f 1439 	1149 	1148
f 1230 	769 	1235
f 1236 	1235 	790
f 1137 	1422 	1423
f 772 	790 	1235
f 1236 	793 	1237
f 1139 	1425 	1140
f 1426 	1427 	1140
f 1237 	796 	1238
f 1429 	1430 	1144
f 1437 	1146 	1430
f 1149 	1431 	1150
f 1151 	1150 	1433
f 1151 	1433 	1152
f 1146 	1144 	1430
f 1437 	1438 	1146
f 1162 	1441 	1164
f 1327 	697 	1326
f 1328 	697 	1327
f 1330 	700 	699
f 692 	1317 	733
f 1331 	734 	733
f 729 	728 	1340
f 1340 	1341 	729
f 746 	745 	1347
f 1347 	1348 	747
f 1347 	747 	746
f 1348 	1349 	747
f 1366 	800 	1349
f 1342 	1343 	731
f 1352 	743 	742
f 1308 	1317 	692
f 723 	1335 	724
f 1335 	1336 	724
f 725 	1336 	726
f 1337 	1338 	726
f 727 	1339 	728
f 728 	1339 	1340
f 730 	729 	1341
f 1341 	731 	730
f 122 	1120 	1119
f 1156 	1273 	1163
f 1209 	1165 	1201
f 123 	1121 	1120
f 123 	1120 	122
f 123 	94 	1121
f 745 	744 	1346
f 1346 	1347 	745
f 1060 	1269 	1145
f 1145 	1269 	1175
f 1175 	1291 	1176
f 1176 	1294 	1185
f 1282 	1185 	1294
f 1282 	1283 	1185
f 1352 	742 	741
f 1129 	38 	1122
f 22 	38 	1129
f 1260 	1058 	1259
f 1261 	1058 	1260
f 1262 	1058 	1261
f 1263 	1059 	1262
f 1264 	1059 	1263
f 1265 	1059 	1264
f 1266 	1060 	1265
f 1267 	1060 	1266
f 1268 	1060 	1267
f 1269 	1060 	1268
f 1270 	1175 	1269
f 1271 	1175 	1270
f 1291 	1175 	1271
f 1354 	1355 	781
f 782 	781 	1355
f 782 	1355 	783
f 1356 	783 	1355
f 1274 	1163 	1273
f 1275 	1163 	1274
f 1276 	1163 	1275
f 1200 	1165 	1276
f 1278 	1279 	1155
f 1273 	1156 	1272
f 1156 	1155 	1280
f 1280 	1281 	1156
f 1272 	1156 	1281
f 783 	1356 	784
f 1357 	784 	1356
f 1357 	1358 	784
f 785 	784 	1358
f 1186 	1185 	1284
f 1286 	1186 	1285
f 1359 	786 	785
f 1359 	785 	1358
f 786 	1359 	787
f 1360 	787 	1359
f 1278 	1155 	1277
f 1277 	1154 	1288
f 1288 	1154 	1287
f 1289 	1186 	1286
f 1290 	1154 	1289
f 1287 	1154 	1290
f 787 	1360 	775
f 1361 	775 	1360
f 1293 	1176 	1292
f 1294 	1176 	1293
f 1292 	1176 	1291
f 1362 	776 	775
f 1362 	775 	1361
f 776 	1362 	777
f 1363 	777 	1362
f 777 	1363 	778
f 1364 	778 	1363
f 778 	1364 	779
f 1365 	779 	1364
f 1365 	1321 	779
f 779 	1321 	695
f 801 	1366 	1367
f 802 	801 	1368
f 1367 	1368 	801
f 1368 	803 	802
f 1188 	1525 	1198
f 1388 	804 	803
f 1389 	805 	804
f 1389 	804 	1388
f 1526 	1527 	1198
f 1390 	806 	1389
f 1530 	1201 	1200
f 1531 	1209 	1530
f 1392 	808 	807
f 810 	808 	1393
f 1393 	808 	1392
f 1533 	1204 	1210
f 1393 	811 	810
f 1205 	1204 	1533
f 685 	1296 	1297
f 686 	685 	1298
f 687 	1298 	1299
f 1299 	1300 	687
f 1541 	1212 	1211
f 682 	1303 	1304
f 692 	1307 	1308
f 1331 	733 	1317
f 1552 	1260 	1259
f 1555 	1556 	1262
f 1329 	699 	1328
f 699 	1329 	1330
f 734 	1331 	1332
f 722 	734 	1333
f 1332 	1333 	734
f 722 	1333 	723
f 1334 	723 	1333
f 1334 	1335 	723
f 725 	724 	1336
f 1337 	726 	1336
f 727 	726 	1338
f 125 	1130 	1124
f 1338 	1339 	727
f 1130 	125 	1131
f 1125 	1131 	6
f 7 	6 	1131
f 11 	1126 	6
f 1125 	6 	1126
f 1574 	1289 	1286
f 1127 	1126 	13
f 11 	13 	1126
f 731 	1341 	1342
f 1127 	13 	1128
f 18 	1128 	13
f 1129 	1128 	22
f 18 	22 	1128
f 1350 	740 	1343
f 1345 	744 	1344
f 743 	1344 	744
f 62 	46 	1132
f 1345 	1346 	744
f 1132 	40 	1133
f 64 	1133 	40
f 1133 	64 	1134
f 66 	1134 	64
f 68 	1135 	1134
f 68 	1134 	66
f 68 	70 	1135
f 73 	72 	936
f 72 	76 	936
f 1350 	1351 	741
f 1517 	1190 	1516
f 76 	79 	938
f 1351 	1352 	741
f 931 	938 	81
f 79 	81 	938
f 743 	1352 	1344
f 931 	81 	932
f 83 	932 	81
f 83 	85 	933
f 83 	933 	932
f 1354 	781 	1353
f 934 	933 	87
f 85 	87 	933
f 934 	87 	935
f 89 	935 	87
f 1195 	1194 	1522
f 89 	91 	935
f 1522 	1523 	1195
f 939 	1121 	94
f 93 	939 	94
f 93 	96 	940
f 93 	940 	939
f 1088 	940 	97
f 96 	97 	940
f 1187 	1525 	1188
f 97 	98 	1089
f 97 	1089 	1088
f 1526 	1198 	1525
f 941 	1089 	99
f 98 	99 	1089
f 941 	99 	942
f 100 	942 	99
f 101 	943 	942
f 101 	942 	100
f 943 	101 	944
f 102 	944 	101
f 1200 	1529 	1530
f 936 	944 	73
f 102 	73 	944
f 103 	1092 	91
f 1093 	1092 	104
f 105 	1108 	104
f 1322 	695 	1321
f 1110 	1108 	106
f 1535 	1206 	1205
f 1104 	1110 	107
f 106 	107 	1110
f 1535 	1536 	1206
f 1207 	1206 	1536
f 1105 	1104 	108
f 107 	108 	1104
f 108 	109 	1106
f 108 	1106 	1105
f 109 	110 	1106
f 1381 	1098 	1097
f 1098 	1369 	1086
f 112 	1113 	111
f 1113 	1090 	111
f 1114 	1113 	113
f 112 	113 	1113
f 1383 	1111 	1208
f 113 	114 	1115
f 1384 	1112 	1111
f 1384 	1111 	1383
f 114 	115 	1115
f 1112 	1384 	1107
f 1385 	1107 	1384
f 1107 	1385 	1386
f 126 	115 	116
f 38 	117 	1122
f 117 	118 	1123
f 117 	1123 	1122
f 1370 	1371 	1087
f 118 	119 	1117
f 118 	1117 	1123
f 1371 	616 	1087
f 120 	1118 	1117
f 120 	1117 	119
f 1118 	120 	1119
f 121 	1119 	120
f 1372 	1373 	1099
f 122 	1119 	121
f 1374 	1375 	1101
f 1375 	1376 	1101
f 1124 	1135 	70
f 124 	1124 	70
f 125 	1124 	124
f 7 	1131 	125
f 1379 	1095 	1378
f 1380 	1095 	1379
f 1382 	1098 	1381
f 1382 	1369 	1098
f 1370 	1086 	1369
f 803 	1368 	1387
f 803 	1387 	1388
f 1391 	807 	1390
f 1392 	807 	1391
f 1445 	1159 	1158
f 1445 	1160 	1159
f 1394 	811 	1393
f 1447 	1161 	1160
f 1394 	1353 	811
f 1448 	1450 	1166
f 1451 	1174 	1173
f 1174 	1451 	1168
f 1453 	1169 	1168
f 1169 	1453 	1170
f 1455 	1171 	1170
f 1455 	1172 	1171
f 1172 	1440 	1162
f 1164 	1442 	1157
f 1443 	1444 	1157
f 1158 	1444 	1445
f 1160 	1446 	1447
f 1180 	1449 	1166
f 1452 	1168 	1451
f 1453 	1168 	1452
f 1454 	1170 	1453
f 1455 	1170 	1454
f 1441 	1162 	1440
f 1181 	1436 	1457
f 1181 	1153 	1436
f 1182 	1181 	1458
f 1457 	1458 	1181
f 1459 	1183 	1458
f 1461 	1177 	1184
f 1177 	1461 	1178
f 1462 	1178 	1461
f 1178 	1462 	1179
f 1463 	1179 	1462
f 1464 	1180 	1179
f 1464 	1179 	1463
f 892 	891 	1398
f 1399 	885 	1398
f 1405 	894 	1404
f 896 	1408 	1409
f 1409 	1410 	896
f 893 	1411 	1412
f 1414 	906 	1413
f 1419 	912 	1418
f 1420 	913 	1419
f 915 	913 	1421
f 1395 	915 	1421
f 893 	1412 	1422
f 1423 	1424 	1138
f 1139 	1138 	1425
f 1424 	1425 	1138
f 1426 	1140 	1425
f 1141 	1140 	1427
f 1427 	1428 	1141
f 1432 	1150 	1431
f 1432 	1433 	1150
f 1433 	1434 	1152
f 1434 	1435 	1152
f 1149 	1439 	1431
f 1164 	1441 	1442
f 1443 	1157 	1442
f 1158 	1157 	1444
f 1446 	1160 	1445
f 1448 	1166 	1449
f 1173 	1166 	1450
f 1173 	1450 	1451
f 1456 	1172 	1455
f 1440 	1172 	1456
f 1459 	1460 	1184
f 1184 	1460 	1461
f 1180 	1464 	1449
f 732 	1225 	472
f 1475 	1476 	1223
f 1476 	1477 	1223
f 1477 	1478 	1223
f 472 	1225 	1472
f 1224 	1223 	1478
f 1478 	1479 	1224
f 1479 	1480 	1224
f 1481 	1224 	1480
f 1472 	1225 	1481
f 1474 	1475 	1222
f 1223 	1222 	1475
f 483 	1474 	1222
f 481 	483 	1222
f 1222 	1220 	481
f 1221 	474 	1220
f 1234 	474 	1221
f 1233 	1098 	1234
f 1086 	1087 	1234
f 1087 	474 	1234
f 478 	1220 	476
f 1489 	1488 	598
f 1499 	1471 	1498
f 594 	595 	1490
f 1496 	1470 	591
f 587 	588 	1466
f 1467 	579 	1468
f 1468 	592 	1469
f 1470 	1496 	1498
f 1469 	590 	1470
f 1497 	1471 	1499
f 1470 	1498 	1471
f 1497 	1504 	1471
f 1507 	1508 	1487
f 1508 	1509 	1488
f 1488 	1487 	1508
f 597 	598 	1488
f 1509 	597 	1488
f 601 	594 	1490
f 1490 	1489 	601
f 1512 	1513 	1495
f 240 	241 	1483
f 242 	243 	1483
f 241 	242 	1483
f 260 	261 	1493
f 1483 	1482 	240
f 239 	240 	1482
f 1494 	1493 	261
f 259 	260 	1493
f 1500 	1473 	1505
f 1473 	1471 	1505
f 483 	602 	1474
f 1504 	1505 	1471
f 1501 	1502 	1473
f 604 	1475 	1474
f 604 	1474 	603
f 1500 	1501 	1473
f 1475 	604 	1476
f 605 	1476 	604
f 606 	1477 	1476
f 606 	1476 	605
f 1482 	1473 	1502
f 1477 	606 	1478
f 607 	1478 	606
f 1502 	1503 	1482
f 1503 	239 	1482
f 607 	608 	1479
f 607 	1479 	1478
f 608 	1480 	1479
f 1485 	254 	1486
f 1480 	610 	1481
f 1486 	254 	1492
f 258 	259 	1493
f 1472 	1481 	611
f 610 	611 	1481
f 1492 	258 	1493
f 611 	612 	472
f 611 	472 	1472
f 592 	1468 	581
f 598 	599 	1489
f 1495 	1494 	1511
f 1487 	1495 	1514
f 1513 	1514 	1495
f 1507 	1487 	1506
f 1506 	1487 	1515
f 1511 	1512 	1495
f 1515 	1487 	1514
f 1219 	1538 	1216
f 1216 	1538 	1217
f 1541 	1211 	1218
f 1212 	1543 	1213
f 1543 	1214 	1213
f 1215 	1546 	1259
f 1189 	1207 	1536
f 1189 	1516 	1190
f 1517 	1518 	1190
f 1191 	1518 	1192
f 1193 	1192 	1519
f 1193 	1521 	1194
f 1194 	1521 	1522
f 1196 	1195 	1523
f 1523 	1187 	1196
f 1187 	1524 	1525
f 1276 	1528 	1200
f 1201 	1530 	1209
f 1531 	1532 	1209
f 1210 	1209 	1532
f 1210 	1532 	1533
f 1516 	1189 	1536
f 1219 	1198 	1527
f 1537 	1538 	1219
f 1217 	1539 	1218
f 1540 	1541 	1218
f 1212 	1541 	1542
f 1542 	1543 	1212
f 1214 	1543 	1544
f 1215 	1214 	1545
f 1544 	1545 	1214
f 1552 	1259 	1546
f 1267 	1547 	1548
f 1267 	1548 	1268
f 1548 	1269 	1268
f 1269 	1550 	1270
f 1270 	1550 	1271
f 1551 	1271 	1550
f 1551 	148 	1271
f 1545 	1546 	1215
f 1260 	1552 	1553
f 1553 	1261 	1260
f 1555 	1262 	1261
f 1263 	1262 	1556
f 1556 	1557 	1264
f 1556 	1264 	1263
f 1265 	1264 	1558
f 1557 	1558 	1264
f 1266 	1265 	1559
f 1558 	1559 	1265
f 1559 	1547 	1267
f 1559 	1267 	1266
f 1564 	1281 	1280
f 1281 	1564 	1272
f 1565 	1272 	1564
f 1565 	1273 	1272
f 1529 	1200 	1528
f 1572 	1284 	1283
f 1572 	1573 	1284
f 1285 	1284 	1573
f 1285 	1573 	1286
f 1574 	1286 	1573
f 1278 	1561 	1279
f 1562 	1563 	1279
f 1280 	1563 	1564
f 1567 	1274 	1273
f 1274 	1567 	1275
f 1568 	1569 	1275
f 1282 	1570 	1283
f 1571 	1283 	1570
f 1572 	1283 	1571
f 142 	1288 	1287
f 142 	141 	1288
f 1277 	1288 	141
f 1293 	150 	1294
f 151 	152 	1294
f 1191 	1190 	1518
f 1519 	1192 	1518
f 1193 	1519 	1520
f 1520 	1521 	1193
f 1187 	1523 	1524
f 1205 	1533 	1534
f 1205 	1534 	1535
f 1537 	1219 	1527
f 1217 	1538 	1539
f 1540 	1218 	1539
f 1269 	1548 	1549
f 1549 	1550 	1269
f 1291 	1271 	148
f 1553 	1554 	1261
f 1554 	1555 	1261
f 1278 	1277 	1561
f 1560 	1561 	1277
f 1562 	1279 	1561
f 1280 	1279 	1563
f 1566 	1273 	1565
f 1567 	1273 	1566
f 1568 	1275 	1567
f 1276 	1275 	1569
f 1528 	1276 	1569
f 1294 	152 	1282
f 1575 	1289 	1574
f 1576 	1290 	1289
f 1576 	1289 	1575
f 1290 	1576 	1287
f 1577 	1287 	1576
f 1287 	1577 	142
f 1560 	1277 	141
f 148 	147 	1291
f 1292 	1291 	149
f 147 	149 	1291
f 1293 	1292 	150
f 149 	150 	1292
f 151 	1294 	150
f 1570 	1282 	152
f 67 	1503 	1502
f 1503 	71 	239
f 67 	1502 	1501
f 67 	69 	1503
f 69 	71 	1503
f 976 	27 	591
f 1498 	1496 	36
f 28 	36 	1496
f 36 	39 	1499
f 36 	1499 	1498
f 39 	47 	1499
f 1497 	1499 	47
f 55 	1504 	48
f 47 	48 	1497
f 1504 	1497 	48
f 1505 	1504 	58
f 55 	58 	1504
f 1505 	58 	1500
f 63 	1500 	58
f 1501 	1500 	65
f 63 	65 	1500
f 65 	67 	1501
f 297 	239 	71
f 1515 	75 	1506
f 1506 	74 	1507
f 1514 	1513 	92
f 1514 	92 	1515
f 95 	1515 	92
f 74 	1506 	75
f 95 	75 	1515
f 74 	77 	1507
f 1507 	77 	1508
f 78 	1508 	77
f 1509 	1508 	80
f 78 	80 	1508
f 986 	597 	82
f 80 	82 	1509
f 262 	84 	1510
f 1510 	84 	1511
f 86 	1511 	84
f 86 	88 	1511
f 1512 	1511 	88
f 1512 	88 	1513
f 90 	1513 	88
f 92 	1513 	90
# 1337 faces

 #end of obj_0

