{
  "version": "0.3.0",
  "description": "Snap to interact with Partisia Blockchain",
  "proposedName": "Partisia Blockchain",
  "repository": {
    "type": "git",
    "url": "https://gitlab.com/partisiablockchain/tools/snap"
  },
  "source": {
    "shasum": "5ZD5e2lXfNXSfiSqdoOdYaEjkEdqBevpykVL5ZjgsEY=",
    "location": {
      "npm": {
        "filePath": "dist/bundle.js",
        "iconPath": "images/icon.svg",
        "packageName": "@partisiablockchain/snap",
        "registry": "https://registry.npmjs.org/"
      }
    }
  },
  "initialPermissions": {
    "snap_getBip44Entropy": [
      {
        "coinType": 3757
      }
    ],
    "snap_dialog": {},
    "endowment:rpc": {
      "dapps": true,
      "snaps": false
    },
    "endowment:page-home": {},
    "snap_manageState": {}
  },
  "manifestVersion": "0.1"
}
