error: Expected u32, but got u8
 --> invalid_type/type_array_construct_size_not_usize_3.rs
  |
7 |     let counts: [i32; 2u8] = [1i32; 2u8];
  |                       ^^^
  |

error: Expected u32, but got u8
 --> invalid_type/type_array_construct_size_not_usize_3.rs
  |
7 |     let counts: [i32; 2u8] = [1i32; 2u8];
  |                                     ^^^
  |
