error: Expected u64, but got i32
 --> wip_type/infer_tuple_literal.rs
  |
5 |     (2, 3).1 + 5u64
  |     ^^^^^^^^
  |

error: Expected identical types, but got i32 and u64
 --> wip_type/infer_tuple_literal.rs
  |
5 |     (2, 3).1 + 5u64
  |     ^^^^^^^^^^^^^^^
  |
