error: Return requires PUBLIC context level. Context level was SECRET, but expected PUBLIC
 --> invalid_type/infoflow_high_return_in_cond.rs
  |
8 |             return secret;
  |             ^^^^^^^^^^^^^^
  |
note: context level raised to SECRET by expression
 --> invalid_type/infoflow_high_return_in_cond.rs
  |
6 |     if secret == Sbi32::from(1) {
  |        ^^^^^^^^^^^^^^^^^^^^^^^^ context level raised to SECRET by expression
  |
