error: Expected pbc_zk::Sbi32, but got u32
 --> invalid_type/binop_lt_not_compatible.rs
  |
6 |     (x < y);
  |          ^
  |

error: Expected identical types, but got pbc_zk::Sbi32 and u32
 --> invalid_type/binop_lt_not_compatible.rs
  |
6 |     (x < y);
  |      ^^^^^
  |
