error: no viable alternative at input 'foriin{i}}'
 --> invalid_parse/expr_missing.rs
  |
6 | }
  | ^
  |

error: mismatched input 'in' expecting {'!', '::'}
 --> invalid_parse/expr_missing.rs
  |
3 |     for i in {
  |           ^^
  |

error: mismatched input '}' expecting {'!', '::'}
 --> invalid_parse/expr_missing.rs
  |
5 |     }
  |     ^
  |
