error: Continue requires PUBLIC context level. Context level was SECRET, but expected PUBLIC
  --> invalid_type/assign_to_public_after_continue_on_sbi.rs
   |
10 |             continue;
   |             ^^^^^^^^
   |
note: context level raised to SECRET by expression
 --> invalid_type/assign_to_public_after_continue_on_sbi.rs
  |
9 |         if sum >= Sbi32::from(10) {
  |            ^^^^^^^^^^^^^^^^^^^^^^ context level raised to SECRET by expression
  |
