error: Array size expression must be constant
 --> invalid_type/macro_non_constant_size_array.rs
  |
9 | pbc_zk::test_eq!(add_self(1, 2), 3, [2; 2u32 + 2u32]);
  |                                         ^^^^^^^^^^^
  |

error: Non-literal sizes for array types are not supported
 --> invalid_type/macro_non_constant_size_array.rs
  |
9 | pbc_zk::test_eq!(add_self(1, 2), 3, [2; 2u32 + 2u32]);
  |                                         ^^^^^^^^^^^
  |
