error: Variable MY_UNKNOWN_CONST not in scope
 --> invalid_type/const_not_const_expression.rs
  |
3 | const MY_CONST: i32 = if MY_UNKNOWN_CONST { 1 } else { 2 };
  |                          ^^^^^^^^^^^^^^^^
  |

error: Constant initializer expression must be constant
 --> invalid_type/const_not_const_expression.rs
  |
3 | const MY_CONST: i32 = if MY_UNKNOWN_CONST { 1 } else { 2 };
  |                       ^^^^^^^^^^^^^^^^^^^
  |
