error: Expected i32, but got u8
  --> wip_type/infer_shadowed.rs
   |
13 |     b + 8u8;
   |         ^^^
   |

error: Expected identical types, but got i32 and u8
  --> wip_type/infer_shadowed.rs
   |
13 |     b + 8u8;
   |     ^^^^^^^
   |

error: Expected i32, but got u16
  --> wip_type/infer_shadowed.rs
   |
14 |     c + 8u16
   |         ^^^^
   |

error: Expected identical types, but got i32 and u16
  --> wip_type/infer_shadowed.rs
   |
14 |     c + 8u16
   |     ^^^^^^^^
   |
