error: Expected u32, but got i32
 --> invalid_type/eq_not_i32_u32.rs
  |
6 |     x == y
  |          ^
  |

error: Expected identical types, but got u32 and i32
 --> invalid_type/eq_not_i32_u32.rs
  |
6 |     x == y
  |     ^^^^^^
  |
