{
  "$schema": "./node_modules/@stryker-mutator/core/schema/stryker-schema.json",
  "_comment": "This config was generated using 'stryker init'. Please take a look at: https://stryker-mutator.io/docs/stryker-js/configuration/ for more information",
  "packageManager": "npm",
  "reporters": [
    "html",
    "clear-text",
    "progress"
  ],
  "htmlReporter": { "fileName": "target/stryker-report/mutation.html" },
  "testRunner": "jest",
  "coverageAnalysis": "perTest",
  "checkers": ["typescript"],
  "tsconfigFile": "tsconfig.json",
  "timeoutMS": 10000,
  "thresholds": {
    "high": 100,
    "low": 100,
    "break": 100
  },
  "ignorePatterns": [".idea", "target"],
  "mutate": ["src/main/**/*.ts"]
}
