error[E0252]: the name `ShortnameZkComputation` is defined multiple times
 --> tests/pbc_contract_codegen/fail/zk/zk_start_computation_wrong_shortname_type3.rs:6:5
  |
3 | use pbc_contract_common::shortname::ShortnameZkComputation;
  |     ------------------------------------------------------ previous import of the type `ShortnameZkComputation` here
...
6 | use pbc_contract_common::shortname::ShortnameZkComputation;
  |     ^^^^^^^^^^^^^^^^^^^^^^^^^^^^^^^^^^^^^^^^^^^^^^^^^^^^^^ `ShortnameZkComputation` reimported here
  |
  = note: `ShortnameZkComputation` must be defined only once in the type namespace of this module

warning: unused import: `pbc_contract_common::shortname::ShortnameZkComputation`
 --> tests/pbc_contract_codegen/fail/zk/zk_start_computation_wrong_shortname_type3.rs:6:5
  |
6 | use pbc_contract_common::shortname::ShortnameZkComputation;
  |     ^^^^^^^^^^^^^^^^^^^^^^^^^^^^^^^^^^^^^^^^^^^^^^^^^^^^^^
  |
  = note: `#[warn(unused_imports)]` on by default

error[E0308]: mismatched types
  --> tests/pbc_contract_codegen/fail/zk/zk_start_computation_wrong_shortname_type3.rs:32:9
   |
29 |     (ContractState { own_variable_id: 0 }, vec![], vec![ZkStateChange::start_computation::<SecretVarMetadata>(
   |                                                         ----------------------------------------------------- arguments to this function are incorrect
...
32 |         shortname,
   |         ^^^^^^^^^ expected `Option<ShortnameZkComputeComplete>`, found `Option<ShortnameZkComputation>`
   |
   = note: expected enum `Option<ShortnameZkComputeComplete>`
              found enum `Option<ShortnameZkComputation>`
note: associated function defined here
  --> $WORKSPACE/pbc_contract_common/src/zk/mod.rs
   |
   |     pub fn start_computation<T: ReadWriteState>(
   |            ^^^^^^^^^^^^^^^^^
