error[E0308]: mismatched types
  --> tests/pbc_contract_codegen/fail/zk/zk_input_var_wrong_shortname_type4.rs:38:9
   |
37 |     let input_def = ZkInputDef::with_metadata(
   |                     ------------------------- arguments to this function are incorrect
38 |         shortname,
   |         ^^^^^^^^^ expected `Option<ShortnameZkVariableInputted>`, found `Option<ShortnameZkComputeComplete>`
   |
   = note: expected enum `Option<ShortnameZkVariableInputted>`
              found enum `Option<ShortnameZkComputeComplete>`
note: associated function defined here
  --> $WORKSPACE/pbc_contract_common/src/zk/mod.rs
   |
   |     pub fn with_metadata(
   |            ^^^^^^^^^^^^^
