error: custom attribute panicked
  --> tests/pbc_contract_codegen/fail/function_not_bare.rs:12:5
   |
12 |     #[action(shortname = 0x01)]
   |     ^^^^^^^^^^^^^^^^^^^^^^^^^^^
   |
   = help: message: Contract functions must be bare functions.
