error: custom attribute panicked
  --> tests/pbc_contract_codegen/fail/zk/zk_on_compute_complete_missing_shortname.rs:14:1
   |
14 | #[zk_on_compute_complete]
   | ^^^^^^^^^^^^^^^^^^^^^^^^^
   |
   = help: message: Required attribute 'shortname' is missing
