error[E0080]: evaluation of constant value failed
  --> tests/pbc_contract_codegen/fail/zk/missing_zk_derive_arg_action.rs:14:1
   |
14 | #[action]
   | ^^^^^^^^^ the evaluated program panicked at 'action cannot be non-zk if the init function is zk. Consider using #[action(zk = true)]', $DIR/tests/pbc_contract_codegen/fail/zk/missing_zk_derive_arg_action.rs:14:1
   |
   = note: this error originates in the macro `$crate::panic::panic_2021` which comes from the expansion of the macro `assert` (in Nightly builds, run with -Z macro-backtrace for more info)

error[E0277]: the trait bound `ZkState<u64>: CreateTypeSpec` is not satisfied
  --> tests/pbc_contract_codegen/fail/zk/missing_zk_derive_arg_action.rs:18:16
   |
14 | #[action]
   | --------- required by a bound introduced by this call
...
18 |     _zk_state: pbc_contract_common::zk::ZkState<u64>,
   |                ^^^^^^^^^^^^^^^^^^^^^^^^^^^^^^^^^^^^^ the trait `CreateTypeSpec` is not implemented for `ZkState<u64>`
   |
   = help: the following other types implement trait `CreateTypeSpec`:
             Address
             AvlTreeMap<K, V>
             BTreeSet<V>
             BlsPublicKey
             BlsSignature
             ContractHashes
             EventSubscriptionId
             ExternalEventId
           and $N others
note: required by a bound in `FnAbi::argument`
  --> $WORKSPACE/pbc_contract_core/src/abi/func.rs
   |
   |     pub fn argument<T: CreateTypeSpec>(
   |                        ^^^^^^^^^^^^^^ required by this bound in `FnAbi::argument`
