error: custom attribute panicked
  --> tests/pbc_contract_codegen/fail/zk/bad_attribute_zk_non_bool.rs:14:1
   |
14 | #[action(zk = 1)]
   | ^^^^^^^^^^^^^^^^^
   |
   = help: message: Invalid zk attribute, expecting a boolean literal, but got: 1
