error: proc-macro derive panicked
 --> tests/pbc_contract_codegen/fail/zk/secret_binary_derive_unimplemented_item_struct_enum.rs:5:10
  |
5 | #[derive(SecretBinary)]
  |          ^^^^^^^^^^^^
  |
  = help: message: not implemented: ItemStructEnum

error: cannot find attribute `discriminant` in this scope
 --> tests/pbc_contract_codegen/fail/zk/secret_binary_derive_unimplemented_item_struct_enum.rs:7:7
  |
7 |     #[discriminant(0)]
  |       ^^^^^^^^^^^^

error: cannot find attribute `discriminant` in this scope
 --> tests/pbc_contract_codegen/fail/zk/secret_binary_derive_unimplemented_item_struct_enum.rs:9:7
  |
9 |     #[discriminant(1)]
  |       ^^^^^^^^^^^^
