error: custom attribute panicked
  --> tests/pbc_contract_codegen/fail/bad_argument_impl.rs:18:1
   |
18 | #[action(shortname = 0x01)]
   | ^^^^^^^^^^^^^^^^^^^^^^^^^^^
   |
   = help: message: Unsupported impl trait type
