{
    "fluentMethods": true,
    "relationships": [],
    "fields": [
        {
            "fieldName": "name",
            "fieldType": "String",
            "fieldValidateRules": [
                "required"
            ]
        }
    ],
    "changelogDate": "20170801145759",
    "dto": "no",
    "service": "serviceClass",
    "entityTableName": "managed_service",
    "pagination": "pagination"
}
