{
    "fluentMethods": true,
    "relationships": [
        {
            "relationshipName": "privileges",
            "otherEntityName": "privilege",
            "relationshipType": "many-to-many",
            "ownerSide": false,
            "otherEntityRelationshipName": "authority"
        }
    ],
    "fields": [
        {
            "fieldName": "name",
            "fieldType": "String",
            "fieldValidateRules": [
                "required"
            ]
        }
    ],
    "changelogDate": "20180430125411",
    "dto": "no",
    "service": "serviceClass",
    "entityTableName": "authority",
    "pagination": "pagination"
}
