{
    "fluentMethods": true,
    "relationships": [
        {
            "relationshipName": "serviceTypeId",
            "otherEntityName": "serviceType",
            "relationshipType": "many-to-one",
            "relationshipValidateRules": [
                "required"
            ],
            "otherEntityField": "id"
        }
    ],
    "fields": [
        {
            "fieldName": "other",
            "fieldType": "String"
        }
    ],
    "changelogDate": "20180419091239",
    "dto": "no",
    "service": "serviceClass",
    "entityTableName": "other_service_response",
    "pagination": "no"
}
