{
    "fluentMethods": true,
    "relationships": [],
    "fields": [
        {
            "fieldName": "qsaAttestorName",
            "fieldType": "String",
            "fieldValidateRules": [
                "required"
            ]
        },
        {
            "fieldName": "qsaAttestorSignature",
            "fieldType": "String",
            "fieldValidateRules": [
                "required"
            ]
        },
        {
            "fieldName": "qsaAttestorCompany",
            "fieldType": "String",
            "fieldValidateRules": [
                "required"
            ]
        },
        {
            "fieldName": "attestationDate",
            "fieldType": "LocalDate"
        }
    ],
    "changelogDate": "20180221120320",
    "dto": "no",
    "service": "serviceClass",
    "entityTableName": "qsa_attestation",
    "jpaMetamodelFiltering": false,
    "pagination": "no"
}
