{
    "fluentMethods": true,
    "relationships": [],
    "fields": [
        {
            "fieldName": "isaAttestorName",
            "fieldType": "String",
            "fieldValidateRules": [
                "required"
            ]
        },
        {
            "fieldName": "isaAttestorTitle",
            "fieldType": "String",
            "fieldValidateRules": [
                "required"
            ]
        },
        {
            "fieldName": "isaAttestorCompany",
            "fieldType": "String",
            "fieldValidateRules": [
                "required"
            ]
        },
        {
            "fieldName": "attestationDate",
            "fieldType": "LocalDate"
        }
    ],
    "changelogDate": "20180221120459",
    "dto": "no",
    "service": "serviceClass",
    "entityTableName": "isa_attestation",
    "jpaMetamodelFiltering": false,
    "pagination": "no"
}
