{
  "collectionName": "components_menu_item_menu_items",
  "info": {
    "name": "menuItem",
    "icon": "bars",
    "description": ""
  },
  "options": {},
  "attributes": {
    "name": {
      "type": "string"
    },
    "tags": {
      "collection": "tag"
    },
    "link": {
      "type": "string",
      "unique": false,
      "maxLength": 240
    },
    "position": {
      "type": "component",
      "repeatable": false,
      "component": "menu-item.position"
    }
  }
}
