{
  "routes": [
    {
      "method": "GET",
      "path": "/board-teams",
      "handler": "board-team.find",
      "config": {
        "policies": []
      }
    },
    {
      "method": "GET",
      "path": "/board-teams/count",
      "handler": "board-team.count",
      "config": {
        "policies": []
      }
    },
    {
      "method": "GET",
      "path": "/board-teams/:id",
      "handler": "board-team.findOne",
      "config": {
        "policies": []
      }
    },
    {
      "method": "POST",
      "path": "/board-teams",
      "handler": "board-team.create",
      "config": {
        "policies": []
      }
    },
    {
      "method": "PUT",
      "path": "/board-teams/:id",
      "handler": "board-team.update",
      "config": {
        "policies": []
      }
    },
    {
      "method": "DELETE",
      "path": "/board-teams/:id",
      "handler": "board-team.delete",
      "config": {
        "policies": []
      }
    }
  ]
}
