{
  "kind": "singleType",
  "collectionName": "specialists_pages",
  "info": {
    "name": "SpecialistsPage"
  },
  "options": {
    "increments": true,
    "timestamps": true,
    "draftAndPublish": true
  },
  "attributes": {
    "meta": {
      "type": "component",
      "repeatable": false,
      "component": "page-info.page-info"
    }
  }
}
