{
  "kind": "collectionType",
  "collectionName": "board_teams",
  "info": {
    "name": "BoardTeam",
    "description": ""
  },
  "options": {
    "increments": true,
    "timestamps": true,
    "draftAndPublish": true
  },
  "attributes": {
    "name": {
      "type": "string",
      "required": true
    },
    "description": {
      "type": "richtext",
      "required": true
    },
    "image": {
      "collection": "file",
      "via": "related",
      "allowedTypes": [
        "images",
        "videos"
      ],
      "plugin": "upload",
      "required": false
    },
    "content": {
      "type": "richtext"
    },
    "files": {
      "collection": "file",
      "via": "related",
      "allowedTypes": [
        "files",
        "images",
        "videos"
      ],
      "plugin": "upload",
      "required": false
    },
    "slug": {
      "type": "uid",
      "targetField": "name"
    },
    "isPresident": {
      "type": "boolean",
      "default": false,
      "unique": false
    },
    "isBoard": {
      "type": "boolean"
    },
    "isDoctor": {
      "type": "boolean"
    }
  }
}
