<?xml version="1.0" encoding="UTF-8"?>
<svg width="230px" height="141px" viewBox="0 0 230 141" version="1.1" xmlns="http://www.w3.org/2000/svg" xmlns:xlink="http://www.w3.org/1999/xlink">
    <!-- Generator: Sketch 55.2 (78181) - https://sketchapp.com -->
    <desc>Created with Sketch.</desc>
    <g id="Teacher" stroke="none" stroke-width="1" fill="none" fill-rule="evenodd">
        <g id="Artboard" transform="translate(-1573.000000, -272.000000)">
            <g id="pic_confirm_wrong_way" transform="translate(1573.000000, 272.000000)">
                <g id="Group-16">
                    <path d="M79,141 C122.630495,141 158,139.432997 158,137.5 C158,136.376168 146.044454,135.376049 127.460776,134.735667 C114.080428,134.274588 97.2640065,134 79,134 C35.3695048,134 0,135.567003 0,137.5 C0,139.432997 35.3695048,141 79,141 Z" id="Oval-Copy-4" fill="#F0F7FF" fill-rule="nonzero"></path>
                    <g id="Group-8-Copy-2">
                        <polyline id="Fill-32-Copy" fill="#DFEEFF" points="87.125 130.371 12.447 130.371 12.961 127.84 39.027 4.26325641e-14 60.545 4.26325641e-14 86.611 127.84 87.125 130.371"></polyline>
                        <polygon id="Fill-33-Copy" fill="#B6D8FF" points="50.208 137.966 99.572 137.966 99.572 127.84 50.208 127.84"></polygon>
                        <polyline id="Fill-34-Copy" fill="#B6D8FF" points="86.611 127.84 50.208 127.84 50.208 7.10542736e-14 60.545 7.10542736e-14 86.611 127.84"></polyline>
                        <polyline id="Fill-35-Copy" fill="#FDFDFD" points="72.244 57.38 27.327 57.38 33.867 25.315 65.705 25.315 72.244 57.38"></polyline>
                        <polyline id="Fill-36-Copy" fill="#FDFDFD" points="83.682 113.495 15.889 113.495 22.425 81.429 77.147 81.429 83.682 113.495"></polyline>
                        <polygon id="Fill-37-Copy" fill="#DFEEFF" points="4.26325641e-14 137.966 50.208 137.966 50.208 127.84 4.26325641e-14 127.84"></polygon>
                    </g>
                </g>
                <g id="Group-17" transform="translate(126.000000, 53.000000)">
                    <path d="M57,67.4939155 C82.9573832,67.4939155 104,65.9269121 104,63.9939155 C104,62.8700837 96.887207,61.8699644 85.8310943,61.2295822 C77.8706346,60.7685036 67.8659279,60.4939155 57,60.4939155 C31.0426168,60.4939155 10,62.0609188 10,63.9939155 C10,65.9269121 31.0426168,67.4939155 57,67.4939155 Z" id="Oval-Copy-5" fill="#F0F7FF" fill-rule="nonzero"></path>
                    <g id="Group-16-Copy" transform="translate(51.840596, 44.000000) scale(1, -1) rotate(-73.000000) translate(-51.840596, -44.000000) translate(19.340596, 0.000000)">
                        <polyline id="Fill-32-Copy" fill="#DFEEFF" points="56.7457887 83.3651435 8.74578872 83.3651435 9.07616715 81.7537959 25.8303384 0.36514348 39.6612391 0.36514348 56.4154103 81.7537959 56.7457887 83.3651435"></polyline>
                        <polygon id="Fill-33-Copy" fill="#B6D8FF" points="33 88 65 88 65 82 33 82"></polygon>
                        <polyline id="Fill-34-Copy" fill="#B6D8FF" points="56.2644981 82.6401459 33.2644981 82.6401459 33.2644981 0.640145851 39.7955807 0.640145851 56.2644981 82.6401459"></polyline>
                        <polyline id="Fill-35-Copy" fill="#FDFDFD" points="47.0447966 36.6842475 18.0447966 36.6842475 22.2672514 16.6842475 42.8229875 16.6842475 47.0447966 36.6842475"></polyline>
                        <polyline id="Fill-36-Copy" fill="#FDFDFD" points="54.0897528 72.419356 11.0897528 72.419356 15.2354315 52.419356 49.9447083 52.419356 54.0897528 72.419356"></polyline>
                        <polygon id="Fill-37-Copy" fill="#DFEEFF" points="0.765289804 87.9101624 32.7652898 87.9101624 32.7652898 81.9101624 0.765289804 81.9101624"></polygon>
                    </g>
                </g>
            </g>
        </g>
    </g>
</svg>