<?xml version="1.0" encoding="UTF-8"?>
<svg width="30px" height="30px" viewBox="0 0 30 30" version="1.1" xmlns="http://www.w3.org/2000/svg" xmlns:xlink="http://www.w3.org/1999/xlink">
    <!-- Generator: Sketch 55.2 (78181) - https://sketchapp.com -->
    <title>atom/ic/submitted_not_in_time copy</title>
    <desc>Created with Sketch.</desc>
    <g id="atom/ic/submitted_not_in_time-copy" stroke="none" stroke-width="1" fill="none" fill-rule="evenodd">
        <rect id="Combined-Shape" fill="#AB7DF6" x="0" y="0" width="30" height="30" rx="3"></rect>
        <path d="M15,25 C20.5205811,25 25,20.5205811 25,15 C25,9.47941889 20.5205811,5 15,5 C9.47941889,5 5,9.47941889 5,15 C5,20.5205811 9.47941889,25 15,25 Z" id="Shape" fill="#FFFFFF"></path>
        <path d="M14,10.5918367 C14,10.2653061 14.2729333,10 14.6088512,10 C14.9447692,10 15.2177025,10.2653061 15.2177025,10.5918367 L15.2177025,15.0612245 L17.7580818,16.9183673 C18.0310151,17.122449 18.0730049,17.4897959 17.8840511,17.755102 C17.7580818,17.9183673 17.5901229,18 17.401169,18 C17.2751998,18 17.1492306,17.9591837 17.0442562,17.877551 L14.2519384,15.8367347 C14.1049744,15.7346939 14,15.5510204 14,15.3673469 L14,10.5918367 Z" id="Shape" stroke="#AC79F9" stroke-width="0.5" fill="#AB7DF6"></path>
    </g>
</svg>