<?xml version="1.0" encoding="UTF-8"?>
<svg width="30px" height="30px" viewBox="0 0 30 30" version="1.1" xmlns="http://www.w3.org/2000/svg" xmlns:xlink="http://www.w3.org/1999/xlink">
    <!-- Generator: Sketch 55.2 (78181) - https://sketchapp.com -->
    <title>atom/ic/assessment copy</title>
    <desc>Created with Sketch.</desc>
    <g id="atom/ic/assessment-copy" stroke="none" stroke-width="1" fill="none" fill-rule="evenodd">
        <g id="Group">
            <rect id="Combined-Shape" fill="#0093FF" x="0" y="0" width="30" height="30" rx="3"></rect>
            <polygon id="Path" fill="#FFFFFF" points="15.5700029 15.2556739 11.0191046 11.8175081 5 18.4289023 7.28086684 21 11.4037639 16.4779991 16.1497006 20.0606762 19.9421158 15.1292265 22.3205019 17.7725799 24 8 15.2070145 9.86660491 17.6341603 12.5641501"></polygon>
        </g>
    </g>
</svg>