<?xml version="1.0" encoding="UTF-8"?>
<svg width="16px" height="17px" viewBox="0 0 16 17" version="1.1" xmlns="http://www.w3.org/2000/svg" xmlns:xlink="http://www.w3.org/1999/xlink">
    <!-- Generator: Sketch 51.3 (57544) - http://www.bohemiancoding.com/sketch -->
    <title>ic_resource</title>
    <desc>Created with Sketch.</desc>
    <defs></defs>
    <g id="Teacher-Dashboard" stroke="none" stroke-width="1" fill="none" fill-rule="evenodd">
        <g id="View-Submissions" transform="translate(-32.000000, -372.000000)" fill="#B3C0CE" fill-rule="nonzero">
            <g id="ic_resource" transform="translate(32.000000, 372.000000)">
                <path d="M15.2380952,3.64718615 L0.761904762,3.64718615 C0.340952381,3.64718615 0,3.97360931 0,4.37662338 L0,15.3181818 C0,15.7211959 0.340952381,16.047619 0.761904762,16.047619 L15.2380952,16.047619 C15.6590476,16.047619 16,15.7211959 16,15.3181818 L16,4.37662338 C16,3.97360931 15.6590476,3.64718615 15.2380952,3.64718615 Z M11.4285714,9.11796537 C11.4285714,9.31965476 11.2579048,9.48268398 11.047619,9.48268398 L4.95238095,9.48268398 C4.74209524,9.48268398 4.57142857,9.31965476 4.57142857,9.11796537 L4.57142857,7.65909091 C4.57142857,7.45740152 4.74209524,7.29437229 4.95238095,7.29437229 C5.16266667,7.29437229 5.33333333,7.45740152 5.33333333,7.65909091 L5.33333333,8.75324675 L10.6666667,8.75324675 L10.6666667,7.65909091 C10.6666667,7.45740152 10.8373333,7.29437229 11.047619,7.29437229 C11.2579048,7.29437229 11.4285714,7.45740152 11.4285714,7.65909091 L11.4285714,9.11796537 Z" id="Shape"></path>
                <path d="M14.0952381,1.45887446 L1.9047619,1.45887446 C1.69447619,1.45887446 1.52380952,1.6222684 1.52380952,1.82359307 L1.52380952,2.91774892 L14.4761905,2.91774892 L14.4761905,1.82359307 C14.4761905,1.6222684 14.3055238,1.45887446 14.0952381,1.45887446 Z" id="Shape"></path>
                <path d="M12.5714286,0 L3.42857143,0 C3.21828571,0 3.04761905,0.163393939 3.04761905,0.364718615 L3.04761905,0.729437229 L12.952381,0.729437229 L12.952381,0.364718615 C12.952381,0.163393939 12.7817143,0 12.5714286,0 Z" id="Shape"></path>
            </g>
        </g>
    </g>
</svg>