<?xml version="1.0" encoding="UTF-8"?>
<svg width="16px" height="16px" viewBox="0 0 16 16" version="1.1" xmlns="http://www.w3.org/2000/svg" xmlns:xlink="http://www.w3.org/1999/xlink">
    <!-- Generator: Sketch 54 (76480) - https://sketchapp.com -->
    <desc>Created with Sketch.</desc>
    <defs>
        <circle id="path-1" cx="7.46666667" cy="7.46666667" r="7.46666667"></circle>
    </defs>
    <g id="Symbols" stroke="none" stroke-width="1" fill="none" fill-rule="evenodd">
        <g id="atom/btn/round">
            <g id="buttons/circle/filter-opened" stroke-width="1" fill-rule="evenodd" transform="translate(0.426667, 0.853333)">
                <g id="Colors/Primary">
                    <mask id="mask-2" fill="white">
                        <use xlink:href="#path-1"></use>
                    </mask>
                    <use id="Mask" fill="#B3C0CE" xlink:href="#path-1"></use>
                </g>
            </g>
            <g id="atom/ic/cross" transform="translate(1.706667, 1.706667)" fill="#FFFFFF" fill-rule="nonzero">
                <path d="M5.93147896,6.5 L3.15539337,3.74050082 C2.99264665,3.57872648 2.99264665,3.31643844 3.15539337,3.15466409 C3.31814009,2.99288975 3.58200465,2.99288975 3.74475137,3.15466409 L6.52083695,5.91416327 L9.25524863,3.19608901 C9.41799535,3.03431466 9.68185991,3.03431466 9.84460663,3.19608901 C10.0073533,3.35786335 10.0073533,3.62015139 9.84460663,3.78192574 L7.11019495,6.5 L9.84460663,9.21807426 C10.0073533,9.37984861 10.0073533,9.64213665 9.84460663,9.80391099 C9.68185991,9.96568534 9.41799535,9.96568534 9.25524863,9.80391099 L6.52083695,7.08583673 L3.74475137,9.84533591 C3.58200465,10.0071103 3.31814009,10.0071103 3.15539337,9.84533591 C2.99264665,9.68356156 2.99264665,9.42127352 3.15539337,9.25949918 L5.93147896,6.5 Z" id="Path"></path>
            </g>
        </g>
    </g>
</svg>