<?xml version="1.0" encoding="UTF-8"?>
<svg width="200px" height="200px" viewBox="0 0 200 200" version="1.1" xmlns="http://www.w3.org/2000/svg" xmlns:xlink="http://www.w3.org/1999/xlink">
    <!-- Generator: Sketch 55.2 (78181) - https://sketchapp.com -->
    <desc>Created with Sketch.</desc>
    <defs>
        <circle id="path-1" cx="100" cy="100" r="100"></circle>
    </defs>
    <g id="Teacher" stroke="none" stroke-width="1" fill="none" fill-rule="evenodd">
        <g id="pic_man">
            <mask id="mask-2" fill="white">
                <use xlink:href="#path-1"></use>
            </mask>
            <use id="Mask" fill="#DFEEFF" xlink:href="#path-1"></use>
            <g id="Mesa-de-trabajo-1-Copy-3" mask="url(#mask-2)">
                <g transform="translate(0.000000, 23.000000)" id="Mesa_de_trabajo_1">
                    <g>
                        <g id="Group_122" fill-rule="nonzero">
                            <g id="Group_121">
                                <g id="Group_117">
                                    <g id="Group_74" transform="translate(0.000000, 99.000000)" fill="#FFFFFF">
                                        <g id="Group_73">
                                            <path d="M195.358,56.134 C193.813549,48.2412683 188.935062,41.4003768 181.976,37.369 L138.127,11.969 L127.289,0.61 L100.039,30.029 L72.789,0.61 L61.951,11.971 L61.951,11.971 L18.1,37.369 C11.1417002,41.4008046 6.26398842,48.2416313 4.72,56.134 L0.462,77.9 L199.616,77.9 L195.358,56.134 Z" id="Path_33"></path>
                                        </g>
                                    </g>
                                    <g id="Group_76" transform="translate(87.000000, 133.000000)" fill="#599BEB">
                                        <g id="Group_75">
                                            <polygon id="Path_34" points="25.587 9.584 13.039 0.605 0.491 9.584 9.166 16.49 4.144 43.9 21.934 43.9 16.911 16.491"></polygon>
                                        </g>
                                    </g>
                                    <g id="Group_78" transform="translate(61.000000, 114.000000)" fill="#9AC8FF">
                                        <g id="Group_77">
                                            <path d="M23.347,35.216001 C23.2128984,35.216001 23.0832406,35.1679411 22.982,35.08 C5.139,19.622 1.026,1.606 0.982,1.426 C0.939306735,1.23146888 1.00363766,1.02893812 1.15075993,0.894699117 C1.29788221,0.760460115 1.50544445,0.714906968 1.69525997,0.775199109 C1.88507549,0.83549125 2.02830678,0.992468866 2.071,1.187 C2.109,1.363 6.1,18.777 23.324,33.904 L25.03,32.273 C25.173978,32.1354527 25.3803998,32.0851652 25.5715082,32.1410802 C25.7626167,32.1969952 25.9093778,32.350618 25.9565082,32.5440802 C26.0036386,32.7375425 25.943978,32.9414527 25.8,33.079 L23.727,35.061 C23.6248467,35.159408 23.4888386,35.214885 23.347,35.216001 L23.347,35.216001 Z" id="Path_35"></path>
                                        </g>
                                    </g>
                                    <g id="Group_80" transform="translate(113.000000, 114.000000)" fill="#9AC8FF">
                                        <g id="Group_79">
                                            <path d="M2.731,35.216 C2.58747088,35.216 2.4495165,35.160423 2.346,35.061 L0.273,33.079 C0.0504292458,32.8663704 0.0423703713,32.5135708 0.255,32.291 C0.467629629,32.0684292 0.820429246,32.0603704 1.043,32.273 L2.748,33.904 C19.973,18.777 23.963,1.363 24.002,1.187 C24.0446932,0.992468851 24.1879245,0.835491217 24.37774,0.775199067 C24.5675556,0.714906918 24.7751178,0.760460068 24.9222401,0.894699082 C25.0693624,1.0289381 25.1336933,1.23146887 25.091,1.426 C25.051,1.606 20.939,19.626 3.091,35.08 C2.99106032,35.1668175 2.86337944,35.2150525 2.731,35.216 Z" id="Path_36"></path>
                                        </g>
                                    </g>
                                    <g id="Group_82" transform="translate(72.000000, 78.000000)" fill="#B6D8FF">
                                        <g id="Group_81">
                                            <path d="M55.332,0.894 L55.332,24.831 C55.332,32.2135264 52.3414263,39.2811774 47.042,44.421 L47.042,44.421 C36.4546218,54.6907907 19.6233782,54.6907907 9.036,44.421 L9.036,44.421 C3.73723058,39.2808112 0.747,32.2133099 0.747,24.831 L0.747,0.894 L55.332,0.894 Z" id="Path_37"></path>
                                        </g>
                                    </g>
                                    <g id="Group_84" transform="translate(73.000000, 78.000000)" fill="#599BEB">
                                        <g id="Group_83">
                                            <path d="M53.665,0.894 L0.413,0.894 C5.621,16.794 15.374,30.62 27.039,30.62 C38.704,30.62 48.457,16.791 53.665,0.894 Z" id="Path_38"></path>
                                        </g>
                                    </g>
                                    <g id="Group_88" transform="translate(57.000000, 60.000000)">
                                        <g id="Group_87">
                                            <path d="M12.941,1.987 C12.941,1.987 6.067,-1.729 2.908,1.244 C-0.251,4.217 -0.25,12.577 4.766,18.337 C9.782,24.097 18.143,18.337 18.143,18.337 L12.941,1.987 Z" id="Path_40" fill="#B6D8FF"></path>
                                            <g id="Group-52" transform="translate(77.000000, 10.591155) scale(-1, 1) translate(-77.000000, -10.591155) translate(68.000000, 0.091155)">
                                                <path d="M12.5635461,1.89584548 C12.5635461,1.89584548 5.68954613,-1.82015452 2.53054613,1.15284548 C-0.628453872,4.12584548 -0.627453872,12.4858455 4.38854613,18.2458455 C9.40454613,24.0058455 17.7655461,18.2458455 17.7655461,18.2458455 L12.5635461,1.89584548 Z" id="Path_40-Copy" fill="#B6D8FF"></path>
                                                <path d="M4.79754613,9.31484548 C4.55854141,9.31462693 4.34621603,9.16221913 4.26954613,8.93584548 C3.66579583,7.41308612 4.0984272,5.67492123 5.34554613,4.61284548 C6.66663241,3.59295997 8.48599818,3.51291749 9.89154613,4.41284548 C11.2060154,5.28945659 12.2858004,6.47464501 13.0365461,7.86484548 C13.195328,8.12856145 13.1102621,8.47106362 12.8465461,8.62984548 C12.5828302,8.78862735 12.240328,8.70356145 12.0815461,8.43984548 C11.4223683,7.20964432 10.4758782,6.15680703 9.32254613,5.37084548 C8.31707463,4.71353979 7.00752815,4.75672483 6.04754613,5.47884548 C5.16005061,6.24624789 4.86844765,7.4982828 5.32554613,8.57884548 C5.38273026,8.74907818 5.3546478,8.93641873 5.25006268,9.08240212 C5.14547757,9.22838551 4.9771257,9.31523454 4.79754613,9.31584548 L4.79754613,9.31484548 Z" id="Path_41-Copy" fill="#599BEB"></path>
                                                <path d="M11.6315461,15.6508457 C11.5656294,15.6508457 11.5002451,15.6390457 11.4385461,15.6158455 C11.2999404,15.5645656 11.1873958,15.4603039 11.1256902,15.3260146 C11.0639847,15.1917253 11.0581771,15.0384183 11.1095461,14.8998455 C11.1395461,14.8168455 10.9825461,14.5848455 10.7295461,14.4568455 C10.5915642,14.3904099 10.4500149,14.3316535 10.3055461,14.2808455 C9.95348603,14.1690637 9.62404827,13.995711 9.33254613,13.7688455 C8.69184516,13.1533086 8.43336396,12.2398299 8.65654613,11.3798455 C8.75468025,10.9343293 8.89463387,10.4990668 9.07454613,10.0798455 C9.16154613,9.85684548 9.24954613,9.63384548 9.32254613,9.40584548 C9.87393622,7.93146096 9.64856854,6.27876466 8.72254613,5.00584548 C8.54559873,4.76436082 8.5907473,4.42626913 8.8248598,4.23967717 C9.05897231,4.05308521 9.39861641,4.08449008 9.59454613,4.31084548 C10.742787,5.8796755 11.0400926,7.91513262 10.3885461,9.74684548 C10.3085461,9.99784548 10.2115461,10.2468455 10.1155461,10.4888455 C9.96259861,10.8439935 9.84178218,11.2121322 9.75454613,11.5888455 C9.62813697,12.0538716 9.74051173,12.5513172 10.0545461,12.9168455 C10.2504318,13.0566542 10.4675409,13.164027 10.6975461,13.2348455 C10.8798708,13.2995968 11.0584766,13.3743775 11.2325461,13.4588455 C11.9558868,13.7473305 12.3511748,14.5293321 12.1545461,15.2828455 C12.0747654,15.503151 11.8658515,15.6501497 11.6315461,15.6508457 Z" id="Path_42-Copy" fill="#599BEB"></path>
                                            </g>
                                        </g>
                                    </g>
                                    <g id="Group_90" transform="translate(61.000000, 63.000000)" fill="#599BEB">
                                        <g id="Group_89">
                                            <path d="M1.175,6.406 C0.93599528,6.40578145 0.723669905,6.25337365 0.647,6.027 C0.0432496992,4.50424064 0.475881072,2.76607574 1.723,1.704 C3.04408629,0.684114491 4.86345206,0.604072003 6.269,1.504 C7.5834693,2.38061111 8.66325423,3.56579952 9.414,4.956 C9.57278187,5.21971597 9.48771597,5.56221813 9.224,5.721 C8.96028403,5.87978187 8.61778187,5.79471597 8.459,5.531 C7.79982213,4.30079884 6.85333205,3.24796155 5.7,2.462 C4.6945285,1.8046943 3.38498202,1.84787935 2.425,2.57 C1.53750449,3.33740241 1.24590152,4.58943731 1.703,5.67 C1.76018413,5.8402327 1.73210167,6.02757325 1.62751656,6.17355664 C1.52293144,6.31954002 1.35457957,6.40638906 1.175,6.407 L1.175,6.406 Z" id="Path_41"></path>
                                        </g>
                                    </g>
                                    <g id="Group_92" transform="translate(65.000000, 64.000000)" fill="#599BEB">
                                        <g id="Group_91">
                                            <path d="M4.009,11.7420002 C3.94308332,11.7420002 3.87769898,11.7302002 3.816,11.707 C3.67739423,11.6557201 3.56484967,11.5514584 3.50314411,11.4171691 C3.44143856,11.2828798 3.43563099,11.1295728 3.487,10.991 C3.517,10.908 3.36,10.676 3.107,10.548 C2.96901812,10.4815644 2.82746879,10.4228081 2.683,10.372 C2.3309399,10.2602182 2.00150215,10.0868656 1.71,9.86 C1.06929904,9.24446308 0.810817832,8.33098438 1.034,7.471 C1.13213412,7.02548383 1.27208774,6.59022136 1.452,6.171 C1.539,5.948 1.627,5.725 1.7,5.497 C2.25139009,4.02261548 2.02602241,2.36991918 1.1,1.097 C0.923052601,0.855515336 0.96820117,0.517423651 1.20231367,0.330831689 C1.43642618,0.144239727 1.77607028,0.175644595 1.972,0.402 C3.12024089,1.97083002 3.41754644,4.00628714 2.766,5.838 C2.686,6.089 2.589,6.338 2.493,6.58 C2.34005248,6.93514799 2.21923605,7.3032867 2.132,7.68 C2.00559084,8.14502609 2.11796561,8.6424717 2.432,9.008 C2.62788564,9.14780868 2.84499481,9.25518149 3.075,9.326 C3.25732469,9.39075129 3.43593051,9.46553204 3.61,9.55 C4.33334063,9.83848504 4.7286287,10.6204866 4.532,11.374 C4.45221929,11.5943055 4.24330534,11.7413042 4.009,11.7420002 Z" id="Path_42"></path>
                                        </g>
                                    </g>
                                    <g id="Group_94" transform="translate(67.000000, 13.000000)" fill="#DFEEFF">
                                        <g id="Group_93">
                                            <path d="M33.039,0.867 C71.869,0.867 66.296,38.767 63.139,55.861 C59.982,72.955 48.09,91.719 33.039,91.719 C17.988,91.719 6.099,72.954 2.939,55.861 C-0.221,38.768 -5.791,0.867 33.039,0.867 Z" id="Path_43"></path>
                                        </g>
                                    </g>
                                    <g id="Group_96" transform="translate(63.000000, 4.000000)" fill="#599BEB">
                                        <g id="Group_95">
                                            <path d="M37.039,0.856 C-9.03,0.856 -1.049,44.703 6.239,60.438 C6.239,60.438 9.88,51.852 7.394,42.748 L12.983,43.588 C12.983,43.588 12.163,36.172 12.147,36.029 C12.101,35.613 15.8,32.613 16.17,32.197 C19.238565,28.8103762 21.5686452,24.8221318 23.012,20.486 C23.9,26.286 24.952,32.071 24.56,37.998 C28.5186204,35.3225516 30.9832869,30.936557 31.21,26.164 C30.3962928,33.7093004 35.1389137,40.7427731 42.439,42.817 C40.9331984,39.2031935 40.0048664,35.3751317 39.688,31.473 C46.095355,36.2349876 53.7692164,38.9932491 61.742,39.4 C61.242,39.376 61.082,43.773 61.104,44.323 C63.089,43.823 65.139,43.273 67.146,42.748 C65.709,48.391 67.432,60.726 67.846,61.305 C73.09,43.774 83.865,0.856 37.039,0.856 Z" id="Path_44"></path>
                                        </g>
                                    </g>
                                    <g id="Group_98" transform="translate(75.000000, 68.000000)" fill="#B6D8FF">
                                        <g id="Group_97">
                                            <circle id="Ellipse_3" cx="8.364" cy="8.124" r="7.385"></circle>
                                        </g>
                                    </g>
                                    <g id="Group_100" transform="translate(109.000000, 68.000000)" fill="#B6D8FF">
                                        <g id="Group_99">
                                            <circle id="Ellipse_4" cx="7.714" cy="8.124" r="7.385"></circle>
                                        </g>
                                    </g>
                                    <g id="Group_102" transform="translate(91.000000, 84.000000)" fill="#FFFFFF">
                                        <g id="Group_101">
                                            <path d="M0.765,0.84 C2.8127877,3.29308727 5.84352325,4.71103192 9.039,4.71103192 C12.2344767,4.71103192 15.2652123,3.29308727 17.313,0.84 L0.765,0.84 Z" id="Path_45"></path>
                                        </g>
                                    </g>
                                    <g id="Group_104" transform="translate(84.000000, 57.000000)" fill="#599BEB">
                                        <g id="Group_103">
                                            <path d="M5.828,3.6480009 C5.68010123,3.64826553 5.53816906,3.58969901 5.43349492,3.48521245 C5.32882077,3.3807259 5.26999976,3.23889901 5.27,3.091 C5.27,2.11621742 4.47978258,1.326 3.505,1.326 C2.53021742,1.326 1.74,2.11621742 1.74,3.091 C1.74,3.39862261 1.49062261,3.6480009 1.183,3.6480009 C0.875377394,3.6480009 0.626,3.39862261 0.626,3.091 C0.65524766,1.52161025 1.93583774,0.264663302 3.5055,0.264663302 C5.07516226,0.264663302 6.35575234,1.52161025 6.385,3.091 C6.385,3.23872558 6.32631624,3.38040071 6.22185848,3.48485848 C6.11740071,3.58931624 5.97572558,3.6480009 5.828,3.6480009 Z" id="Path_46"></path>
                                        </g>
                                    </g>
                                    <g id="Group_106" transform="translate(109.000000, 57.000000)" fill="#599BEB">
                                        <g id="Group_105">
                                            <path d="M5.9,3.6480009 C5.59237739,3.6480009 5.343,3.39862261 5.343,3.091 C5.343,2.11594127 4.55255873,1.3255 3.5775,1.3255 C2.60244127,1.3255 1.812,2.11594127 1.812,3.091 C1.812,3.39862261 1.56262261,3.6480009 1.255,3.6480009 C0.947377394,3.6480009 0.698,3.39862261 0.698,3.091 C0.698,1.50042002 1.98742002,0.211000243 3.578,0.211000243 C5.16857998,0.211000243 6.458,1.50042002 6.458,3.091 C6.458,3.23889901 6.39917923,3.3807259 6.29450508,3.48521245 C6.18983094,3.58969901 6.04789877,3.64826553 5.9,3.6480009 Z" id="Path_47"></path>
                                        </g>
                                    </g>
                                    <g id="Group_108" transform="translate(75.000000, 46.000000)" fill="#599BEB">
                                        <g id="Group_107">
                                            <path d="M0.568,7.62 L18.125,4.09 C18.125,4.09 11.8,-5.409 0.568,7.62 Z" id="Path_48"></path>
                                        </g>
                                    </g>
                                    <g id="Group_110" transform="translate(106.000000, 46.000000)" fill="#599BEB">
                                        <g id="Group_109">
                                            <path d="M18.51,7.62 L0.953,4.09 C0.953,4.09 7.279,-5.409 18.51,7.62 Z" id="Path_49"></path>
                                        </g>
                                    </g>
                                    <g id="Group_112" transform="translate(93.000000, 50.000000)" fill="#B6D8FF">
                                        <g id="Group_111">
                                            <path d="M8.392,25.742 L6.227,25.742 C5.46463974,25.742 4.73562564,25.429374 4.20965239,24.8775177 C3.68367914,24.3256614 3.40663199,23.5824923 3.443,22.821 L4.343,4.121 L0.927,1.364 C0.772125346,1.23895705 0.695724888,1.04078795 0.726577944,0.844141093 C0.757431001,0.647494235 0.890850256,0.482244957 1.07657796,0.41064107 C1.26230567,0.339037183 1.47212537,0.371957021 1.627,0.497 L5.263,3.431 C5.40188097,3.54262179 5.47885283,3.71404221 5.47,3.892 L4.56,22.873 C4.53840165,23.3298827 4.70480549,23.7756864 5.02048939,24.1066728 C5.33617329,24.4376591 5.77360707,24.6249634 6.231,24.625 L8.396,24.625 C8.69472124,24.6376544 8.93038327,24.8835108 8.93038327,25.1825 C8.93038327,25.4814892 8.69472124,25.7273456 8.396,25.74 L8.392,25.742 Z" id="Path_50"></path>
                                        </g>
                                    </g>
                                    <g id="Group_114" transform="translate(57.000000, 0.000000)" fill="#599BEB">
                                        <g id="Group_113">
                                            <path d="M12.235,64.438 C12.235,64.438 2.218,46.845 0.735,28.266 C-0.748,9.687 14.435,13.866 14.435,13.866 C14.435,13.866 26.365,-2.762 54.38,1.325 C75.45,4.399 80.02,22.757 79.648,33.965 L84.107,33.095 L81.134,38.483 L86.708,37.926 C86.708,37.926 83.178,45.349 77.79,46.933 L81.32,47.216 L73.844,65.304 L75.378,42.199 L56.795,16.747 L18.568,20.834 L9.532,44.058 L12.235,64.438 Z" id="Path_51"></path>
                                        </g>
                                    </g>
                                    <g id="Group_116" transform="translate(55.000000, 40.000000)" fill="#599BEB">
                                        <g id="Group_115">
                                            <path d="M6.951,0.528 L0.828,0.528 L4.728,4.244 L0.828,5.359 C3.09628535,7.41917032 5.53500313,9.28350148 8.118,10.932 L5.287,10.932 L14.235,24.438 L6.951,0.528 Z" id="Path_52"></path>
                                        </g>
                                    </g>
                                </g>
                            </g>
                        </g>
                    </g>
                </g>
            </g>
        </g>
    </g>
</svg>