<?xml version="1.0" encoding="UTF-8"?>
<svg width="27px" height="21px" viewBox="0 0 27 21" version="1.1" xmlns="http://www.w3.org/2000/svg" xmlns:xlink="http://www.w3.org/1999/xlink">
    <!-- Generator: Sketch 51.3 (57544) - http://www.bohemiancoding.com/sketch -->
    <desc>Created with Sketch.</desc>
    <defs></defs>
    <g id="Symbols" stroke="none" stroke-width="1" fill="none" fill-rule="evenodd">
        <g id="menu-bar" transform="translate(-1786.000000, -19.000000)">
            <g id="Group-5">
                <g id="Top-Bar-/-#11">
                    <g id="ic_message_norif" transform="translate(1786.000000, 19.000000)">
                        <g id="Notifications-/-Red-Small" transform="translate(21.000000, 0.000000)" fill="#FF151F">
                            <circle id="Oval-204" cx="3" cy="3" r="3"></circle>
                        </g>
                        <g id="Icons-White-/-Mail" transform="translate(0.000000, 5.000000)" fill="#FFFFFF">
                            <path d="M18,0 L2,0 C0.9,0 0.01,0.9 0.01,2 L0,14 C0,15.1 0.9,16 2,16 L18,16 C19.1,16 20,15.1 20,14 L20,2 C20,0.9 19.1,0 18,0 L18,0 Z M18,4 L10,9 L2,4 L2,2 L10,7 L18,2 L18,4 L18,4 Z" id="Shape"></path>
                        </g>
                    </g>
                </g>
            </g>
        </g>
    </g>
</svg>