<?xml version="1.0" encoding="utf-8"?>
<!-- Generator: Adobe Illustrator 21.0.0, SVG Export Plug-In . SVG Version: 6.00 Build 0)  -->
<svg version="1.1" id="katman_1" xmlns="http://www.w3.org/2000/svg" xmlns:xlink="http://www.w3.org/1999/xlink" x="0px" y="0px"
	 viewBox="0 0 23.5 24" style="enable-background:new 0 0 23.5 24;" xml:space="preserve">
<style type="text/css">
	.st0{opacity:0.7;fill:#414042;enable-background:new    ;}
	.st1{fill:url(#SVGID_1_);}
	.st2{fill:url(#SVGID_2_);}
	.st3{opacity:0.2;fill:#231F20;enable-background:new    ;}
	.st4{fill:url(#SVGID_3_);}
	.st5{fill:url(#SVGID_4_);}
	.st6{opacity:0.1;fill:#FFFFFF;enable-background:new    ;}
	.st7{opacity:0.2;fill:#010101;enable-background:new    ;}
</style>
<title>konsole_3</title>
<path class="st0" d="M1,23.5c-0.6,0-1-0.4-1-1V1c0-0.6,0.4-1,1-1h21.5c0.6,0,1,0.4,1,1v21.5c0,0.6-0.4,1-1,1L1,23.5z M21.8,21.8v-20
	h-20v20H21.8z"/>
<linearGradient id="SVGID_1_" gradientUnits="userSpaceOnUse" x1="11.76" y1="2.17" x2="11.76" y2="23.21" gradientTransform="matrix(1 0 0 -1 0 23.73)">
	<stop  offset="0" style="stop-color:#1A1A1A"/>
	<stop  offset="1" style="stop-color:#404745"/>
</linearGradient>
<rect x="1.5" y="1.5" class="st1" width="20.5" height="20.5"/>
<linearGradient id="SVGID_2_" gradientUnits="userSpaceOnUse" x1="11.76" y1="0.96" x2="11.76" y2="24.59" gradientTransform="matrix(1 0 0 -1 0 23.73)">
	<stop  offset="0" style="stop-color:#A3A3A3"/>
	<stop  offset="0.13" style="stop-color:#BCBBBB"/>
	<stop  offset="0.27" style="stop-color:#D0CECE"/>
	<stop  offset="0.43" style="stop-color:#DEDCDB"/>
	<stop  offset="0.64" style="stop-color:#E6E4E3"/>
	<stop  offset="1" style="stop-color:#E8E6E5"/>
</linearGradient>
<path class="st2" d="M22.5,0.3H1c-0.4,0-0.7,0.3-0.8,0.7c0,0,0,0,0,0.1v21.5c0,0.4,0.3,0.7,0.7,0.7h21.6c0.4,0,0.7-0.3,0.7-0.7V1
	C23.3,0.6,23,0.3,22.5,0.3C22.6,0.3,22.6,0.2,22.5,0.3z M21.8,21.8h-20v-20h20V21.8z"/>
<path class="st3" d="M11.8,17.4c-0.7,0-1.3-0.6-1.3-1.3c0-0.7,0.6-1.3,1.3-1.3H19c0.7,0,1.3,0.6,1.3,1.3c0,0.7-0.6,1.3-1.3,1.3
	c0,0,0,0,0,0H11.8z"/>
<linearGradient id="SVGID_3_" gradientUnits="userSpaceOnUse" x1="15.38" y1="20.12" x2="15.38" y2="4.36" gradientTransform="matrix(1 0 0 -1 0 23.73)">
	<stop  offset="0" style="stop-color:#E8E6E5"/>
	<stop  offset="0.48" style="stop-color:#E6E4E3"/>
	<stop  offset="0.66" style="stop-color:#DFDEDD"/>
	<stop  offset="0.78" style="stop-color:#D4D2D1"/>
	<stop  offset="0.88" style="stop-color:#C3C2C1"/>
	<stop  offset="0.97" style="stop-color:#ADADAD"/>
	<stop  offset="1" style="stop-color:#A3A3A3"/>
</linearGradient>
<path class="st4" d="M19,15h-7.2c-0.6,0-1,0.5-1,1c0,0.6,0.5,1,1,1H19c0.6,0,1-0.5,1-1C20,15.5,19.6,15,19,15z"/>
<path class="st3" d="M4.5,17.4c-0.7,0-1.3-0.6-1.3-1.3c0-0.3,0.1-0.7,0.4-0.9l4.2-4.2L3.5,6.7C3,6.2,3,5.3,3.6,4.8s1.3-0.5,1.8,0
	l5.1,5.2c0.5,0.5,0.5,1.3,0,1.9L5.4,17C5.1,17.2,4.8,17.4,4.5,17.4z"/>
<linearGradient id="SVGID_4_" gradientUnits="userSpaceOnUse" x1="7.0412" y1="20.12" x2="7.0412" y2="4.36" gradientTransform="matrix(1 0 0 -1 0 23.73)">
	<stop  offset="0" style="stop-color:#E8E6E5"/>
	<stop  offset="0.48" style="stop-color:#E6E4E3"/>
	<stop  offset="0.66" style="stop-color:#DFDEDD"/>
	<stop  offset="0.78" style="stop-color:#D4D2D1"/>
	<stop  offset="0.88" style="stop-color:#C3C2C1"/>
	<stop  offset="0.97" style="stop-color:#ADADAD"/>
	<stop  offset="1" style="stop-color:#A3A3A3"/>
</linearGradient>
<path class="st5" d="M10.7,10.9c0-0.3-0.1-0.5-0.3-0.7L5.2,5C4.8,4.6,4.1,4.6,3.7,5s-0.4,1.1,0,1.5l4.4,4.4l-4.4,4.4
	c-0.4,0.4-0.4,1.1,0,1.5c0.4,0.4,1.1,0.4,1.5,0l5.2-5.1C10.6,11.5,10.7,11.2,10.7,10.9z"/>
<rect x="1.7" y="21.8" class="st6" width="20" height="0.7"/>
<path class="st6" d="M22.5,0.3H1c-0.4,0-0.7,0.3-0.8,0.7c0,0,0,0,0,0.1v0.7C0.2,1.3,0.6,1,1,1c0,0,0,0,0,0h21.5
	c0.4,0,0.7,0.3,0.7,0.7V1C23.3,0.6,23,0.3,22.5,0.3C22.6,0.3,22.6,0.2,22.5,0.3z"/>
<rect x="1.7" y="1.7" class="st7" width="20" height="0.7"/>
<path class="st7" d="M22.5,23.3H1c-0.4,0-0.7-0.3-0.7-0.7v0.7C0.3,23.7,0.6,24,1,24h21.5c0.4,0,0.7-0.3,0.7-0.7v-0.7
	C23.3,22.9,22.9,23.3,22.5,23.3z"/>
<path class="st6" d="M11.8,15.8H19c0.4,0,0.9,0.2,1,0.7c0.2-0.5,0-1.1-0.5-1.3C19.4,15,19.2,15,19,15h-7.2c-0.6,0-1,0.4-1.1,0.9
	c0,0.2,0,0.3,0.1,0.5C10.9,16,11.3,15.7,11.8,15.8z"/>
<path class="st7" d="M19,17.1h-7.2c-0.4,0-0.9-0.2-1-0.7c-0.2,0.5,0,1.1,0.5,1.3c0.2,0.1,0.3,0.1,0.5,0.1H19c0.6,0,1-0.4,1.1-0.9
	c0-0.2,0-0.3-0.1-0.5C19.9,16.9,19.4,17.1,19,17.1z"/>
<path class="st6" d="M8.2,11.6l-0.4-0.4l-4.1,4.1c-0.3,0.3-0.4,0.7-0.2,1.1c0.1-0.1,0.1-0.3,0.2-0.4L8.2,11.6z"/>
<path class="st6" d="M5.2,5.7l5.2,5.1c0.1,0.1,0.2,0.2,0.2,0.4c0-0.1,0.1-0.2,0.1-0.4c0-0.3-0.1-0.5-0.3-0.7L5.2,5
	C4.9,4.5,4.3,4.4,3.8,4.7S3.2,5.6,3.5,6.1c0.2-0.5,0.7-0.8,1.3-0.7C4.9,5.5,5.1,5.6,5.2,5.7z"/>
<path class="st7" d="M3.7,6.5C3.6,6.4,3.5,6.2,3.5,6.1C3.3,6.5,3.4,6.9,3.7,7.2l4.1,4.1l0.4-0.4L3.7,6.5z"/>
<path class="st7" d="M10.4,11.7l-5.2,5.2c-0.4,0.4-1,0.5-1.4,0.1c-0.1-0.1-0.2-0.3-0.3-0.5c-0.3,0.5-0.2,1.1,0.3,1.4
	s1.1,0.2,1.4-0.3l5.2-5.1c0.3-0.3,0.4-0.7,0.2-1.1C10.5,11.4,10.5,11.5,10.4,11.7z"/>
</svg>
