<?xml version="1.0" encoding="utf-8"?>
<!-- Generator: Adobe Illustrator 21.0.0, SVG Export Plug-In . SVG Version: 6.00 Build 0)  -->
<svg version="1.1" id="katman_1" xmlns="http://www.w3.org/2000/svg" xmlns:xlink="http://www.w3.org/1999/xlink" x="0px" y="0px"
	 viewBox="0 0 22 19.5" style="enable-background:new 0 0 22 19.5;" xml:space="preserve">
<style type="text/css">
	.st0{fill:#2D3033;}
</style>
<title>edit-delete_4</title>
<path class="st0" d="M0,13.3c0,0.1,0,0.1,0,0.2c0,0.1,0.1,0.1,0.1,0.1c0.1,0,0.1,0,0.2,0h0.1V13L0,13.3L0,13.3z"/>
<path class="st0" d="M0.7,12.6l-0.1-0.1c-0.1,0.1-0.2,0.2-0.2,0.4c0,0.1,0,0.1,0.1,0.2l0,0l0,0l0.2,0.1l0.2-0.4L0.7,12.6L0.7,12.6z"
	/>
<path class="st0" d="M1.2,12.3c0-0.1-0.1-0.2-0.2-0.1H1H0.9v0.1l0,0c0,0.1,0,0.1,0,0.2c0,0,0,0.1,0.1,0.1h0.1
	C1.2,12.5,1.2,12.4,1.2,12.3z"/>
<path class="st0" d="M3.1,10.7c0.1,0,0.2-0.1,0.3-0.2c0.1,0,0.1-0.1,0.2-0.1l0,0l0,0c0.2-0.2,0.5-0.3,0.6-0.6L4.3,10l0.1-0.1V10l0,0
	l-0.2,0.1l0.3,0.3L5,9.8H4.8l0,0c0.2-0.2,0.3-0.3,0.5-0.4C5.5,9.2,5.8,9,6,8.7L5.9,8.5C5.8,8.5,5.7,8.6,5.5,8.7L5.4,8.8
	c0.2-0.2,0.5-0.4,0.8-0.6c0.2-0.1,0.4-0.3,0.6-0.4C6.8,7.7,6.9,7.6,7,7.6l0.1,0.2c0.1-0.1,0.1-0.2,0.1-0.3l0,0v0.1h0.2
	c0-0.1,0.1-0.1,0.2-0.2h0.1v0.1c0.1,0,0.2-0.1,0.2-0.2l0.2,0c0-0.1,0.1-0.1,0.1-0.1h0.1h0.1h0.1V7c0,0,0,0,0,0l0,0l0,0
	c0,0,0.1,0,0.1,0l0.1,0.1V7l0.1-0.1c0-0.1,0.1-0.1,0.2-0.1l0,0l0,0c0,0,0.1-0.1,0.1-0.2c0,0,0,0.1,0,0.1L8.8,7
	C8.8,7.1,8.7,7.2,8.6,7.2l0.1,0.2L9,7.2h0.1l0,0v0.1c0.4-0.2,0.9-0.5,1.2-0.9l0,0V6.3l0,0h0.1V6.3c0.1-0.1,0.2-0.2,0.3-0.3
	c0,0,0-0.1,0-0.1c0.1,0,0.2-0.1,0.3-0.1c0.1,0,0.2-0.1,0.3-0.1h0.2l0.1,0.2l0.3-0.3h0.1L12,5.5c0,0,0.1-0.1,0.1-0.1l0,0l0,0l0,0
	l0.2,0.1c0.1-0.2,0.2-0.4,0.4-0.6l0.3-0.2v0.3l0.1-0.3c0.1-0.1,0.2-0.2,0.3-0.2c0.1-0.1,0.2-0.2,0.3-0.3l0,0L14,3.9l0,0V4h0.1l0,0
	c0.2-0.2,0.4-0.3,0.7-0.4h0.1V3.4c0,0,0-0.2,0.5-0.5c0.9-0.4,1.8-1,2.7-1.5l1-0.6c0.1-0.1,0.3-0.2,0.4-0.3c0.1-0.1,0.2-0.2,0.3-0.2
	l-0.1-0.2c-0.1,0-0.2,0.1-0.3,0.1c-0.1,0-0.1,0.1-0.2,0.1l0,0c-0.1,0-0.2,0-0.2-0.1c-0.1,0-0.1-0.1-0.2-0.1l-0.1,0.2h-0.1
	c0,0-0.1,0-0.1,0L18.4,0l-0.1,0.3c0,0,0,0.1-0.1,0.1H18h-0.1v0.2c-0.1,0-0.2,0-0.3-0.1l-0.1,0.1l-0.2,0.1c-0.1,0-0.1,0.1-0.2,0.1
	L17,0.6v0.1v0.1l-0.1-0.2l-0.1,0.1l-0.1,0.1V0.5l-0.1,0.1c-0.4,0.2-0.4,0.3-0.4,0.6c0,0.1,0,0.2-0.1,0.2V1.2l-0.2,0.3h-0.2v0.1
	c0,0.2-0.3,0.3-0.5,0.4c-0.2,0.1-0.4,0.2-0.6,0.4c-0.1,0-0.1,0-0.2,0c-0.2,0-0.3,0.1-0.4,0.2l-0.1,0.1v0.1l-0.3,0.1
	c-0.2,0.1-0.4,0.1-0.6,0.1c-0.1,0-0.1,0-0.2,0h-0.1v0.1c-0.1,0.1-0.1,0.2-0.1,0.3l0,0c0,0-0.1,0.1-0.2,0.1H12l0,0
	c-0.1,0.1-0.1,0.1-0.1,0.2c-0.1,0-0.1,0.1-0.1,0.2c0,0.1-0.1,0.1-0.2,0.2l-0.1-0.1C11.3,4,11,4.2,10.7,4.3c-0.2,0.1-0.3,0.2-0.5,0.3
	S9.7,4.9,9.4,5.1S8.6,5.5,8.3,5.6H8.2l0,0C8,5.7,7.9,5.8,7.8,5.9C7.7,6,7.6,6,7.4,6.1v0.1L7.3,6.3L7.1,6.5L7,6.4l0,0
	C6.9,6.5,6.9,6.6,6.9,6.7l0,0C6.7,6.7,6.5,6.9,6.4,7l0.1-0.2L6.2,7C6.1,7.1,6.1,7.2,6,7.3c0,0.1-0.1,0.2-0.2,0.2V7.4L5.8,7.5
	C5.4,7.9,5,8.3,4.6,8.6c-0.3,0.3-0.7,0.6-1,0.9v0.1h0c-0.8,0.6-1.5,1.3-2,2.2l0.1,0.2c0.2-0.1,0.3-0.3,0.5-0.4
	C2.6,11.3,2.9,11,3.1,10.7z M11.7,5.4L11.7,5.4z M11.4,5.5L11.4,5.5L11.4,5.5L11.4,5.5L11.4,5.5L11.4,5.5z M4.6,9.4L4.6,9.4
	c0,0.1-0.1,0.2-0.1,0.2V9.6L4.6,9.4z"/>
<polygon class="st0" points="7.9,7.3 7.4,7.8 7.5,8 8,7.5 8,7.3 "/>
<path class="st0" d="M14.3,4.6L14.3,4.6L14.3,4.6L14.3,4.6l0.1-0.2h-0.1h-0.1l0,0l0,0c-0.1,0-0.1,0.1-0.1,0.2c0,0.1,0,0.1,0.1,0.2
	l0,0l0.2,0.1L14.3,4.6z"/>
<path class="st0" d="M14.6,4.2c0.1,0,0.2-0.1,0.2-0.2v0L15,3.6l-0.3,0.2c-0.1,0-0.2,0.1-0.2,0.2l-0.1,0.2L14.6,4.2L14.6,4.2z"/>
<path class="st0" d="M1.2,16.6c0,0.1,0,0.1,0,0.2c0,0.1,0.1,0.1,0.1,0.1c0.1,0,0.1,0,0.2,0h0.1l0.1-0.6L1.2,16.6L1.2,16.6z"/>
<path class="st0" d="M1.9,15.9l-0.1-0.1c-0.1,0.1-0.2,0.2-0.2,0.4c0,0.1,0,0.2,0.1,0.2l0,0l0,0l0.2,0.1L2.1,16L1.9,15.9L1.9,15.9z"
	/>
<path class="st0" d="M2.3,15.4L2.3,15.4H2.2v0.1l0,0c0,0.1,0,0.1,0,0.2c0,0,0,0.1,0.1,0.1h0.1c0.1-0.1,0.2-0.2,0.1-0.3
	C2.5,15.4,2.4,15.4,2.3,15.4z"/>
<path class="st0" d="M5,13.5L5,13.5c0.2-0.2,0.5-0.4,0.7-0.6L5.7,13l0.1-0.1V13l0,0l-0.2,0.1L6,13.4L6.3,13l0.2-0.2H6.2
	c0.2-0.2,0.3-0.3,0.5-0.5c0.3-0.2,0.5-0.4,0.7-0.7l-0.1-0.2c-0.1,0.1-0.2,0.2-0.4,0.3l-0.2,0.1c0.3-0.3,0.5-0.5,0.8-0.7
	c0.2-0.1,0.4-0.3,0.6-0.4c0.1-0.1,0.2-0.1,0.3-0.2l0.1,0.1c0.1-0.1,0.1-0.2,0.1-0.4l0,0v0.1h0.2c0-0.1,0.1-0.1,0.2-0.2h0.1v0.1
	c0.1,0,0.2-0.1,0.3-0.3l0.1,0.1c0-0.1,0.1-0.1,0.1-0.1h0.1h0.1H10V9.8c0,0,0-0.1,0-0.1l0,0l0,0c0,0,0,0,0.1,0.1l0.1,0.1V9.7l0.1-0.1
	c0.1-0.1,0.1-0.1,0.2-0.1l0,0l0,0c0,0,0.1-0.1,0.1-0.1c0,0,0,0.1,0,0.1c-0.1,0.1-0.2,0.2-0.3,0.3c-0.1,0.1-0.1,0.1-0.2,0.2l0.1,0.2
	l0.4-0.3h0.1l0,0l0.1,0.1c0.4-0.2,0.8-0.5,1.1-0.8l0.2-0.1V9h0.1l0,0l0,0c0.1-0.1,0.1-0.2,0.1-0.4c0,0,0-0.1,0-0.1l0.3-0.1
	c0.1,0,0.2-0.1,0.3-0.1H13l0.1,0.2l0.3-0.3h0.1l0.1-0.1c0,0,0.1-0.1,0.1-0.1l0,0c0,0,0,0,0-0.1l0.2,0.1c0.1-0.2,0.3-0.3,0.5-0.4
	l0.3-0.2v0.3l0.1-0.3c0.1-0.1,0.2-0.2,0.3-0.2c0.1-0.1,0.2-0.1,0.3-0.2l0,0l0.3-0.4l0,0v0.1H16l0,0c0.2-0.2,0.5-0.3,0.7-0.4h0.1V6.3
	c0,0,0-0.2,0.5-0.4c1.2-0.5,2.3-1.1,3.5-1.7l0.5-0.3c0.2-0.1,0.3-0.2,0.4-0.3c0.1-0.1,0.2-0.2,0.3-0.2l-0.1-0.2
	c-0.1,0-0.3,0.1-0.4,0.1c-0.1,0-0.2,0.1-0.2,0.1l0,0c-0.1,0-0.2,0-0.2-0.1c-0.1,0-0.1-0.1-0.2-0.1l-0.1,0.2h0v0.1V3.4
	c0,0-0.1,0-0.1,0L20.5,3l-0.1,0.3c0,0-0.1,0.1-0.1,0.1h-0.1h-0.1v0.2l0,0c-0.1,0-0.2,0-0.3-0.1l-0.1,0.1h-0.2c-0.1,0-0.2,0-0.2,0
	l0,0l-0.1-0.1v0.1v0.1L19,3.6l-0.1,0.1l-0.2,0.1l0-0.3l-0.2,0.1c-0.4,0.2-0.4,0.3-0.4,0.6c0,0.1,0,0.2-0.1,0.2V4.2l-0.2,0.3
	l-0.2-0.1v0.1c-0.1,0.2-0.3,0.3-0.6,0.4c-0.2,0.1-0.4,0.2-0.6,0.3c-0.1,0-0.1,0-0.2,0c-0.2,0-0.3,0-0.4,0.1l-0.1,0.1v0.1l-0.3,0.1
	c-0.2,0-0.4,0.1-0.6,0.1c-0.1,0-0.2,0-0.3-0.1h-0.1v0.1c-0.1,0.1-0.1,0.2-0.1,0.3l0,0c0,0-0.1,0.1-0.2,0.1h-0.1H14h-0.2l0,0
	c-0.1,0-0.1,0.1-0.1,0.2c-0.1,0-0.1,0.1-0.1,0.2c-0.1,0.1-0.1,0.1-0.2,0.2l-0.1-0.1c-0.2,0.2-0.5,0.4-0.8,0.6
	c-0.2,0.1-0.4,0.2-0.6,0.4c-0.3,0.1-0.7,0.3-1.1,0.5s-0.7,0.4-1,0.5H9.8l0,0C9.6,8.4,9.4,8.5,9.3,8.6C9.2,8.7,9.1,8.8,8.9,8.8V9
	L8.8,9.1L8.6,9.2L8.5,9.1l0,0C8.4,9.2,8.3,9.3,8.3,9.5c0,0,0,0,0,0.1C8.2,9.6,8,9.7,7.9,9.8l0.1-0.3L7.7,9.8
	C7.6,9.9,7.6,10,7.5,10.1c0,0.1-0.1,0.2-0.2,0.2v-0.1l-0.1,0.1c-0.4,0.5-0.8,0.9-1.3,1.3c-0.4,0.3-0.7,0.6-1,1v0.1l-0.1,0.1
	c-0.8,0.6-1.5,1.4-2.1,2.2l0.1,0.2c0.2-0.2,0.4-0.3,0.5-0.4c0.4-0.3,0.7-0.6,1-1c0.1,0,0.2-0.1,0.3-0.2c0.1-0.1,0.1-0.1,0.2-0.1
	L5,13.5z M13.5,8.1L13.5,8.1z M13.1,8.2L13.1,8.2L13.1,8.2L13.1,8.2L13.1,8.2L13.1,8.2z M6,12.4L6,12.4c0,0.1-0.1,0.2-0.1,0.2v-0.1
	L6,12.4z"/>
<polygon class="st0" points="9.4,10.1 8.9,10.6 9,10.8 9.5,10.3 9.5,10.1 "/>
<path class="st0" d="M16.1,7.4L16.1,7.4L16.1,7.4L16.1,7.4l0.1-0.3h-0.1h-0.1l0,0l0,0C16,7.1,16,7.2,16,7.3c0,0.1,0,0.1,0.1,0.2l0,0
	l0.2,0.1L16.1,7.4z"/>
<path class="st0" d="M16.4,7c0.1,0,0.1-0.1,0.2-0.2l0,0l-0.1-0.2c-0.1,0-0.2,0.1-0.2,0.2L16.2,7H16.4L16.4,7z"/>
<path class="st0" d="M3.6,19.2L3.6,19.2c0,0.1,0,0.1,0,0.2c0,0,0.1,0.1,0.1,0.1c0.1,0,0.1,0,0.2,0H4v-0.6L3.6,19.2z"/>
<path class="st0" d="M4.2,18.4l-0.1-0.1c-0.1,0.1-0.1,0.2-0.2,0.4c0,0.1,0,0.2,0.1,0.2l0,0l0,0l0.2,0.1l0.1-0.4L4.2,18.4L4.2,18.4z"
	/>
<path class="st0" d="M4.5,17.9H4.3V18l0,0c0,0.1,0,0.1,0,0.2v0.1h0.1c0.1,0,0.2-0.2,0.2-0.3C4.6,17.9,4.6,17.9,4.5,17.9z"/>
<path class="st0" d="M21.4,6.3c-0.1,0.1-0.1,0.1-0.2,0.2h-0.1c-0.1,0-0.1,0-0.2,0c-0.1,0-0.1,0-0.2,0v0.2l0,0c0,0-0.1,0-0.1,0
	l-0.1-0.4l-0.1,0.4c0,0-0.1,0.1-0.2,0.1h-0.1V7H20c0,0-0.1,0-0.1-0.1L19.7,7l-0.1,0.1c-0.1,0-0.1,0.1-0.2,0.1l-0.1-0.1v0.1l0,0
	L19.2,7l-0.1,0.1L19,7.2V7l-0.1,0.1c-0.2,0.1-0.4,0.4-0.3,0.6c0,0.1,0,0.2-0.1,0.2V7.7l-0.2,0.3L18,8v0.1c0,0.2-0.2,0.3-0.5,0.4
	c-0.2,0.1-0.4,0.2-0.5,0.4c-0.1,0-0.1,0-0.2,0c-0.1,0-0.3,0.1-0.4,0.1L16.4,9v0.1l-0.2,0.1c-0.2,0.1-0.4,0.1-0.6,0.1
	c-0.1,0-0.2,0-0.2-0.1h-0.1v0.1c-0.1,0.1-0.1,0.2-0.1,0.2l0,0c0,0-0.1,0.1-0.1,0.1H15h-0.1h-0.1l0,0c-0.1,0.1-0.1,0.1-0.1,0.2
	c0,0-0.1,0.1-0.1,0.1c0,0.1-0.1,0.1-0.1,0.2L14.3,10c-0.2,0.2-0.4,0.4-0.7,0.6c-0.2,0.1-0.3,0.2-0.5,0.3s-0.5,0.3-0.8,0.4
	c-0.3,0.2-0.7,0.4-1,0.5h-0.1l0,0c-0.1,0.1-0.3,0.1-0.4,0.2c-0.1,0.1-0.2,0.1-0.3,0.2v0.1l-0.1,0.1l-0.1,0.1l-0.1-0.1l0,0
	c-0.2,0.1-0.2,0.3-0.2,0.5l0,0c-0.1,0-0.3,0.1-0.4,0.2L9.6,13l-0.2,0.2c-0.1,0.1-0.1,0.2-0.2,0.2c0,0.1-0.1,0.1-0.1,0.2v-0.1
	l-0.1,0.1c-0.3,0.3-0.7,0.6-1.1,0.9c-0.3,0.3-0.7,0.5-1,0.8v0.1c-0.8,0.5-1.5,1.3-2,2.1L5,17.8c0.2-0.2,0.3-0.3,0.5-0.4
	c0.3-0.2,0.6-0.5,0.9-0.8c0.1,0,0.2-0.1,0.2-0.1c0,0,0.1-0.1,0.1-0.1l0,0l0,0C7,16.2,7.2,16,7.4,15.8L7.5,16l0.1-0.1l0,0V16l0,0
	l-0.1,0l0.3,0.3l0.5-0.5H8h0c0.2-0.1,0.3-0.3,0.5-0.4c0.3-0.2,0.5-0.4,0.7-0.6l0.2-0.4L9,14.6c-0.1,0.1-0.2,0.1-0.3,0.2l-0.2,0.1
	c0.2-0.2,0.5-0.4,0.7-0.5c0.2-0.1,0.4-0.2,0.6-0.4c0.1-0.1,0.2-0.1,0.2-0.1l0.1,0.2c0.1-0.1,0.1-0.2,0.1-0.3l0,0v0.1h0.2
	c0-0.1,0-0.1,0.2-0.1h0.1v0.1c0.1,0,0.1-0.1,0.2-0.1l0.1,0.1c0-0.1,0.1-0.1,0.1-0.1h0.1h0.1h0.1v-0.2c0,0,0-0.1,0-0.1l0,0l0,0l0,0
	l0.1,0.1v-0.1l0.1-0.1c0,0,0.1-0.1,0.2-0.1l0,0l0,0c0.1,0,0.2,0,0.2-0.1v0.1c-0.1,0.1-0.2,0.2-0.2,0.3c-0.1,0.1-0.1,0.1-0.2,0.2
	l0.1,0.2l0.3-0.3h0.1l0,0l0.1,0.1c0.4-0.2,0.7-0.5,1-0.8l0.2-0.1l0,0v-0.1l0.1-0.1l0.1-0.1h-0.1c0-0.1,0-0.1,0-0.2c0,0,0,0,0-0.1
	l0.2-0.1c0.1,0,0.2-0.1,0.3-0.1h0.2l0.1,0.2l0.2-0.2h0.1l0.1-0.1l0.1-0.1l0,0l0,0l0,0l0.2,0.1c0.1-0.2,0.3-0.3,0.4-0.4l0.2-0.2v0.3
	l0.1-0.3c0-0.1,0.1-0.1,0.2-0.2c0.1-0.1,0.2-0.1,0.3-0.2l0,0l0.3-0.4l0,0v0.1h0.1l0,0c0.2-0.2,0.4-0.3,0.6-0.4h0.1V10
	c0,0,0-0.2,0.5-0.5C19,8.9,20.2,8,21.3,7c0.1-0.1,0.2-0.3,0.3-0.4c0.1-0.1,0.1-0.2,0.2-0.3l-0.1-0.2C21.6,6.1,21.5,6.2,21.4,6.3z
	 M7.8,15.4L7.8,15.4l-0.1,0.2v-0.1L7.8,15.4z M14.2,11.9L14.2,11.9L14.2,11.9L14.2,11.9L14.2,11.9L14.2,11.9z"/>
<polygon class="st0" points="10.9,13.6 10.4,14 10.5,14.3 11,13.8 11,13.6 "/>
<path class="st0" d="M16.9,10.7L16.9,10.7L16.9,10.7L16.9,10.7c-0.1,0-0.2,0.1-0.2,0.2c0,0.1,0,0.1,0.1,0.2l0,0H17l0,0l0,0l0,0
	l0-0.1L16.9,10.7L16.9,10.7z"/>
<path class="st0" d="M17,10.5l-0.1,0.2H17h0.1c0.1,0,0.1-0.1,0.2-0.2l0,0l0.2-0.4l-0.3,0.2C17.1,10.3,17,10.4,17,10.5z"/>
</svg>
