<?xml version="1.0" encoding="utf-8"?>
<!-- Generator: Adobe Illustrator 21.0.0, SVG Export Plug-In . SVG Version: 6.00 Build 0)  -->
<svg version="1.1" id="katman_1" xmlns="http://www.w3.org/2000/svg" xmlns:xlink="http://www.w3.org/1999/xlink" x="0px" y="0px"
	 viewBox="0 0 46.9 48" style="enable-background:new 0 0 46.9 48;" xml:space="preserve">
<style type="text/css">
	.st0{opacity:0.7;fill:#603913;enable-background:new    ;}
	.st1{fill:url(#_Dikdörtgen__1_);}
	.st2{fill:#F3F3F3;}
	.st3{opacity:0.1;fill:#FFFFFF;enable-background:new    ;}
	.st4{opacity:0.2;fill:#010101;enable-background:new    ;}
</style>
<title>application-exit_1</title>
<path class="st0" d="M23.5,46.9C10.5,46.9,0,36.4,0,23.5S10.5,0,23.5,0s23.5,10.5,23.5,23.5l0,0C46.9,36.4,36.4,46.9,23.5,46.9z"/>
<radialGradient id="_Dikdörtgen__1_" cx="23.46" cy="24.27" r="56.98" gradientTransform="matrix(1 0 0 -1 0 47.73)" gradientUnits="userSpaceOnUse">
	<stop  offset="0" style="stop-color:#F8963A"/>
	<stop  offset="7.000000e-02" style="stop-color:#F79035"/>
	<stop  offset="0.32" style="stop-color:#F37D28"/>
	<stop  offset="0.5" style="stop-color:#F27623"/>
	<stop  offset="1" style="stop-color:#D4632A"/>
</radialGradient>
<path id="_Dikdörtgen_" class="st1" d="M46.6,23.5L46.6,23.5c0,12.8-10.3,23.1-23.1,23.1l0,0c-12.8,0-23.1-10.3-23.1-23.1l0,0
	c0-12.8,10.3-23.1,23.1-23.1l0,0C36.2,0.4,46.6,10.7,46.6,23.5z"/>
<path class="st2" d="M36.8,26.1h-2.4c-0.8,6.4-6.6,10.9-13,10.1c-6.4-0.8-10.9-6.6-10.1-13c0.7-5.3,4.8-9.4,10-10.1v-2.4
	c0-0.5,0.2-1,0.5-1.4C13.4,9.8,7,17.1,7.5,25.7s7.9,15,16.4,14.4c7.8-0.5,14-6.7,14.4-14.5C37.9,25.9,37.4,26.1,36.8,26.1z"/>
<path class="st2" d="M34.5,22.9v-7.1l-8.7,8.7c-0.2,0.2-0.4,0.2-0.6,0c0,0,0,0,0,0l-2.1-2.1c-0.2-0.2-0.2-0.4,0-0.6c0,0,0,0,0,0
	l8.7-8.8h-7.1c-0.2,0-0.4-0.2-0.4-0.4v-3c0-0.2,0.2-0.4,0.4-0.4h12.8c0.4,0,0.8,0.4,0.8,0.8v12.8c0,0.2-0.2,0.4-0.4,0.4l0,0h-3
	C34.7,23.3,34.5,23.1,34.5,22.9C34.5,22.9,34.5,22.9,34.5,22.9z"/>
<path class="st3" d="M46.6,23.5c0-12.8-10.3-23.1-23.1-23.1l0,0C10.7,0.4,0.4,10.7,0.4,23.5l0,0c0,0.2,0,0.5,0,0.7
	C0.7,11.7,11,1.8,23.5,1.8l0,0c12.5,0,22.7,9.9,23.1,22.4C46.5,23.9,46.5,23.7,46.6,23.5L46.6,23.5z"/>
<path class="st4" d="M23.5,46.6L23.5,46.6C11,46.6,0.8,36.7,0.4,24.2c0,0.2,0,0.5,0,0.7l0,0C0.4,37.6,10.7,48,23.5,48l0,0
	c12.8,0,23.1-10.3,23.1-23.1l0,0c0-0.2,0-0.5,0-0.7C46.2,36.7,35.9,46.6,23.5,46.6z"/>
<path class="st3" d="M21.4,10.8L21.4,10.8c0-0.6,0.2-1.1,0.5-1.5C13.8,9.8,7.5,16.5,7.5,24.7c0,0.2,0,0.5,0,0.7
	C7.8,17.7,13.8,11.5,21.4,10.8z"/>
<path class="st3" d="M36.8,26.1h-2.4c-0.8,6.4-6.7,10.9-13,10c-5.5-0.7-9.8-5.3-10.1-10.8c0,0.2,0,0.5,0,0.8
	c0,6.4,5.3,11.6,11.7,11.6c5.8,0,10.7-4.3,11.5-10.1h2.4c0.5,0,0.9-0.2,1.3-0.5c0.1-0.5,0.1-1.1,0.2-1.6
	C37.9,25.9,37.4,26.2,36.8,26.1z"/>
<path class="st4" d="M22.9,40.1c-8.2,0-15-6.5-15.4-14.7c0,0.2,0,0.5,0,0.7c0.2,8.5,7.3,15.2,15.8,15c7.9-0.2,14.3-6.3,15-14.1
	l-0.2,0.1C36.9,34.6,30.5,40.1,22.9,40.1z"/>
<path class="st4" d="M21.4,14.6v-1.4c-5.8,0.8-10.1,5.7-10.1,11.5c0,0.2,0,0.5,0,0.7C11.6,19.8,15.9,15.3,21.4,14.6z"/>
<path class="st3" d="M30.4,14.5l-7.3,7.3c-0.2,0.2-0.2,0.4,0,0.6c0,0,0,0,0,0l0.4,0.4l8.3-8.3L30.4,14.5z"/>
<path class="st3" d="M37.5,9.2H24.7c-0.2,0-0.4,0.2-0.4,0.4v1.4c0-0.2,0.2-0.4,0.4-0.4h12.8c0.4,0,0.8,0.4,0.8,0.8V10
	C38.3,9.6,37.9,9.2,37.5,9.2z"/>
<path class="st4" d="M24.7,13c-0.2,0-0.4-0.2-0.4-0.4V14c0,0.2,0.2,0.4,0.4,0.4h5.7l1.4-1.4H24.7z"/>
<path class="st4" d="M34.5,15.7l-8.7,8.7c-0.2,0.2-0.4,0.2-0.6,0c0,0,0,0,0,0l-1.7-1.7l-0.4,0.4c-0.2,0.2-0.2,0.4,0,0.6c0,0,0,0,0,0
	l2.1,2.1c0.2,0.2,0.4,0.2,0.6,0c0,0,0,0,0,0l8.7-8.7L34.5,15.7z"/>
<path class="st4" d="M37.9,23.3h-3c-0.2,0-0.4-0.2-0.4-0.4c0,0,0,0,0,0v1.4c0,0.2,0.2,0.4,0.4,0.4l0,0h3c0.2,0,0.4-0.2,0.4-0.4
	c0,0,0,0,0,0v-1.4C38.3,23.1,38.1,23.3,37.9,23.3L37.9,23.3z"/>
</svg>
