<?xml version="1.0" encoding="utf-8"?>
<!-- Generator: Adobe Illustrator 21.0.0, SVG Export Plug-In . SVG Version: 6.00 Build 0)  -->
<svg version="1.1" id="katman_1" xmlns="http://www.w3.org/2000/svg" xmlns:xlink="http://www.w3.org/1999/xlink" x="0px" y="0px"
	 viewBox="0 0 48 41.5" style="enable-background:new 0 0 48 41.5;" xml:space="preserve">
<style type="text/css">
	.st0{opacity:0.8;fill:#0E141E;enable-background:new    ;}
	.st1{fill:url(#_Dikdörtgen__1_);}
	.st2{opacity:0.2;fill:#0E141E;enable-background:new    ;}
	.st3{fill:url(#SVGID_1_);}
	.st4{fill:url(#_Bileşik_Yol__1_);}
	.st5{opacity:0.1;fill:#FFFFFF;enable-background:new    ;}
	.st6{opacity:0.1;enable-background:new    ;}
</style>
<title>desktop_1</title>
<path class="st0" d="M1.4,37C0.6,37,0,36.4,0,35.8l0,0V6.2c0-0.8,0.6-1.3,1.3-1.3l0,0h45.5c0.6,0,1.2,0.6,1.2,1.3l0,0v29.5
	c0,0.8-0.6,1.3-1.3,1.3l0,0H1.4V37z M44.4,33.4V8.5H3.6v24.9H44.4z"/>
<linearGradient id="_Dikdörtgen__1_" gradientUnits="userSpaceOnUse" x1="24.0469" y1="153.9325" x2="24.0469" y2="127.8325" gradientTransform="matrix(1 0 0 1 0 -120)">
	<stop  offset="0" style="stop-color:#2D5778"/>
	<stop  offset="1" style="stop-color:#2A6D94"/>
</linearGradient>
<rect id="_Dikdörtgen_" x="3" y="7.9" class="st1" width="42" height="26.1"/>
<path class="st2" d="M7.1,26.5c-0.5,0-0.8-0.3-0.8-0.8v-3.1c0-0.5,0.3-0.8,0.8-0.8h6.6l-8.6-8.5c-0.3-0.3-0.3-0.9,0-1.2l2.2-2.2
	c0.3-0.3,0.8-0.3,1.2,0l8.4,8.6v-6.5c0-0.4,0.3-0.8,0.8-0.8h3.1c0.5,0,0.8,0.3,0.8,0.8v13.4c0,0.8-0.6,1.2-1.2,1.2H7.1z"/>
<linearGradient id="SVGID_1_" gradientUnits="userSpaceOnUse" x1="13.4233" y1="130.0976" x2="13.2733" y2="146.1776" gradientTransform="matrix(1 0 0 1 0 -120)">
	<stop  offset="0" style="stop-color:#DEDFE1"/>
	<stop  offset="1" style="stop-color:#B3B7BE"/>
</linearGradient>
<path class="st3" d="M17.4,11.9v7.5l-9.2-9.1c-0.1-0.1-0.5-0.1-0.6,0l0,0l-2.2,2.1c-0.1,0.1-0.1,0.4,0,0.6l0,0l9.1,9.1H7.1
	c-0.3,0-0.5,0.1-0.5,0.5v3.1c0,0.3,0.1,0.5,0.5,0.5h13.4c0.4,0,0.9-0.5,0.9-0.9l0,0V11.9c0-0.3-0.1-0.4-0.5-0.4h-3.1
	C17.6,11.5,17.4,11.6,17.4,11.9z"/>
<linearGradient id="_Bileşik_Yol__1_" gradientUnits="userSpaceOnUse" x1="24.1219" y1="156.5875" x2="24.1219" y2="125.2375" gradientTransform="matrix(1 0 0 1 0 -120)">
	<stop  offset="0" style="stop-color:#A3A4A4"/>
	<stop  offset="0.12" style="stop-color:#BBBBBB"/>
	<stop  offset="0.27" style="stop-color:#CFCECE"/>
	<stop  offset="0.43" style="stop-color:#DDDCDC"/>
	<stop  offset="0.64" style="stop-color:#E5E4E4"/>
	<stop  offset="1" style="stop-color:#E7E6E6"/>
</linearGradient>
<path id="_Bileşik_Yol_" class="st4" d="M46.7,5.3H1.4c-0.4,0-0.9,0.5-0.9,0.9l0,0v29.5c0,0.5,0.5,0.9,0.9,0.9l0,0h45.5
	c0.4,0,0.9-0.5,0.9-0.9l0,0V6.2C47.6,5.6,47.3,5.3,46.7,5.3L46.7,5.3z M44.9,33.8H3.2V8h41.7V33.8z"/>
<path class="st5" d="M6.6,22.6v1.5c0-0.3,0.1-0.5,0.4-0.5h7.5l-1.5-1.5h-6C6.8,22.1,6.6,22.3,6.6,22.6L6.6,22.6z"/>
<path class="st5" d="M8.3,11.8l9.2,9.1v-1.5l-9.2-9.1c-0.1-0.1-0.5-0.1-0.6,0l0,0l-2.2,2.1c-0.1,0.1-0.1,0.4,0,0.6l0,0l0.5,0.4
	l1.8-1.8C7.8,11.5,8,11.5,8.3,11.8L8.3,11.8z"/>
<path class="st5" d="M20.9,11.5h-3.1c-0.3,0-0.5,0.1-0.5,0.4v1.5c0-0.3,0.2-0.4,0.5-0.4h3.1c0.3,0,0.5,0.1,0.5,0.4v-1.5
	C21.3,11.6,21.2,11.5,20.9,11.5z"/>
<path class="st6" d="M20.4,26.2H7.1c-0.3,0-0.5-0.1-0.5-0.5v1.5c0,0.3,0.1,0.5,0.5,0.5h13.4c0.4,0,0.9-0.5,0.9-0.9l0,0v-1.5
	C21.3,25.7,21,26.2,20.4,26.2L20.4,26.2z"/>
<path class="st6" d="M14.6,22.1l-8.7-8.7l-0.5,0.5c-0.1,0.1-0.1,0.4,0,0.6l0,0l7.6,7.6H14.6z"/>
<rect x="3.2" y="33.8" class="st5" width="41.7" height="1.5"/>
<path class="st5" d="M46.7,5.3H1.4c-0.4,0-0.9,0.5-0.9,0.9l0,0v1.5c0-0.4,0.5-0.9,0.9-0.9l0,0h45.5c0.4,0,0.9,0.5,0.9,0.9l0,0V6.2
	C47.6,5.6,47.3,5.3,46.7,5.3L46.7,5.3z"/>
<path class="st6" d="M46.7,36.7H1.4c-0.4,0-0.9-0.5-0.9-0.9l0,0v1.5c0,0.5,0.5,0.9,0.9,0.9l0,0h45.5c0.4,0,0.9-0.5,0.9-0.9l0,0v-1.5
	C47.6,36.2,47.3,36.7,46.7,36.7L46.7,36.7z"/>
<rect x="3.2" y="8" class="st6" width="41.7" height="1.5"/>
</svg>
