<?xml version="1.0" encoding="utf-8"?>
<!-- Generator: Adobe Illustrator 21.0.0, SVG Export Plug-In . SVG Version: 6.00 Build 0)  -->
<svg version="1.1" id="katman_1" xmlns="http://www.w3.org/2000/svg" xmlns:xlink="http://www.w3.org/1999/xlink" x="0px" y="0px"
	 viewBox="0 0 49.3 64" style="enable-background:new 0 0 49.3 64;" xml:space="preserve">
<style type="text/css">
	.st0{opacity:0.7;fill:#333333;enable-background:new    ;}
	.st1{opacity:0.1;fill:#010101;enable-background:new    ;}
	.st2{fill:url(#SVGID_1_);}
	.st3{fill:url(#SVGID_2_);}
	.st4{fill:url(#SVGID_3_);}
	.st5{opacity:0.1;fill:#FFFFFF;enable-background:new    ;}
	.st6{fill:url(#SVGID_4_);}
	.st7{fill:url(#SVGID_5_);}
	.st8{fill:url(#SVGID_6_);}
	.st9{fill:url(#SVGID_7_);}
	.st10{fill:url(#SVGID_8_);}
</style>
<title>preferences-desktop-pripherals</title>
<path class="st0" d="M21.7,62.6c-3.8,0-9-2.6-11.4-5s-2.6-4.7-2.7-7.2c0-1.5-0.2-3-0.6-4.4c-0.6-1.7-1.4-3.4-2.3-5
	c-1-1.7-1.9-3.5-2.5-5.3c-1-3.3-1.4-6.8-1-10.3c0.6-3.2,2.1-6.1,4.3-8.4c1.5-1.6,3.5-2.8,5.6-3.3c0-0.6,0-1.1,0-1.6
	c-0.1-3-0.1-5.9,1.1-8.2c0.8-1.6,2.3-2.6,4.8-3.2C19.2,0.2,21.5,0,23.7,0c2.5-0.1,5,0.4,7.3,1.4c13,6.5,18.3,14.2,18.3,26.5
	c0,12.6-6.5,24.4-17.3,31c-0.4,0.3-0.8,0.6-1.2,0.8C28.7,61.2,26.8,62.6,21.7,62.6z"/>
<path class="st0" d="M9,35.6c-0.4,0-0.7,0-1.1-0.1c-4.8-1-7.9-4.7-7.9-9.4c0-2.4,0.6-5.8,5.8-8c0.9-0.4,1.8-0.6,2.8-0.6
	c1-0.1,2,0.2,2.8,0.8c1.6,1.5,1.6,5,1.6,7.6v0.4c0,2.2,0,5.2-0.7,7C11.8,34.7,10.5,35.6,9,35.6z"/>
<path class="st1" d="M31.8,58.5c-2.7,1.7-4.2,3.6-10,3.6c-3.5,0-8.6-2.5-11-4.9c-3.6-3.6-1.9-6.9-3.2-11.3
	c-1.2-3.7-3.6-6.4-4.9-10.4c-0.6-2.1-1-4.3-1.1-6.5c-0.1,2.9,0.3,5.7,1.1,8.4c1.3,4,3.7,6.7,4.9,10.4c1.4,4.5-0.3,7.8,3.2,11.3
	c2.4,2.4,7.5,4.9,11,4.9c5.8,0,7.3-1.8,10-3.6c10.6-6.5,17-18.1,17-30.6c0-0.3,0-0.7,0-1C48.4,41,42.1,52.1,31.8,58.5z"/>
<radialGradient id="SVGID_1_" cx="28.9767" cy="30.915" r="28.54" gradientTransform="matrix(0.96 0 0 -0.96 -2.77 60.8908)" gradientUnits="userSpaceOnUse">
	<stop  offset="0" style="stop-color:#F7F7F7"/>
	<stop  offset="0.3" style="stop-color:#F3F3F3"/>
	<stop  offset="0.61" style="stop-color:#E7E7E7"/>
	<stop  offset="0.92" style="stop-color:#D3D3D3"/>
	<stop  offset="1" style="stop-color:#CCCCCC"/>
</radialGradient>
<path class="st2" d="M48.8,27.9c0,12.5-6.4,24-17,30.6c-2.7,1.7-4.2,3.6-10,3.6c-3.5,0-8.6-2.5-11-4.9c-3.6-3.6-1.9-6.9-3.2-11.3
	c-1.2-3.7-3.6-6.4-4.9-10.4c-1-3.2-1.4-6.6-1-10c0.6-3.1,2-5.9,4.2-8.1c2.9-2.8,5.2-3.2,5.8-3.2c0-3.8-0.4-7.3,1-10.1
	c0.6-1.3,1.8-2.3,4.5-2.9c1.6-0.4,9.1-1.6,13.6,0.6C43.9,8.4,48.8,15.9,48.8,27.9z"/>
<path class="st0" d="M19.8,28.2c-3,0-5.4-2.4-5.4-5.4V1.7l0.3-0.1c0.8-0.4,1.6-0.6,2.4-0.8C19.2,0.2,21.5,0,23.7,0
	c2.5-0.1,5,0.4,7.3,1.4c2.5,1.2,4.9,2.7,7.2,4.3l0.2,0.1v12.9c0,5.2-4.3,9.5-9.5,9.5H19.8z"/>
<linearGradient id="SVGID_2_" gradientUnits="userSpaceOnUse" x1="14.91" y1="49.6052" x2="37.91" y2="49.6052" gradientTransform="matrix(1 0 0 -1 0 63.73)">
	<stop  offset="0" style="stop-color:#CCCCCC"/>
	<stop  offset="1" style="stop-color:#F7F7F7"/>
</linearGradient>
<path class="st3" d="M30.8,1.8c-4.5-2.3-12-1-13.6-0.6c-0.8,0.2-1.5,0.5-2.3,0.8v20.8c0,2.7,2.2,4.9,4.9,4.9l0,0h9c5,0,9-4,9-9V6.1
	C35.6,4.5,33.2,3.1,30.8,1.8z"/>
<path class="st0" d="M9,35.1c-0.3,0-0.7,0-1-0.1c-4.3-0.7-7.5-4.5-7.5-8.9c0-2.2,0.6-5.5,5.5-7.6C6.8,18.2,7.7,18,8.6,18
	c0.9-0.1,1.7,0.2,2.4,0.6c1.4,1.4,1.4,4.8,1.4,7.2v0.4c0,2.1,0,5.1-0.7,6.8C11.4,34.3,10.3,35.1,9,35.1z"/>
<path class="st0" d="M26.4,16.6c-1.2,0-2.1-0.9-2.1-2.1v0V9c0-1.2,0.9-2.1,2.1-2.1c1.2,0,2.1,0.9,2.1,2.1v5.5
	C28.5,15.7,27.6,16.6,26.4,16.6z"/>
<linearGradient id="SVGID_3_" gradientUnits="userSpaceOnUse" x1="24.79" y1="52.025" x2="28.02" y2="52.025" gradientTransform="matrix(1 0 0 -1 0 63.73)">
	<stop  offset="0" style="stop-color:#DD922E"/>
	<stop  offset="0.71" style="stop-color:#F9AE42"/>
	<stop  offset="1" style="stop-color:#F8DB6E"/>
</linearGradient>
<path class="st4" d="M26,7.3h0.8c0.7,0,1.2,0.5,1.2,1.2v6.3c0,0.7-0.5,1.2-1.2,1.2H26c-0.7,0-1.2-0.5-1.2-1.2V8.5
	C24.8,7.9,25.3,7.3,26,7.3z"/>
<path class="st0" d="M26.4,29.7c-1.2,0-2.1-0.9-2.1-2.1c0,0,0,0,0,0v-7.4c0-1.2,0.9-2.1,2.1-2.1c1.2,0,2.1,0.9,2.1,2.1v7.4
	C28.5,28.8,27.6,29.7,26.4,29.7z"/>
<path class="st5" d="M5.8,19.3c2.9-2.8,5.2-3.2,5.8-3.2c0-0.6,0-1.3,0-1.9c-0.7,0-2.9,0.5-5.8,3.2c-2.2,2.2-3.6,5-4.2,8.1
	c-0.2,1.2-0.3,2.3-0.2,3.5c0-0.5,0.1-1.1,0.2-1.6C2.2,24.3,3.7,21.5,5.8,19.3z"/>
<linearGradient id="SVGID_4_" gradientUnits="userSpaceOnUse" x1="11.61" y1="50.96" x2="11.65" y2="50.96" gradientTransform="matrix(1 0 0 -1 0 63.73)">
	<stop  offset="0" style="stop-color:#CCCCCC"/>
	<stop  offset="1" style="stop-color:#F7F7F7"/>
</linearGradient>
<path class="st6" d="M11.6,11.4c0,0.9,0,1.8,0,2.8l0,0C11.6,13.2,11.6,12.3,11.6,11.4z"/>
<linearGradient id="SVGID_5_" gradientUnits="userSpaceOnUse" x1="24.79" y1="39.815" x2="28.02" y2="39.815" gradientTransform="matrix(1 0 0 -1 0 63.73)">
	<stop  offset="0" style="stop-color:#CCCCCC"/>
	<stop  offset="1" style="stop-color:#F7F7F7"/>
</linearGradient>
<path class="st7" d="M26,18.6h0.8c0.7,0,1.2,0.5,1.2,1.2v8.3c0,0.7-0.5,1.2-1.2,1.2H26c-0.7,0-1.2-0.5-1.2-1.2v-8.3
	C24.8,19.1,25.3,18.6,26,18.6z"/>
<linearGradient id="SVGID_6_" gradientUnits="userSpaceOnUse" x1="25.41" y1="42.31" x2="27.4" y2="42.31" gradientTransform="matrix(1 0 0 -1 0 63.73)">
	<stop  offset="0" style="stop-color:#DD922E"/>
	<stop  offset="0.71" style="stop-color:#F9AE42"/>
	<stop  offset="1" style="stop-color:#F8DB6E"/>
</linearGradient>
<path class="st8" d="M26.2,19.3h0.5c0.4,0,0.8,0.3,0.8,0.8v2.8c0,0.4-0.3,0.8-0.8,0.8h-0.5c-0.4,0-0.8-0.3-0.8-0.8V20
	C25.4,19.6,25.7,19.3,26.2,19.3z"/>
<linearGradient id="SVGID_7_" gradientUnits="userSpaceOnUse" x1="25.41" y1="37.32" x2="27.4" y2="37.32" gradientTransform="matrix(1 0 0 -1 0 63.73)">
	<stop  offset="0" style="stop-color:#DD922E"/>
	<stop  offset="0.71" style="stop-color:#F9AE42"/>
	<stop  offset="1" style="stop-color:#F8DB6E"/>
</linearGradient>
<path class="st9" d="M26.2,24.3h0.5c0.4,0,0.8,0.3,0.8,0.8v2.8c0,0.4-0.3,0.8-0.8,0.8h-0.5c-0.4,0-0.8-0.3-0.8-0.8V25
	C25.4,24.6,25.7,24.3,26.2,24.3z"/>
<path class="st5" d="M17.2,3.1c1.6-0.4,9.1-1.6,13.6,0.7c12.7,6.4,17.7,13.6,18,25.1c0-0.3,0-0.6,0-0.9c0-12-4.9-19.6-18-26.1
	c-4.5-2.3-12-1-13.6-0.6c-2.7,0.6-3.9,1.6-4.5,2.9c-1,2.1-1.1,4.5-1,7.3c-0.1-1.8,0.3-3.7,1-5.4C13.3,4.8,14.5,3.7,17.2,3.1z"/>
<radialGradient id="SVGID_8_" cx="9.6267" cy="52.5136" r="7.18" gradientTransform="matrix(0.96 0 0 -1.63 -2.77 112.2199)" gradientUnits="userSpaceOnUse">
	<stop  offset="0" style="stop-color:#F7F7F7"/>
	<stop  offset="0.3" style="stop-color:#F3F3F3"/>
	<stop  offset="0.61" style="stop-color:#E7E7E7"/>
	<stop  offset="0.92" style="stop-color:#D3D3D3"/>
	<stop  offset="1" style="stop-color:#CCCCCC"/>
</radialGradient>
<path class="st10" d="M12,26.1c0,2.1,0,5.1-0.6,6.8c-0.4,1.3-1.8,2.1-3.2,1.6c0,0,0,0-0.1,0C4,33.8,1,30.3,1,26.1
	c0-2.2,0.6-5.2,5.2-7.1c1.4-0.7,3.1-0.7,4.5,0C12,20.3,12,23.8,12,26.1z"/>
<path class="st5" d="M6.2,20.9c1.4-0.7,3.1-0.7,4.5,0C11.9,22,12,24.8,12,27c0-0.3,0-0.6,0-0.9c0-2.3,0-5.8-1.3-7.1
	c-1.4-0.7-3.1-0.7-4.5,0c-4.5,2-5.2,4.9-5.2,7.2c0,0.3,0,0.6,0,0.9C1.2,25,2.3,22.6,6.2,20.9z"/>
</svg>
