<?xml version="1.0" encoding="utf-8"?>
<!-- Generator: Adobe Illustrator 21.0.0, SVG Export Plug-In . SVG Version: 6.00 Build 0)  -->
<svg version="1.1" id="katman_1" xmlns="http://www.w3.org/2000/svg" xmlns:xlink="http://www.w3.org/1999/xlink" x="0px" y="0px"
	 viewBox="0 0 17 22" style="enable-background:new 0 0 17 22;" xml:space="preserve">
<style type="text/css">
	.st0{opacity:0.2;enable-background:new    ;}
	.st1{fill:url(#SVGID_1_);}
	.st2{opacity:0.1;enable-background:new    ;}
	.st3{fill:#F5F5F5;}
	.st4{opacity:0.1;fill:#FFFFFF;enable-background:new    ;}
	.st5{opacity:0.5;enable-background:new    ;}
</style>
<title>libreoffice-base_6</title>
<path class="st0" d="M0,20.1v0.8C0,21.5,0.5,22,1.2,22h14.7c0.6,0,1.2-0.5,1.2-1.1c0,0,0,0,0,0v-0.8c0,0.6-0.5,1.2-1.2,1.2H1.2
	C0.5,21.2,0,20.7,0,20.1z"/>
<linearGradient id="SVGID_1_" gradientUnits="userSpaceOnUse" x1="8.5" y1="1.6698" x2="8.5" y2="23.2902" gradientTransform="matrix(1 0 0 -1 0 23.29)">
	<stop  offset="0" style="stop-color:#B91D50"/>
	<stop  offset="1" style="stop-color:#E72063"/>
</linearGradient>
<path class="st1" d="M17,20.5V1.2C17,0.5,16.5,0,15.8,0c0,0,0,0,0,0H1.2C0.5,0,0,0.5,0,1.2c0,0,0,0,0,0v19.3c0,0.6,0.5,1.2,1.2,1.2
	h14.7C16.5,21.6,17,21.1,17,20.5C17,20.5,17,20.5,17,20.5z"/>
<path class="st2" d="M1.5,1.9v18.5h13.9v-12L8.9,2L1.5,1.9z M11.1,1.9l4.3,4.3V1.9H11.1z"/>
<path class="st3" d="M1.5,1.5v18.5h13.9V8L8.9,1.5L1.5,1.5z M11.1,1.5l4.3,4.3V1.5H11.1z"/>
<path class="st4" d="M1.2,0C0.5,0,0,0.5,0,1.2c0,0,0,0,0,0v0.4c0-0.6,0.5-1.2,1.2-1.2l0,0h14.7c0.6,0,1.2,0.5,1.2,1.1c0,0,0,0,0,0
	V1.2C17,0.5,16.5,0,15.8,0c0,0,0,0,0,0H1.2z"/>
<path class="st5" d="M8.5,8.5L8.5,8.5C7.2,8.4,5.9,8.9,4.9,9.8c0,0.1-0.1,0.1-0.1,0.2c0,0.1-0.1,0.1-0.1,0.2v0.1c0,0,0,0.1,0,0.1
	c0,0.1,0,0.3,0,0.4c0,0.1,0,0.1,0.1,0.2c0,0.1,0.1,0.1,0.1,0.2L5,11.4c0.9,0.9,2.2,1.4,3.6,1.3c1.3,0.1,2.6-0.4,3.6-1.3l0,0l0.1-0.2
	l0,0l0.1-0.1V11v-0.1v-0.1c0-0.1,0-0.3,0-0.4c0-0.2-0.1-0.4-0.3-0.6C11.1,8.9,9.8,8.4,8.5,8.5z M4.9,12.3c-0.2,0.2-0.3,0.5-0.3,0.7
	c0,1.1,1.7,2,3.9,2s3.9-0.9,3.9-2l0,0c0-0.3-0.1-0.5-0.3-0.7c-1,0.9-2.3,1.3-3.6,1.2C7.2,13.7,5.9,13.2,4.9,12.3z M4.9,14.7
	c-0.2,0.2-0.3,0.5-0.3,0.7c0,1.1,1.7,2,3.9,2l0,0c2.1,0,3.9-0.9,3.9-2c0-0.3-0.1-0.5-0.3-0.7c-1,0.9-2.3,1.3-3.6,1.2
	C7.2,16,5.9,15.6,4.9,14.7z"/>
<path class="st4" d="M4.8,10.7c0-0.1,0.1-0.1,0.1-0.2c0.9-0.9,2.2-1.4,3.6-1.3l0,0c1.3-0.1,2.6,0.4,3.6,1.3c0.1,0.1,0.2,0.3,0.2,0.4
	v-0.1v-0.1c0-0.1,0-0.3,0-0.4c0-0.2-0.1-0.4-0.3-0.6c-0.9-0.9-2.2-1.4-3.5-1.3l0,0C7.2,8.4,5.9,8.9,4.9,9.8c0,0.1-0.1,0.1-0.1,0.2
	c0,0.1-0.1,0.1-0.1,0.2v0.1c0,0,0,0.1,0,0.1c0,0.1,0,0.3,0,0.4c0,0,0,0.1,0,0.1v-0.1C4.7,10.8,4.8,10.8,4.8,10.7z"/>
<path class="st0" d="M12.3,11L12.3,11L12.3,11l-0.1,0.2l0,0l-0.1,0.2l0,0c-0.9,0.9-2.2,1.4-3.6,1.3c-1.3,0.1-2.6-0.4-3.6-1.3
	l-0.1-0.2c-0.1-0.1-0.1-0.1-0.2-0.2v-0.1l0,0c0,0,0,0.1,0,0.1c0,0.1,0,0.3,0,0.4c0,0.1,0,0.1,0.1,0.2c0,0.1,0.1,0.1,0.1,0.2L5,12.1
	c0.9,0.9,2.2,1.4,3.6,1.3c1.3,0.1,2.6-0.4,3.6-1.3l0,0l0.1-0.2l0,0l0.1-0.1v-0.1v-0.1v-0.1C12.3,11.3,12.3,11.1,12.3,11L12.3,11z"/>
<path class="st4" d="M12.4,13.1c0-0.3-0.1-0.5-0.3-0.7c-1,0.9-2.3,1.3-3.6,1.2c-1.3,0.1-2.6-0.3-3.6-1.2c-0.2,0.2-0.3,0.5-0.3,0.7
	c0,0.1,0,0.2,0.1,0.4c0-0.2,0.1-0.3,0.2-0.4c1,0.9,2.3,1.3,3.6,1.2c1.3,0.1,2.6-0.3,3.6-1.2c0.1,0.1,0.2,0.2,0.2,0.4
	C12.3,13.3,12.4,13.2,12.4,13.1L12.4,13.1z"/>
<path class="st0" d="M8.5,15c-1.9,0-3.5-0.7-3.8-1.6c0,0.1-0.1,0.2-0.1,0.3c0,1.1,1.7,2,3.9,2s3.9-0.9,3.9-2l0,0
	c0-0.1,0-0.2-0.1-0.3C12,14.4,10.4,15,8.5,15z"/>
<path class="st4" d="M8.5,16.6c1.3,0.1,2.6-0.3,3.6-1.2c0.1,0.1,0.2,0.2,0.2,0.4c0-0.1,0.1-0.2,0.1-0.4c0-0.3-0.1-0.5-0.3-0.7
	c-1,0.9-2.3,1.3-3.6,1.2c-1.3,0.1-2.6-0.3-3.6-1.2c-0.2,0.2-0.3,0.5-0.3,0.7c0,0.1,0,0.2,0.1,0.4c0.1-0.1,0.1-0.3,0.2-0.4
	C5.9,16.3,7.2,16.7,8.5,16.6z"/>
<path class="st0" d="M8.5,17.4L8.5,17.4c-1.9,0-3.5-0.7-3.8-1.6c0,0.1-0.1,0.2-0.1,0.3c0,1.1,1.7,2,3.9,2l0,0c2.1,0,3.9-0.9,3.9-2
	c0-0.1,0-0.2-0.1-0.3C12,16.7,10.4,17.4,8.5,17.4z"/>
</svg>
