<?xml version="1.0" encoding="utf-8"?>
<!-- Generator: Adobe Illustrator 21.0.0, SVG Export Plug-In . SVG Version: 6.00 Build 0)  -->
<svg version="1.1" id="katman_1" xmlns="http://www.w3.org/2000/svg" xmlns:xlink="http://www.w3.org/1999/xlink" x="0px" y="0px"
	 viewBox="0 0 32 32" style="enable-background:new 0 0 32 32;" xml:space="preserve">
<style type="text/css">
	.st0{opacity:0.3;enable-background:new    ;}
	.st1{fill:url(#SVGID_1_);}
	.st2{fill:url(#SVGID_2_);}
	.st3{opacity:0.2;}
	.st4{opacity:0.1;enable-background:new    ;}
	.st5{opacity:0.1;fill:#FFFFFF;enable-background:new    ;}
	.st6{fill:#F2F2F2;}
	.st7{fill:url(#SVGID_3_);}
	.st8{fill:url(#SVGID_4_);}
	.st9{fill:url(#SVGID_5_);}
	.st10{fill:url(#SVGID_6_);}
	.st11{opacity:0.7;enable-background:new    ;}
	.st12{opacity:0.7;fill:#333333;enable-background:new    ;}
	.st13{opacity:0.7;fill:#42210B;enable-background:new    ;}
	.st14{fill:#FFC807;}
	.st15{fill:url(#SVGID_7_);}
	.st16{fill:url(#SVGID_8_);}
	.st17{fill:url(#SVGID_9_);}
	.st18{fill:url(#SVGID_10_);}
	.st19{fill:url(#SVGID_11_);}
	.st20{fill:url(#SVGID_12_);}
	.st21{fill:url(#SVGID_13_);}
	.st22{fill:url(#SVGID_14_);}
</style>
<title>wmtweaks_2</title>
<path class="st0" d="M22.9,2.9c0-0.3-0.2-0.5-0.5-0.5H0.6C0.2,2.4,0,2.6,0,2.9V19h22.7V4.8h0.1L22.9,2.9z"/>
<linearGradient id="SVGID_1_" gradientUnits="userSpaceOnUse" x1="11.37" y1="14.69" x2="11.37" y2="29.26" gradientTransform="matrix(1 0 0 -1 0 33.2)">
	<stop  offset="0" style="stop-color:#A3A4A4"/>
	<stop  offset="3.000000e-02" style="stop-color:#A5A6A6"/>
	<stop  offset="0.44" style="stop-color:#C9C9C9"/>
	<stop  offset="0.78" style="stop-color:#DFDEDE"/>
	<stop  offset="1" style="stop-color:#E7E6E6"/>
</linearGradient>
<rect x="0.2" y="4" class="st1" width="22.4" height="14.8"/>
<linearGradient id="SVGID_2_" gradientUnits="userSpaceOnUse" x1="11.425" y1="7.56" x2="11.425" y2="30.47" gradientTransform="matrix(1 0 0 -1 0 33.2)">
	<stop  offset="5.000000e-02" style="stop-color:#1A1A1A"/>
	<stop  offset="0.39" style="stop-color:#1D1D1D"/>
	<stop  offset="0.66" style="stop-color:#272727"/>
	<stop  offset="0.91" style="stop-color:#383838"/>
	<stop  offset="1" style="stop-color:#404040"/>
</linearGradient>
<path class="st2" d="M22.7,4.6V2.9c0-0.2-0.2-0.4-0.4-0.4H0.6c-0.2,0-0.4,0.2-0.4,0.4l0,0v1.7H22.7z"/>
<g class="st3">
	<path d="M20.5,4.2l0.4-0.5l-0.4-0.5h0.4L21,3.5l0.2-0.3h0.4l-0.4,0.5l0.4,0.5h-0.4L21,3.9l-0.2,0.3L20.5,4.2z"/>
</g>
<g class="st3">
	<path d="M19.2,4.2V3.8h-0.4V3.6h0.4V3.2h0.3v0.4h0.4v0.2h-0.4v0.4L19.2,4.2z"/>
</g>
<rect x="0.2" y="18.8" class="st4" width="22.4" height="0.7"/>
<path class="st5" d="M22.3,2.5H0.6c-0.2,0-0.4,0.2-0.4,0.4v0.7c0-0.2,0.2-0.4,0.4-0.4h21.8c0.2,0,0.4,0.2,0.4,0.4V2.9
	C22.7,2.7,22.5,2.5,22.3,2.5z"/>
<rect x="0.2" y="4.6" class="st4" width="22.5" height="0.7"/>
<path class="st6" d="M20.5,4.1l0.4-0.5l-0.4-0.5h0.4L21,3.4l0.2-0.3h0.4l-0.4,0.5l0.4,0.5h-0.4L21,3.8l-0.2,0.3H20.5z"/>
<path class="st6" d="M19.2,4.1V3.7h-0.4V3.5h0.4V3.1h0.3v0.4h0.4v0.2h-0.4v0.4H19.2z"/>
<path class="st0" d="M27.4,7.5c0-0.3-0.2-0.5-0.5-0.6H5.1c-0.3,0-0.6,0.2-0.6,0.5v0v16h22.7V9.4h0.1L27.4,7.5z"/>
<linearGradient id="SVGID_3_" gradientUnits="userSpaceOnUse" x1="15.94" y1="10.12" x2="15.94" y2="24.69" gradientTransform="matrix(1 0 0 -1 0 33.2)">
	<stop  offset="0" style="stop-color:#A3A4A4"/>
	<stop  offset="3.000000e-02" style="stop-color:#A5A6A6"/>
	<stop  offset="0.44" style="stop-color:#C9C9C9"/>
	<stop  offset="0.78" style="stop-color:#DFDEDE"/>
	<stop  offset="1" style="stop-color:#E7E6E6"/>
</linearGradient>
<rect x="4.8" y="8.5" class="st7" width="22.4" height="14.8"/>
<linearGradient id="SVGID_4_" gradientUnits="userSpaceOnUse" x1="15.995" y1="2.99" x2="15.995" y2="25.9" gradientTransform="matrix(1 0 0 -1 0 33.2)">
	<stop  offset="5.000000e-02" style="stop-color:#1A1A1A"/>
	<stop  offset="0.39" style="stop-color:#1D1D1D"/>
	<stop  offset="0.66" style="stop-color:#272727"/>
	<stop  offset="0.91" style="stop-color:#383838"/>
	<stop  offset="1" style="stop-color:#404040"/>
</linearGradient>
<path class="st8" d="M27.2,9.2V7.5c0-0.2-0.2-0.4-0.4-0.4H5.1c-0.2,0-0.4,0.2-0.4,0.4l0,0v1.7H27.2z"/>
<g class="st3">
	<path d="M25,8.8l0.4-0.5L25,7.8h0.4L25.6,8l0.2-0.3h0.4l-0.4,0.5l0.4,0.5h-0.4l-0.2-0.3l-0.2,0.3L25,8.8z"/>
</g>
<g class="st3">
	<path d="M23.8,8.8V8.4h-0.4V8.2h0.4V7.8h0.3v0.4h0.4v0.2h-0.4v0.4L23.8,8.8z"/>
</g>
<rect x="4.8" y="23.3" class="st4" width="22.4" height="0.7"/>
<path class="st5" d="M26.9,7.1H5.1c-0.2,0-0.4,0.2-0.4,0.4l0,0v0.7c0-0.2,0.2-0.4,0.4-0.4l0,0h21.8c0.2,0,0.4,0.2,0.4,0.4V7.5
	C27.3,7.3,27.1,7.1,26.9,7.1z"/>
<rect x="4.8" y="9.2" class="st4" width="22.5" height="0.7"/>
<path class="st6" d="M25,8.7l0.4-0.5L25,7.7h0.4l0.2,0.3l0.2-0.3h0.4l-0.4,0.5l0.4,0.5h-0.4l-0.2-0.3l-0.2,0.3L25,8.7z"/>
<path class="st6" d="M23.8,8.7V8.3h-0.4V8.1h0.4V7.7h0.3v0.4h0.4v0.2h-0.4v0.4L23.8,8.7z"/>
<path class="st0" d="M32,12.1c0-0.3-0.2-0.6-0.5-0.6H9.7c-0.3,0-0.6,0.2-0.6,0.6l0,0v16h22.7V14H32V12.1z"/>
<linearGradient id="SVGID_5_" gradientUnits="userSpaceOnUse" x1="20.51" y1="5.55" x2="20.51" y2="20.12" gradientTransform="matrix(1 0 0 -1 0 33.2)">
	<stop  offset="0" style="stop-color:#A3A4A4"/>
	<stop  offset="3.000000e-02" style="stop-color:#A5A6A6"/>
	<stop  offset="0.44" style="stop-color:#C9C9C9"/>
	<stop  offset="0.78" style="stop-color:#DFDEDE"/>
	<stop  offset="1" style="stop-color:#E7E6E6"/>
</linearGradient>
<rect x="9.3" y="13.1" class="st9" width="22.4" height="14.8"/>
<linearGradient id="SVGID_6_" gradientUnits="userSpaceOnUse" x1="20.565" y1="-1.58" x2="20.565" y2="21.33" gradientTransform="matrix(1 0 0 -1 0 33.2)">
	<stop  offset="5.000000e-02" style="stop-color:#1A1A1A"/>
	<stop  offset="0.39" style="stop-color:#1D1D1D"/>
	<stop  offset="0.66" style="stop-color:#272727"/>
	<stop  offset="0.91" style="stop-color:#383838"/>
	<stop  offset="1" style="stop-color:#404040"/>
</linearGradient>
<path class="st10" d="M31.8,13.8v-1.7c0-0.2-0.2-0.4-0.4-0.4H9.7c-0.2,0-0.4,0.2-0.4,0.4l0,0v1.7H31.8z"/>
<g class="st3">
	<path d="M29.6,13.4l0.4-0.5l-0.4-0.5H30l0.2,0.3l0.2-0.3h0.4l-0.4,0.5l0.4,0.5h-0.4l-0.2-0.3l-0.2,0.3H29.6z"/>
</g>
<g class="st3">
	<path d="M28.4,13.4V13H28v-0.2h0.4v-0.4h0.3v0.4H29V13h-0.4v0.4H28.4z"/>
</g>
<rect x="9.3" y="27.9" class="st4" width="22.4" height="0.7"/>
<path class="st5" d="M31.5,11.7H9.7c-0.2,0-0.4,0.2-0.4,0.4l0,0v0.7c0-0.2,0.2-0.4,0.4-0.4l0,0h21.8c0.2,0,0.4,0.2,0.4,0.4v-0.7
	C31.8,11.9,31.7,11.7,31.5,11.7z"/>
<rect x="9.3" y="13.8" class="st4" width="22.5" height="0.7"/>
<path class="st6" d="M29.6,13.3l0.4-0.5l-0.4-0.5H30l0.2,0.3l0.2-0.3h0.4l-0.4,0.5l0.4,0.5h-0.4L30.2,13l-0.2,0.3L29.6,13.3z"/>
<path class="st6" d="M28.4,13.3v-0.4H28v-0.2h0.4v-0.4h0.3v0.4H29v0.2h-0.4v0.4H28.4z"/>
<polygon class="st11" points="26.2,31.3 18.5,22.9 22.6,19.1 31.5,28.6 31.5,31.3 "/>
<polygon class="st12" points="12.4,15.7 15.9,12.5 22.8,19.6 18.9,23.2 "/>
<path class="st13" d="M23.8,9.7c-0.2,0-0.3,0-0.5-0.1l-1.8-0.9c-0.1-0.1-0.3-0.1-0.5,0l-1.8,0.9c-0.1,0.1-0.3,0.1-0.5,0.1
	c-0.3,0-0.6-0.1-0.8-0.4c-0.2-0.2-0.3-0.5-0.2-0.8l0.3-2c0-0.2,0-0.3-0.1-0.5l-1.5-1.4c-0.4-0.4-0.4-1,0-1.4
	c0.2-0.2,0.4-0.3,0.6-0.3l2-0.3c0.2,0,0.3-0.1,0.4-0.3l0.9-1.8c0.2-0.5,0.8-0.7,1.3-0.5c0.2,0.1,0.4,0.3,0.5,0.5l0.9,1.8
	c0.1,0.1,0.2,0.2,0.4,0.3l2,0.3C26,3,26.4,3.5,26.3,4.1c0,0.2-0.1,0.4-0.3,0.6l-1.4,1.4c-0.1,0.1-0.2,0.3-0.1,0.4l0.3,2
	c0.1,0.3,0,0.6-0.2,0.8C24.3,9.6,24.1,9.7,23.8,9.7z"/>
<path class="st14" d="M20.6,0.7l-0.9,1.8c-0.1,0.2-0.3,0.4-0.6,0.4l-2,0.3c-0.4,0.1-0.7,0.4-0.6,0.8c0,0.2,0.1,0.3,0.2,0.5l1.4,1.4
	c0.2,0.2,0.3,0.4,0.2,0.7l-0.3,2C18,9,18.2,9.4,18.6,9.4c0.2,0,0.3,0,0.5-0.1l1.8-0.9c0.2-0.1,0.5-0.1,0.7,0l1.8,0.9
	c0.4,0.2,0.8,0.1,1-0.3c0.1-0.2,0.1-0.3,0.1-0.5l-0.3-2c0-0.2,0-0.5,0.2-0.7l1.5-1.4c0.3-0.3,0.3-0.8,0-1.1
	c-0.1-0.1-0.3-0.2-0.5-0.2l-2-0.3c-0.2,0-0.5-0.2-0.6-0.4l-0.9-1.8c-0.2-0.4-0.6-0.5-1-0.3C20.8,0.4,20.7,0.5,20.6,0.7z"/>
<path class="st13" d="M12.7,7.4c-0.1,0-0.3,0-0.4-0.1L11,6.6c-0.1,0-0.2,0-0.3,0L9.4,7.3C9.3,7.4,9.1,7.4,9,7.4
	C8.5,7.4,8.2,7,8.2,6.6c0-0.1,0-0.1,0-0.2l0.3-1.5c0-0.1,0-0.2-0.1-0.3l-1.1-1c-0.3-0.3-0.3-0.8,0-1.2c0.1-0.1,0.3-0.2,0.5-0.2
	L9.2,2c0.1,0,0.2-0.1,0.2-0.2l0.7-1.4c0.2-0.4,0.7-0.6,1.1-0.4c0.2,0.1,0.3,0.2,0.4,0.4l0.7,1.4c0,0.1,0.1,0.2,0.2,0.2L14,2.2
	c0.4,0.1,0.8,0.5,0.7,0.9c0,0.2-0.1,0.3-0.2,0.5l-1.1,1.1c-0.1,0.1-0.1,0.2-0.1,0.3l0.3,1.5c0.1,0.4-0.2,0.9-0.6,1
	C12.8,7.4,12.8,7.4,12.7,7.4L12.7,7.4z"/>
<path class="st14" d="M10.3,0.6L9.7,1.9C9.6,2.1,9.4,2.2,9.2,2.2L7.8,2.5c-0.3,0-0.5,0.3-0.5,0.6c0,0.2,0.1,0.3,0.2,0.4l1.1,1
	C8.7,4.6,8.7,4.8,8.7,5L8.4,6.5C8.4,6.8,8.6,7.1,8.9,7.1c0.1,0,0.3,0,0.4-0.1l1.3-0.7c0.2-0.1,0.4-0.1,0.5,0l1.3,0.7
	c0.3,0.1,0.6,0,0.8-0.2c0.1-0.1,0.1-0.2,0.1-0.4L13,5c0-0.2,0-0.4,0.2-0.5l1.1-1.1c0.2-0.2,0.3-0.5,0.1-0.8
	c-0.1-0.1-0.2-0.2-0.4-0.2l-1.5-0.2c-0.2,0-0.4-0.1-0.4-0.3l-0.6-1.4c-0.1-0.3-0.5-0.4-0.7-0.3C10.5,0.4,10.4,0.5,10.3,0.6z"/>
<linearGradient id="SVGID_7_" gradientUnits="userSpaceOnUse" x1="21.27" y1="22.81" x2="21.27" y2="33.6" gradientTransform="matrix(1 0 0 -1 0 33.2)">
	<stop  offset="0" style="stop-color:#000000;stop-opacity:0.39"/>
	<stop  offset="1" style="stop-color:#000000;stop-opacity:0"/>
</linearGradient>
<path class="st15" d="M20.6,0.7l-0.9,1.8c-0.1,0.2-0.3,0.4-0.6,0.4l-2,0.3c-0.4,0.1-0.7,0.4-0.6,0.8c0,0.2,0.1,0.3,0.2,0.5l1.4,1.4
	c0.2,0.2,0.3,0.4,0.2,0.7l-0.3,2C18,9,18.2,9.4,18.6,9.4c0.2,0,0.3,0,0.5-0.1l1.8-0.9c0.2-0.1,0.5-0.1,0.7,0l1.8,0.9
	c0.4,0.2,0.8,0.1,1-0.3c0.1-0.2,0.1-0.3,0.1-0.5l-0.3-2c0-0.2,0-0.5,0.2-0.7l1.5-1.4c0.3-0.3,0.3-0.8,0-1.1
	c-0.1-0.1-0.3-0.2-0.5-0.2l-2-0.3c-0.2,0-0.5-0.2-0.6-0.4l-0.9-1.8c-0.2-0.4-0.6-0.5-1-0.3C20.8,0.4,20.7,0.5,20.6,0.7z"/>
<linearGradient id="SVGID_8_" gradientUnits="userSpaceOnUse" x1="10.845" y1="25.33" x2="10.845" y2="32.93" gradientTransform="matrix(1 0 0 -1 0 33.2)">
	<stop  offset="0" style="stop-color:#000000;stop-opacity:0.39"/>
	<stop  offset="1" style="stop-color:#000000;stop-opacity:0"/>
</linearGradient>
<path class="st16" d="M10.3,0.6L9.7,1.9C9.6,2.1,9.4,2.2,9.2,2.2L7.8,2.5c-0.3,0-0.5,0.3-0.5,0.6c0,0.2,0.1,0.3,0.2,0.4l1.1,1
	C8.7,4.6,8.7,4.8,8.7,5L8.4,6.5C8.4,6.8,8.6,7.1,8.9,7.1c0.1,0,0.3,0,0.4-0.1l1.3-0.7c0.2-0.1,0.4-0.1,0.5,0l1.3,0.7
	c0.3,0.1,0.6,0,0.8-0.2c0.1-0.1,0.1-0.2,0.1-0.4L13,5c0-0.2,0-0.4,0.2-0.5l1.1-1.1c0.2-0.2,0.3-0.5,0.1-0.8
	c-0.1-0.1-0.2-0.2-0.4-0.2l-1.5-0.2c-0.2,0-0.4-0.1-0.4-0.3l-0.6-1.4c-0.1-0.3-0.5-0.4-0.7-0.3C10.5,0.4,10.4,0.5,10.3,0.6z"/>
<path class="st13" d="M5.7,12.6c-0.1,0-0.2,0-0.3-0.1l-1.2-0.6H4.1H4l-1.2,0.6c-0.1,0.1-0.2,0.1-0.3,0.1c-0.4,0-0.8-0.3-0.8-0.7
	c0,0,0-0.1,0-0.1l0.2-1.3c0-0.1,0-0.2-0.1-0.2l-1-0.9c-0.3-0.3-0.3-0.8,0-1.1C0.9,8,1.1,7.9,1.3,7.9l1.3-0.2c0.1,0,0.2-0.1,0.2-0.1
	l0.6-1.2C3.6,6,4,5.9,4.4,6c0.2,0.1,0.3,0.2,0.3,0.3l0.6,1.2c0,0.1,0.1,0.1,0.2,0.1l1.3,0.2c0.4,0,0.7,0.4,0.7,0.8
	c0,0.2-0.1,0.3-0.2,0.4l-1,0.9c-0.1,0.1-0.1,0.1-0.1,0.2l0.2,1.3c0.1,0.4-0.2,0.8-0.6,0.9C5.8,12.6,5.7,12.6,5.7,12.6L5.7,12.6z"/>
<path class="st14" d="M3.6,6.5L3,7.7C2.9,7.9,2.8,8,2.7,8L1.3,8.2C1,8.2,0.9,8.5,0.9,8.8c0,0.1,0,0.2,0.1,0.2l1,1
	c0.1,0.1,0.2,0.3,0.1,0.4l-0.2,1.3c0,0.3,0.1,0.5,0.4,0.6c0.1,0,0.2,0,0.3-0.1l1.2-0.6c0.1-0.1,0.3-0.1,0.5,0l1.2,0.6
	c0.2,0.1,0.5,0,0.7-0.2c0.1-0.1,0.1-0.2,0.1-0.3L6,10.4c0-0.2,0-0.3,0.1-0.4l1-1c0.2-0.2,0.2-0.5,0-0.7C7,8.2,6.9,8.2,6.8,8.1L5.5,8
	C5.3,8,5.2,7.9,5.1,7.7L4.5,6.5C4.4,6.3,4.1,6.2,3.8,6.3C3.7,6.3,3.7,6.4,3.6,6.5z"/>
<linearGradient id="SVGID_9_" gradientUnits="userSpaceOnUse" x1="4.0683" y1="20.21" x2="4.0683" y2="27.72" gradientTransform="matrix(1 0 0 -1 0 33.2)">
	<stop  offset="0" style="stop-color:#000000;stop-opacity:0.39"/>
	<stop  offset="1" style="stop-color:#000000;stop-opacity:0"/>
</linearGradient>
<path class="st17" d="M3.6,6.5L3,7.7C2.9,7.9,2.8,8,2.7,8L1.3,8.2C1,8.2,0.9,8.5,0.9,8.8c0,0.1,0,0.2,0.1,0.2l1,1
	c0.1,0.1,0.2,0.3,0.1,0.4l-0.2,1.3c0,0.3,0.1,0.5,0.4,0.6c0.1,0,0.2,0,0.3-0.1l1.2-0.6c0.1-0.1,0.3-0.1,0.5,0l1.2,0.6
	c0.2,0.1,0.5,0,0.7-0.2c0.1-0.1,0.1-0.2,0.1-0.3L6,10.4c0-0.2,0-0.3,0.1-0.4l1-1c0.2-0.2,0.2-0.5,0-0.7C7,8.2,6.9,8.2,6.8,8.1L5.5,8
	C5.3,8,5.2,7.9,5.1,7.7L4.5,6.5C4.4,6.3,4.1,6.2,3.8,6.3C3.7,6.3,3.7,6.4,3.6,6.5z"/>
<path class="st13" d="M4.6,20.7c-0.1,0-0.2,0-0.3-0.1l-0.9-0.5H3.3H3.2l-0.9,0.5c-0.1,0-0.2,0.1-0.3,0.1c-0.4,0-0.6-0.3-0.6-0.6
	c0,0,0-0.1,0-0.1l0.2-1c0,0,0-0.1,0-0.1l-0.8-0.7c-0.3-0.2-0.3-0.6-0.1-0.9C0.8,17.1,0.9,17,1.1,17l1-0.1c0,0,0.1,0,0.1-0.1l0.5-0.9
	c0.2-0.3,0.5-0.4,0.9-0.3c0.1,0.1,0.2,0.2,0.3,0.3l0.5,0.9c0,0,0.1,0.1,0.1,0.1l1,0.1c0.4,0,0.6,0.4,0.6,0.7c0,0.1-0.1,0.3-0.2,0.4
	L5,18.8c0,0,0,0.1,0,0.1l0.2,1C5.2,20.3,5,20.6,4.6,20.7C4.6,20.7,4.6,20.7,4.6,20.7L4.6,20.7z"/>
<path class="st14" d="M2.9,15.9l-0.5,0.9c-0.1,0.1-0.2,0.2-0.3,0.2l-1,0.1c-0.2,0-0.4,0.2-0.3,0.4c0,0.1,0.1,0.2,0.1,0.2l0.8,0.7
	c0.1,0.1,0.1,0.2,0.1,0.4l-0.2,1c0,0.2,0.1,0.4,0.3,0.5c0.1,0,0.2,0,0.3,0l0.9-0.5c0.1-0.1,0.2-0.1,0.4,0l0.9,0.5
	c0.2,0.1,0.4,0,0.5-0.2c0-0.1,0-0.1,0-0.2l-0.2-1c0-0.1,0-0.3,0.1-0.4l0.8-0.7c0.2-0.1,0.2-0.4,0-0.6c-0.1-0.1-0.1-0.1-0.2-0.1
	l-1-0.1c-0.1,0-0.2-0.1-0.3-0.2l-0.5-0.9c0-0.2-0.2-0.4-0.5-0.3C3.1,15.7,3,15.8,2.9,15.9z"/>
<linearGradient id="SVGID_10_" gradientUnits="userSpaceOnUse" x1="3.32" y1="12.36" x2="3.32" y2="17.95" gradientTransform="matrix(1 0 0 -1 0 33.2)">
	<stop  offset="0" style="stop-color:#000000;stop-opacity:0.39"/>
	<stop  offset="1" style="stop-color:#000000;stop-opacity:0"/>
</linearGradient>
<path class="st18" d="M2.9,15.9l-0.5,0.9c-0.1,0.1-0.2,0.2-0.3,0.2l-1,0.1c-0.2,0-0.4,0.2-0.3,0.4c0,0.1,0.1,0.2,0.1,0.2l0.8,0.7
	c0.1,0.1,0.1,0.2,0.1,0.4l-0.2,1c0,0.2,0.1,0.4,0.3,0.5c0.1,0,0.2,0,0.3,0l0.9-0.5c0.1-0.1,0.2-0.1,0.4,0l0.9,0.5
	c0.2,0.1,0.4,0,0.5-0.2c0-0.1,0-0.1,0-0.2l-0.2-1c0-0.1,0-0.3,0.1-0.4l0.8-0.7c0.2-0.1,0.2-0.4,0-0.6c-0.1-0.1-0.1-0.1-0.2-0.1
	l-1-0.1c-0.1,0-0.2-0.1-0.3-0.2l-0.5-0.9c0-0.2-0.2-0.4-0.5-0.3C3.1,15.7,3,15.8,2.9,15.9z"/>
<path class="st13" d="M5.7,26.9c-0.1,0-0.2,0-0.2-0.1l-0.6-0.3l-0.7,0.3c-0.1,0-0.2,0.1-0.2,0.1c-0.3,0-0.5-0.2-0.5-0.5
	c0,0,0-0.1,0-0.1l0.1-0.7L3,25.1c-0.2-0.2-0.2-0.5,0-0.7c0.1-0.1,0.2-0.1,0.3-0.2L4,24.1l0.3-0.7c0.1-0.3,0.4-0.4,0.7-0.2
	c0.1,0.1,0.2,0.1,0.2,0.2l0.3,0.6l0.7,0.1c0.3,0,0.5,0.3,0.4,0.6c0,0.1-0.1,0.2-0.2,0.3l-0.5,0.5l0.1,0.7c0,0.3-0.1,0.6-0.4,0.6
	C5.7,26.9,5.7,26.9,5.7,26.9L5.7,26.9z"/>
<path class="st14" d="M4.5,23.6l-0.3,0.6c0,0.1-0.1,0.1-0.2,0.1l-0.7,0.1c-0.1,0-0.2,0.2-0.2,0.3c0,0.1,0,0.1,0.1,0.2l0.5,0.5
	c0.1,0.1,0.1,0.2,0.1,0.2l-0.1,0.7c0,0.1,0.1,0.3,0.2,0.3c0.1,0,0.1,0,0.2,0l0.6-0.3c0.1,0,0.2,0,0.2,0l0.6,0.3
	c0.1,0.1,0.3,0,0.4-0.1c0-0.1,0-0.1,0-0.2l-0.1-0.7c0-0.1,0-0.2,0.1-0.2l0.5-0.5c0.1-0.1,0.1-0.3,0-0.4c0,0-0.1-0.1-0.2-0.1
	l-0.7-0.1c-0.1,0-0.2-0.1-0.2-0.1L5,23.6c-0.1-0.1-0.2-0.2-0.4-0.1C4.6,23.5,4.5,23.5,4.5,23.6z"/>
<linearGradient id="SVGID_11_" gradientUnits="userSpaceOnUse" x1="4.775" y1="6.19" x2="4.775" y2="10.06" gradientTransform="matrix(1 0 0 -1 0 33.2)">
	<stop  offset="0" style="stop-color:#000000;stop-opacity:0.39"/>
	<stop  offset="1" style="stop-color:#000000;stop-opacity:0"/>
</linearGradient>
<path class="st19" d="M4.5,23.6l-0.3,0.6c0,0.1-0.1,0.1-0.2,0.1l-0.7,0.1c-0.1,0-0.2,0.2-0.2,0.3c0,0.1,0,0.1,0.1,0.2l0.5,0.5
	c0.1,0.1,0.1,0.2,0.1,0.2l-0.1,0.7c0,0.1,0.1,0.3,0.2,0.3c0.1,0,0.1,0,0.2,0l0.6-0.3c0.1,0,0.2,0,0.2,0l0.6,0.3
	c0.1,0.1,0.3,0,0.4-0.1c0-0.1,0-0.1,0-0.2l-0.1-0.7c0-0.1,0-0.2,0.1-0.2l0.5-0.5c0.1-0.1,0.1-0.3,0-0.4c0,0-0.1-0.1-0.2-0.1
	l-0.7-0.1c-0.1,0-0.2-0.1-0.2-0.1L5,23.6c-0.1-0.1-0.2-0.2-0.4-0.1C4.6,23.5,4.5,23.5,4.5,23.6z"/>
<path class="st13" d="M8.9,30.2c-0.1,0-0.2,0-0.2-0.1l-0.6-0.3l-0.5,0.3c-0.1,0-0.1,0.1-0.2,0.1c-0.3,0-0.5-0.2-0.5-0.5
	c0,0,0-0.1,0-0.1L7,29l-0.4-0.4c-0.2-0.2-0.2-0.5,0-0.7c0.1-0.1,0.2-0.1,0.3-0.1l0.6-0.1l0.3-0.5c0.1-0.2,0.4-0.3,0.6-0.2
	c0.1,0,0.2,0.1,0.2,0.2l0.3,0.6l0.6,0.1c0.3,0,0.4,0.3,0.4,0.5c0,0.1-0.1,0.2-0.1,0.3L9.3,29l0.1,0.6C9.4,29.9,9.2,30.1,8.9,30.2
	C8.9,30.2,8.9,30.2,8.9,30.2L8.9,30.2z"/>
<path class="st14" d="M7.9,27.3l-0.3,0.6c0,0.1-0.1,0.1-0.2,0.1l-0.6,0.1c-0.1,0-0.2,0.1-0.2,0.3c0,0,0,0.1,0.1,0.1l0.4,0.4
	c0.1,0.1,0.1,0.1,0.1,0.2l-0.1,0.6c0,0.1,0.1,0.2,0.2,0.3c0,0,0.1,0,0.1,0L8,29.6c0.1,0,0.1,0,0.2,0l0.6,0.3C8.9,30,9,30,9.1,29.8
	c0,0,0-0.1,0-0.1L9,29.1c0-0.1,0-0.1,0.1-0.2l0.4-0.4c0.1-0.1,0.1-0.2,0-0.3c0,0-0.1-0.1-0.1-0.1L8.8,28c-0.1,0-0.1-0.1-0.2-0.1
	l-0.3-0.6c0-0.1-0.2-0.2-0.3-0.1C8,27.2,7.9,27.2,7.9,27.3z"/>
<linearGradient id="SVGID_12_" gradientUnits="userSpaceOnUse" x1="8.12" y1="3.05" x2="8.12" y2="6.21" gradientTransform="matrix(1 0 0 -1 0 33.2)">
	<stop  offset="0" style="stop-color:#000000;stop-opacity:0.39"/>
	<stop  offset="1" style="stop-color:#000000;stop-opacity:0"/>
</linearGradient>
<path class="st20" d="M7.9,27.3l-0.3,0.6c0,0.1-0.1,0.1-0.2,0.1l-0.6,0.1c-0.1,0-0.2,0.1-0.2,0.3c0,0,0,0.1,0.1,0.1l0.4,0.4
	c0.1,0.1,0.1,0.1,0.1,0.2l-0.1,0.6c0,0.1,0.1,0.2,0.2,0.3c0,0,0.1,0,0.1,0L8,29.6c0.1,0,0.1,0,0.2,0l0.6,0.3C8.9,30,9,30,9.1,29.8
	c0,0,0-0.1,0-0.1L9,29.1c0-0.1,0-0.1,0.1-0.2l0.4-0.4c0.1-0.1,0.1-0.2,0-0.3c0,0-0.1-0.1-0.1-0.1L8.8,28c-0.1,0-0.1-0.1-0.2-0.1
	l-0.3-0.6c0-0.1-0.2-0.2-0.3-0.1C8,27.2,7.9,27.2,7.9,27.3z"/>
<linearGradient id="SVGID_13_" gradientUnits="userSpaceOnUse" x1="-618.3893" y1="4.7808" x2="-622.9993" y2="8.9508" gradientTransform="matrix(-1 0 0 -1 -595 33.2)">
	<stop  offset="0" style="stop-color:#363838"/>
	<stop  offset="2.000000e-02" style="stop-color:#2E3030"/>
	<stop  offset="8.000000e-02" style="stop-color:#1A1B1B"/>
	<stop  offset="0.14" style="stop-color:#0B0C0C"/>
	<stop  offset="0.22" style="stop-color:#030303"/>
	<stop  offset="0.34" style="stop-color:#000000"/>
	<stop  offset="0.74" style="stop-color:#242525"/>
	<stop  offset="1" style="stop-color:#363838"/>
</linearGradient>
<polygon class="st21" points="18.8,22.9 26.3,31 31.2,31 31.2,28.7 22.6,19.4 "/>
<linearGradient id="SVGID_14_" gradientUnits="userSpaceOnUse" x1="-471.1375" y1="404.2763" x2="-471.1375" y2="409.0863" gradientTransform="matrix(-0.68 -0.73 0.73 -0.68 -600.016 -49.354)">
	<stop  offset="0" style="stop-color:#F3F1F0"/>
	<stop  offset="0.51" style="stop-color:#BDBFBF"/>
	<stop  offset="0.52" style="stop-color:#C1C3C2"/>
	<stop  offset="0.62" style="stop-color:#D7D7D7"/>
	<stop  offset="0.72" style="stop-color:#E7E6E5"/>
	<stop  offset="0.84" style="stop-color:#F0EEED"/>
	<stop  offset="1" style="stop-color:#F3F1F0"/>
</linearGradient>
<polygon class="st22" points="12.8,15.8 19,22.8 22.5,19.6 15.9,12.8 "/>
<path class="st5" d="M17.2,4.2l2-0.3c0.2,0,0.5-0.2,0.6-0.4l0.9-1.8c0.2-0.4,0.6-0.5,1-0.3c0.2,0.1,0.3,0.2,0.3,0.3l0.9,1.8
	c0.1,0.2,0.3,0.4,0.6,0.4l2,0.3c0.2,0,0.3,0.1,0.4,0.2c0.2-0.3,0.2-0.8-0.2-1c-0.1-0.1-0.2-0.1-0.3-0.1l-2-0.3
	c-0.2,0-0.5-0.2-0.6-0.4l-0.9-1.8c-0.2-0.4-0.6-0.5-1-0.3c-0.2,0.1-0.3,0.2-0.3,0.3l-0.9,1.8c-0.1,0.2-0.3,0.4-0.6,0.4l-2,0.3
	c-0.4,0.1-0.7,0.4-0.6,0.8c0,0.2,0.1,0.3,0.2,0.4C16.8,4.3,17,4.2,17.2,4.2z"/>
<path class="st4" d="M18.1,5.9l-1.4-1.4l0,0c-0.2,0.3-0.2,0.7,0.1,1l1.5,1.4L18.3,7l0.1-0.4C18.4,6.4,18.3,6.1,18.1,5.9z"/>
<path class="st4" d="M23.4,9.4l-1.8-0.9c-0.2-0.1-0.5-0.1-0.7,0l-1.8,0.9c-0.3,0.2-0.8,0.1-1-0.2l-0.1,0.4c-0.1,0.4,0.2,0.8,0.6,0.9
	c0.2,0,0.3,0,0.5-0.1L21,9.4c0.2-0.1,0.5-0.1,0.7,0l1.8,0.9c0.4,0.2,0.8,0.1,1-0.3c0.1-0.2,0.1-0.3,0.1-0.5l-0.1-0.6
	c-0.1,0.4-0.5,0.6-0.9,0.5C23.5,9.4,23.5,9.4,23.4,9.4z"/>
<path class="st4" d="M25.9,5.4c0.3-0.3,0.3-0.8,0-1.1c0,0,0,0,0,0c0,0-0.1,0.1-0.1,0.1l-1.5,1.4c-0.2,0.2-0.3,0.4-0.2,0.7l0.1,0.6
	c0-0.1,0.1-0.2,0.2-0.3L25.9,5.4z"/>
<path class="st5" d="M9.3,3.2c0.2,0,0.3-0.1,0.4-0.3l0.7-1.4c0.1-0.3,0.5-0.4,0.8-0.2c0.1,0.1,0.2,0.1,0.2,0.2l0.7,1.4
	c0.1,0.2,0.2,0.3,0.4,0.3L14,3.4c0.1,0,0.1,0,0.2,0.1l0.1-0.1c0.2-0.2,0.3-0.5,0.1-0.8c-0.1-0.1-0.2-0.2-0.4-0.2l-1.5-0.2
	c-0.2,0-0.3-0.1-0.4-0.3l-0.6-1.4c-0.1-0.3-0.5-0.4-0.8-0.2c-0.1,0.1-0.2,0.1-0.2,0.2L9.7,1.9C9.6,2.1,9.4,2.2,9.2,2.2L7.8,2.5
	c-0.3,0-0.5,0.3-0.5,0.6c0,0.2,0.1,0.3,0.2,0.4l0.1,0.1c0.1-0.1,0.2-0.1,0.3-0.1L9.3,3.2z"/>
<path class="st4" d="M8.5,4.5l-1-0.9c-0.2,0.2-0.3,0.6,0,0.8c0,0,0,0,0,0l1.1,1.1l0,0L8.7,5C8.7,4.8,8.7,4.6,8.5,4.5z"/>
<path class="st4" d="M14.3,4.4c0.2-0.2,0.2-0.6,0-0.8c0,0-0.1-0.1-0.1-0.1l-1,1C13,4.6,13,4.8,13,5l0.1,0.7c0-0.1,0.1-0.1,0.1-0.2
	L14.3,4.4z"/>
<path class="st4" d="M12.4,7.1l-1.3-0.7c-0.2-0.1-0.4-0.1-0.5,0L9.2,7.1C9,7.2,8.8,7.2,8.6,7L8.5,7.5C8.5,7.8,8.7,8,9,8.1
	c0.1,0,0.2,0,0.3-0.1l1.3-0.7c0.2-0.1,0.4-0.1,0.5,0L12.5,8c0.3,0.1,0.6,0,0.8-0.2c0.1-0.1,0.1-0.2,0.1-0.4l-0.1-0.7
	C13.1,7.1,12.8,7.2,12.4,7.1C12.5,7.1,12.5,7.1,12.4,7.1z"/>
<path class="st5" d="M2.7,8.9c0.2,0,0.3-0.1,0.4-0.3l0.6-1.2c0.1-0.2,0.4-0.4,0.7-0.2c0.1,0,0.2,0.1,0.2,0.2l0.6,1.2
	c0.1,0.1,0.2,0.2,0.4,0.3l1.3,0.2H7L7.1,9c0.2-0.2,0.2-0.5,0-0.7C7,8.2,6.9,8.2,6.8,8.1L5.5,8C5.3,8,5.2,7.9,5.1,7.7L4.5,6.5
	C4.4,6.3,4.1,6.2,3.8,6.3c-0.1,0-0.2,0.1-0.2,0.2L3,7.7C2.9,7.9,2.8,8,2.7,8L1.3,8.2C1,8.2,0.9,8.5,0.9,8.8c0,0.1,0,0.2,0.1,0.2
	l0.2,0.2c0.1,0,0.1-0.1,0.2-0.1L2.7,8.9z"/>
<path class="st4" d="M2,10L1.2,9.2C1,9.4,0.9,9.7,1,9.9C1,10,1.1,10,1.1,10l0.9,0.9l0.1-0.5C2.2,10.3,2.1,10.1,2,10z"/>
<path class="st4" d="M5.5,12.3l-1.2-0.6c-0.1-0.1-0.3-0.1-0.5,0l-1.2,0.6c-0.2,0.1-0.4,0.1-0.6-0.1L2,12.7c0,0.3,0.1,0.5,0.4,0.6
	c0.1,0,0.2,0,0.3-0.1l1.2-0.6c0.1-0.1,0.3-0.1,0.5,0l1.2,0.6c0.2,0.1,0.5,0,0.7-0.2c0.1-0.1,0.1-0.2,0.1-0.3L6.2,12
	C6.1,12.3,5.8,12.4,5.5,12.3C5.5,12.3,5.5,12.3,5.5,12.3z"/>
<path class="st4" d="M7.2,10c0.2-0.2,0.2-0.5,0-0.7C7.2,9.2,7.1,9.2,7,9.1L6.1,10C6,10.1,6,10.3,6,10.4l0.1,0.7
	c0-0.1,0.1-0.1,0.1-0.1L7.2,10z"/>
<path class="st5" d="M2.5,17.8L3,16.9c0.1-0.2,0.3-0.3,0.5-0.2c0.1,0,0.1,0.1,0.2,0.2l0.5,0.9C4.2,17.9,4.3,18,4.5,18l0.9,0.1
	l0.3-0.3c0.2-0.1,0.2-0.4,0-0.6c-0.1-0.1-0.1-0.1-0.2-0.1l-1-0.1c-0.1,0-0.2-0.1-0.3-0.2l-0.5-0.9c-0.1-0.2-0.3-0.3-0.5-0.2
	c-0.1,0-0.1,0.1-0.2,0.2l-0.5,0.9C2.4,17,2.3,17,2.2,17.1l-1,0.1c-0.2,0-0.4,0.2-0.3,0.4c0,0.1,0.1,0.2,0.1,0.2l0.3,0.3l1-0.1
	C2.4,18,2.5,17.9,2.5,17.8z"/>
<path class="st4" d="M1.7,18.6l-0.4-0.4l0,0c-0.2,0-0.4,0.2-0.3,0.4c0,0.1,0.1,0.2,0.1,0.2l0.7,0.7L1.8,19
	C1.8,18.9,1.8,18.7,1.7,18.6z"/>
<path class="st4" d="M4.4,20.4l-0.9-0.5c-0.1-0.1-0.2-0.1-0.4,0l-0.9,0.5c-0.1,0.1-0.3,0.1-0.4,0L1.7,21c0,0.2,0.1,0.4,0.3,0.5
	c0.1,0,0.2,0,0.3,0l0.9-0.5c0.1-0.1,0.2-0.1,0.4,0l0.9,0.5c0.2,0.1,0.4,0,0.5-0.2c0-0.1,0-0.1,0-0.2l-0.1-0.7
	C4.8,20.4,4.6,20.5,4.4,20.4z"/>
<path class="st4" d="M5.7,18.8c0.2-0.1,0.2-0.4,0-0.6c-0.1-0.1-0.1-0.1-0.2-0.1H5.4l-0.5,0.5c-0.1,0.1-0.1,0.2-0.1,0.4l0.1,0.7
	c0,0,0-0.1,0.1-0.1L5.7,18.8z"/>
<path class="st5" d="M4.3,25.2l0.3-0.6c0.1-0.1,0.2-0.2,0.4-0.1c0,0,0.1,0.1,0.1,0.1l0.3,0.6c0,0.1,0.1,0.1,0.2,0.1h0.3l0.5-0.5
	c0.1-0.1,0.1-0.3,0-0.4c0,0-0.1-0.1-0.2-0.1l-0.7-0.1c-0.1,0-0.2-0.1-0.2-0.1L5,23.6c-0.1-0.1-0.2-0.2-0.4-0.1c0,0-0.1,0.1-0.1,0.1
	l-0.3,0.6c0,0.1-0.1,0.1-0.2,0.1l-0.7,0.1c-0.1,0-0.2,0.2-0.2,0.3c0,0.1,0,0.1,0.1,0.2l0.5,0.5l0.5-0.1C4.2,25.3,4.2,25.3,4.3,25.2z
	"/>
<path class="st4" d="M5.8,25.7l0.1,0.7c0,0,0,0.1,0,0.1c0,0,0,0,0-0.1l0.5-0.5c0.1-0.1,0.1-0.3,0-0.4c0,0-0.1-0.1-0.2-0.1l-0.4-0.1
	l-0.1,0.1C5.8,25.5,5.8,25.6,5.8,25.7z"/>
<path class="st4" d="M5.5,26.7l-0.6-0.3c-0.1,0-0.2,0-0.2,0L4,26.7c-0.1,0-0.1,0-0.2,0l-0.1,0.7c0,0.1,0.1,0.3,0.2,0.3
	c0.1,0,0.1,0,0.2,0l0.6-0.3c0.1,0,0.2,0,0.2,0l0.6,0.3c0.1,0.1,0.3,0,0.4-0.1c0,0,0-0.1,0-0.2l-0.1-0.7c0,0,0,0,0-0.1
	C5.8,26.7,5.7,26.7,5.5,26.7z"/>
<path class="st4" d="M3.7,25.4L3.7,25.4H3.4c-0.1,0-0.2,0.2-0.2,0.3c0,0.1,0,0.1,0.1,0.2l0.4,0.4l0.1-0.6
	C3.8,25.6,3.7,25.5,3.7,25.4z"/>
<path class="st5" d="M7.7,28.8L8,28.2c0.1-0.1,0.2-0.2,0.3-0.1c0,0,0.1,0.1,0.1,0.1l0.3,0.6c0,0.1,0.1,0.1,0.2,0.1L9,29
	c0,0,0,0,0-0.1l0.4-0.4c0.1-0.1,0.1-0.2,0-0.3c0,0-0.1-0.1-0.1-0.1L8.8,28c-0.1,0-0.1-0.1-0.2-0.1l-0.3-0.6
	c-0.1-0.1-0.2-0.2-0.3-0.1c0,0-0.1,0.1-0.1,0.1l-0.3,0.6c0,0.1-0.1,0.1-0.2,0.1l-0.6,0.1c-0.1,0-0.2,0.1-0.2,0.3c0,0,0,0.1,0.1,0.1
	l0.4,0.4c0,0,0,0.1,0.1,0.1h0.3C7.6,29,7.7,28.9,7.7,28.8z"/>
<path class="st4" d="M9.6,29.4c0.1-0.1,0.1-0.2,0-0.3c0,0-0.1-0.1-0.2-0.1H9c0,0,0,0.1,0,0.1l0.1,0.6C9.1,29.9,9,30,8.9,30
	c0,0-0.1,0-0.1,0l-0.6-0.3c-0.1,0-0.1,0-0.2,0L7.5,30c-0.1,0-0.1,0-0.2,0c0,0,0,0.1,0,0.1l-0.1,0.6c0,0.1,0.1,0.2,0.2,0.3
	c0,0,0.1,0,0.1,0l0.5-0.3c0.1,0,0.1,0,0.2,0l0.6,0.3c0.1,0.1,0.3,0,0.3-0.1c0,0,0-0.1,0-0.1L9.1,30c0-0.1,0-0.1,0.1-0.2L9.6,29.4z"
	/>
<path class="st4" d="M7.2,29.1c0,0,0-0.1,0-0.1H6.9c-0.1,0-0.2,0.1-0.2,0.3c0,0,0,0.1,0.1,0.1l0.3,0.3l0,0L7.2,29.1z"/>
<polygon class="st5" points="31.2,29.6 31.2,28.7 22.6,19.4 18.8,22.9 19.3,23.5 22.7,20.4 "/>
<polygon class="st4" points="31.2,29.6 31.2,31 26.3,31 19.3,23.5 18.9,23.9 26.4,32 31.3,32 31.3,29.7 "/>
<polygon class="st5" points="22,20 22.5,19.6 15.9,12.8 12.8,15.8 13.3,16.3 16,13.8 "/>
<polygon class="st4" points="22,20 19,22.8 13.3,16.3 12.9,16.7 19,23.8 22.6,20.5 "/>
</svg>
