<?xml version="1.0" encoding="utf-8"?>
<!-- Generator: Adobe Illustrator 21.0.0, SVG Export Plug-In . SVG Version: 6.00 Build 0)  -->
<svg version="1.1" id="katman_1" xmlns="http://www.w3.org/2000/svg" xmlns:xlink="http://www.w3.org/1999/xlink" x="0px" y="0px"
	 viewBox="0 0 48 48" style="enable-background:new 0 0 48 48;" xml:space="preserve">
<style type="text/css">
	.st0{fill:#66040C;}
	.st1{opacity:0.2;enable-background:new    ;}
	.st2{fill:url(#SVGID_1_);}
	.st3{fill:url(#SVGID_2_);}
	.st4{fill:url(#SVGID_3_);}
	.st5{fill:url(#SVGID_4_);}
	.st6{fill:url(#SVGID_5_);}
	.st7{opacity:0.1;fill:#FFFFFF;enable-background:new    ;}
</style>
<title>user-home_1</title>
<path class="st0" d="M5.1,44.4V34.3L0,40.8l2.1-14l5.3-5.9v-7.8c0-0.6,0.5-1.1,1.1-1.1h4c0.6,0,1.1,0.5,1.1,1.1V14L24,2.4l21.9,24.3
	l2.1,14l-5.2-6.6v10.1H5.1V44.4z"/>
<rect x="5.5" y="44" class="st1" width="37" height="1.5"/>
<linearGradient id="SVGID_1_" gradientUnits="userSpaceOnUse" x1="23.962" y1="128.0444" x2="23.962" y2="93.5087" gradientTransform="matrix(1 0 0 1 0 -84)">
	<stop  offset="0" style="stop-color:#A3A4A4"/>
	<stop  offset="0.12" style="stop-color:#BBBBBB"/>
	<stop  offset="0.27" style="stop-color:#CFCECE"/>
	<stop  offset="0.43" style="stop-color:#DDDCDC"/>
	<stop  offset="0.64" style="stop-color:#E5E4E4"/>
	<stop  offset="1" style="stop-color:#E7E6E6"/>
</linearGradient>
<polygon class="st2" points="24,9.5 5.5,32 5.5,44 42.4,44 42.4,32 "/>
<polygon class="st1" points="24,9.5 0.8,39.1 0.6,41 24,11 47.4,41 47.1,39.1 "/>
<linearGradient id="SVGID_2_" gradientUnits="userSpaceOnUse" x1="10.4216" y1="105.0409" x2="10.4216" y2="96.1483" gradientTransform="matrix(1 0 0 1 0 -84)">
	<stop  offset="1.000000e-02" style="stop-color:#931D27"/>
	<stop  offset="0.75" style="stop-color:#CC2A31"/>
</linearGradient>
<path class="st3" d="M8.4,12.4h4c0.4,0,0.7,0.3,0.7,0.7l0,0v8.1l0,0H7.7l0,0v-8.1C7.8,12.8,8.1,12.4,8.4,12.4L8.4,12.4z"/>
<linearGradient id="SVGID_3_" gradientUnits="userSpaceOnUse" x1="24" y1="118.0412" x2="24" y2="88.762" gradientTransform="matrix(1 0 0 1 0 -84)">
	<stop  offset="1.000000e-02" style="stop-color:#931D27"/>
	<stop  offset="0.75" style="stop-color:#CC2A31"/>
</linearGradient>
<polygon class="st4" points="47.4,39.5 45.5,27 24,3 2.4,27 0.6,39.5 24,9.5 "/>
<linearGradient id="SVGID_4_" gradientUnits="userSpaceOnUse" x1="23.962" y1="128.1357" x2="23.962" y2="111.4383" gradientTransform="matrix(1 0 0 1 0 -84)">
	<stop  offset="0" style="stop-color:#793D1A"/>
	<stop  offset="0.41" style="stop-color:#A05521"/>
	<stop  offset="0.79" style="stop-color:#BE6726"/>
	<stop  offset="1" style="stop-color:#C96E28"/>
</linearGradient>
<path class="st5" d="M29.5,44.1V33c0-3-2.5-5.6-5.6-5.6l0,0c-3,0-5.6,2.5-5.6,5.6l0,0v11.2L29.5,44.1L29.5,44.1z"/>
<linearGradient id="SVGID_5_" gradientUnits="userSpaceOnUse" x1="24" y1="127.8922" x2="24" y2="112.1458" gradientTransform="matrix(1 0 0 1 0 -84)">
	<stop  offset="0" style="stop-color:#C96E28;stop-opacity:0.6"/>
	<stop  offset="1" style="stop-color:#793D1A;stop-opacity:0.8"/>
</linearGradient>
<path class="st6" d="M28.8,43.9h-9.7v-11c0-2.7,2.1-4.8,4.9-4.8c2.7,0,4.8,2.1,4.8,4.8V43.9z M19.7,43.3h8.5V32.9
	c0-2.4-1.9-4.3-4.3-4.3s-4.3,1.9-4.3,4.3C19.7,32.9,19.7,43.3,19.7,43.3z"/>
<path class="st7" d="M12.5,12.4h-4c-0.4,0-0.7,0.3-0.7,0.7l0,0v1.5c0-0.4,0.3-0.7,0.7-0.7l0,0h4c0.4,0,0.7,0.3,0.7,0.7l0,0v-1.5
	C13.2,12.8,12.9,12.4,12.5,12.4z"/>
<polygon class="st7" points="24,4.6 45.5,28.5 47.1,39.1 47.4,39.5 45.5,27 24,3 2.4,27 0.6,39.5 0.8,39.1 2.4,28.5 "/>
</svg>
