<?xml version="1.0" encoding="utf-8"?>
<!-- Generator: Adobe Illustrator 21.0.0, SVG Export Plug-In . SVG Version: 6.00 Build 0)  -->
<svg version="1.1" id="katman_1" xmlns="http://www.w3.org/2000/svg" xmlns:xlink="http://www.w3.org/1999/xlink" x="0px" y="0px"
	 viewBox="0 0 63 64" style="enable-background:new 0 0 63 64;" xml:space="preserve">
<style type="text/css">
	.st0{opacity:0.2;fill:#010101;enable-background:new    ;}
	.st1{fill:#7A3E1C;}
	.st2{fill:url(#SVGID_1_);}
	.st3{fill:url(#SVGID_2_);}
	.st4{fill:#FFFFFF;}
	.st5{opacity:0.7;fill:#414042;enable-background:new    ;}
	.st6{fill:none;}
	.st7{fill:#58595B;}
	.st8{opacity:0.1;fill:#FFFFFF;enable-background:new    ;}
	.st9{fill:url(#SVGID_3_);}
</style>
<title>applications-office</title>
<path class="st0" d="M60.9,59.1H24.8c-1.2,0-2.1-1-2.1-2.1l0,0v2c0,1.2,1,2.1,2.1,2.1h0h36.1c1.2,0,2.1-1,2.1-2.1l0,0v-2
	C63,58.2,62.1,59.1,60.9,59.1L60.9,59.1z"/>
<path class="st0" d="M36.1,62H1.2v2h34.9c0.6,0,1.1-0.5,1.1-1.1v-2C37.2,61.5,36.7,62,36.1,62z"/>
<path class="st1" d="M41.7,0H8.1v10H7.8v14.3H7.7v33.8h34c1.2,0,2.1-0.9,2.1-2.1c0,0,0,0,0,0V2.2C43.9,1,42.9,0,41.7,0
	C41.7,0,41.7,0,41.7,0z"/>
<linearGradient id="SVGID_1_" gradientUnits="userSpaceOnUse" x1="8.31" y1="36.92" x2="34.92" y2="36.92" gradientTransform="matrix(1 0 0 -1 0 66)">
	<stop  offset="0" style="stop-color:#7A3E1C"/>
	<stop  offset="1" style="stop-color:#C96F29"/>
</linearGradient>
<path class="st2" d="M41.7,57.6H8.2l0,0V0.5l0,0h33.6c0.9,0,1.6,0.7,1.6,1.6c0,0,0,0,0,0.1V56C43.3,56.9,42.6,57.6,41.7,57.6
	C41.7,57.6,41.7,57.6,41.7,57.6z"/>
<polygon class="st1" points="8.1,0 0,4.6 0,5.4 8.7,5.4 8.7,0 "/>
<linearGradient id="SVGID_2_" gradientUnits="userSpaceOnUse" x1="10.35" y1="63.27" x2="2.7" y2="63.27" gradientTransform="matrix(1 0 0 -1 0 66)">
	<stop  offset="0" style="stop-color:#7A3E1C"/>
	<stop  offset="1" style="stop-color:#C96F29"/>
</linearGradient>
<polygon class="st3" points="0.5,4.9 8.2,4.9 8.2,0.5 "/>
<path class="st4" d="M36.4,17.8v0.5c0-0.1,0-0.2-0.1-0.3l-1.9-3.2l0.2-0.3l1.7,2.9C36.4,17.5,36.4,17.6,36.4,17.8z"/>
<polygon class="st4" points="36.5,24.7 36.5,25.2 36.4,25.1 36.4,24.6 "/>
<path class="st5" d="M62.9,6.2V57c0,1.5-1.2,2.7-2.7,2.7H24.1c-1.5,0-2.7-1.2-2.7-2.7V6.2c0-1.5,1.2-2.7,2.7-2.7h36.1
	C61.7,3.6,62.9,4.8,62.9,6.2z"/>
<path class="st4" d="M24.1,4.1h36.1c1.2,0,2.2,1,2.2,2.2V57c0,1.2-1,2.2-2.2,2.2H24.1c-1.2,0-2.1-1-2.1-2.2V6.2
	C21.9,5.1,22.9,4.1,24.1,4.1z"/>
<line class="st6" x1="28.5" y1="50.2" x2="55.8" y2="50.2"/>
<rect x="28.5" y="49.6" class="st7" width="27.3" height="1.1"/>
<line class="st6" x1="28.5" y1="42.8" x2="55.8" y2="42.8"/>
<rect x="28.5" y="42.2" class="st7" width="27.3" height="1.1"/>
<line class="st6" x1="28.5" y1="35.4" x2="55.8" y2="35.4"/>
<rect x="28.5" y="34.8" class="st7" width="27.3" height="1.1"/>
<line class="st6" x1="28.5" y1="28" x2="55.8" y2="28"/>
<rect x="28.5" y="27.5" class="st7" width="27.3" height="1.1"/>
<line class="st6" x1="28.5" y1="20.6" x2="55.8" y2="20.6"/>
<rect x="28.5" y="20" class="st7" width="27.3" height="1.1"/>
<line class="st6" x1="28.5" y1="13.2" x2="55.8" y2="13.2"/>
<rect x="28.5" y="12.7" class="st7" width="27.3" height="1.1"/>
<polygon class="st4" points="36.4,24.7 36.4,25.2 36.3,25.1 36.3,24.6 "/>
<path class="st8" d="M41.7,0.5H8.1v2h33.6c0.9,0,1.6,0.7,1.6,1.6v-2C43.3,1.2,42.6,0.5,41.7,0.5z"/>
<polygon class="st8" points="0.4,4.9 3.9,4.9 8.1,2.5 8.1,0.5 "/>
<path class="st8" d="M60.2,4.1H24c-1.2,0-2.1,1-2.1,2.1c0,0,0,0,0,0v2c0-1.2,0.9-2.1,2.1-2.1c0,0,0,0,0,0h36.2c1.2,0,2.1,1,2.1,2.1
	v-2C62.3,5,61.3,4.1,60.2,4.1z"/>
<path class="st8" d="M36.2,19.4c0.1,0.1,0.1,0.2,0.1,0.3v-2c0-0.1,0-0.2-0.1-0.3L35,15.3l-0.6,0.9L36.2,19.4z"/>
<path class="st8" d="M36.2,11c-0.3,0.7-0.7,1.4-1.1,2l-0.8,1.2l0.6,1l0.2-0.3c0.7-1,1.5-2.9,1.4-3.4C36.4,11.4,36.3,11.2,36.2,11z"
	/>
<path class="st1" d="M0,62.5V4.4h25.2l1.3,2.2c0.2,0.3,0.4,0.6,0.6,0.8l0.2,0.3l0,0l2.6-1.2c1-0.5,2-0.8,3.1-1l0,0
	c0.9,0,2.5,1.4,2.8,1.9C36.3,8,36.7,8.7,37,9.5c0.3,0.9-1,3.2-1.4,3.8L35,14.2l1.8,2.9c0.1,0.2,0.2,0.4,0.2,0.6v6.7l0.1,0.1v36.4
	c0,0.9-0.7,1.6-1.6,1.6l0,0H0z"/>
<linearGradient id="SVGID_3_" gradientUnits="userSpaceOnUse" x1="18.5555" y1="4.1" x2="18.5555" y2="60.68" gradientTransform="matrix(1 0 0 -1 0 66)">
	<stop  offset="0" style="stop-color:#DD932D"/>
	<stop  offset="6.000000e-02" style="stop-color:#FAAE42"/>
	<stop  offset="0.42" style="stop-color:#F8DB6E"/>
	<stop  offset="1" style="stop-color:#FEDEB1"/>
</linearGradient>
<path class="st9" d="M24.9,4.9l1.1,1.9c0.5,0.7,0.9,1.3,1,1.3c0.1,0,0.3,0.1,0.4,0.1l2-0.9L30.1,7c0.9-0.5,1.9-0.8,2.9-1l0,0
	c0.5,0,1.9,1.1,2.4,1.7c0.5,0.6,0.9,1.2,1.1,1.9c0.2,0.5-0.7,2.4-1.4,3.4l-0.8,1.2l1.9,3.2c0.1,0.1,0.1,0.2,0.1,0.3v6.8l0.1,0.1
	v36.2c0,0.6-0.5,1.1-1.1,1.1H0.5V4.9H24.9z"/>
<path class="st8" d="M36.5,9.6c-0.3-0.7-0.7-1.4-1.1-1.9C34.9,7.1,33.5,6,33,6l0,0c-1,0.2-2,0.5-2.9,1l-0.8,0.3l-2,0.9
	c-0.1,0-0.3-0.1-0.4-0.1c0,0-0.5-0.6-1-1.3l-1.1-1.9H0.4v2h24.4L26,8.8c0.5,0.7,0.9,1.3,1,1.3c0.1,0,0.3,0.1,0.4,0.1l2-0.9l0.8-0.4
	C31,8.5,32,8.2,33,8l0,0c0.5,0,1.9,1.1,2.4,1.7c0.3,0.4,0.6,0.9,0.8,1.3C36.4,10.6,36.5,10.1,36.5,9.6z"/>
</svg>
