<?xml version="1.0" encoding="utf-8"?>
<!-- Generator: Adobe Illustrator 21.0.0, SVG Export Plug-In . SVG Version: 6.00 Build 0)  -->
<svg version="1.1" id="katman_1" xmlns="http://www.w3.org/2000/svg" xmlns:xlink="http://www.w3.org/1999/xlink" x="0px" y="0px"
	 viewBox="0 0 32 26.1" style="enable-background:new 0 0 32 26.1;" xml:space="preserve">
<style type="text/css">
	.st0{opacity:0.7;fill:#080828;enable-background:new    ;}
	.st1{fill:url(#SVGID_1_);}
	.st2{fill:url(#SVGID_2_);}
	.st3{fill:url(#SVGID_3_);}
	.st4{fill:url(#SVGID_4_);}
	.st5{fill:url(#SVGID_5_);}
	.st6{fill:url(#SVGID_6_);}
	.st7{opacity:0.1;fill:#FFFFFF;enable-background:new    ;}
	.st8{fill:url(#SVGID_7_);}
	.st9{fill:url(#SVGID_8_);}
	.st10{opacity:0.1;enable-background:new    ;}
	.st11{fill:url(#SVGID_9_);}
</style>
<title>mail-unread_2</title>
<path class="st0" d="M31.8,17.5c-0.1-3.5-0.2-6.8-0.1-10.9c0-0.5-0.3-0.8-0.8-0.9c0,0,0,0-0.1,0c-0.5,0-0.9,0.4-0.9,0.8
	c-0.1,4.1,0,7.4,0.1,10.9c0,1.3,0.1,2.5,0.1,3.9H29L27.8,24h-0.7l1.2-2.6h-1.9L25.2,24h-0.7l1.2-2.5h-1.9L22.6,24h-0.8l1.2-2.6h-1.9
	L19.9,24h-0.8l1.2-2.6h-1.9L17.3,24h-0.8l1.2-2.6h-1.9L14.6,24h-0.8l1.2-2.6h-1.9L12,24.1h-0.8l1.2-2.6h-1.9l-1.3,2.7H8.6l1.2-2.6
	H7.9l-1.2,2.7H5.9l1.2-2.7H5.3L4,24.1H3.3l1.2-2.6H2.6l-0.9,1.9V1.8c1,0.1,2.1,0.1,3.5,0.1c0.9,0,1.8,0,2.6,0s1.8,0,2.6,0h6.3
	c3.4,0,6.4,0,9.3,0h0.8c0.9,0,1.8,0,2.7,0l-0.3,0.5l-0.4,0.7C28,4.5,27,6.2,26,7.8l-0.5,0.8c-1.1,1.8-3.1,5.1-4.9,6.7
	c-0.5,0.4-1,0.8-1.6,1.1l-0.1,0.1c-0.8,0.5-1.7,0.7-2.6,0.7c-0.5,0-0.9,0-1.4-0.1c-0.4-0.1-0.8-0.3-1.2-0.5c-0.4-0.2-0.7-0.5-1-0.8
	c-0.3-0.3-0.6-0.6-0.8-1c-0.2-0.4-0.4-0.8-0.5-1.2c-0.2-0.9-0.2-1.8,0-2.6c0.1-0.4,0.3-0.8,0.5-1.2c0.2-0.4,0.5-0.7,0.8-1
	c0.3-0.3,0.6-0.6,1-0.8c0.4-0.2,0.8-0.4,1.2-0.5c0.4-0.1,0.9-0.2,1.4-0.2c0.7,0,1.3,0.1,1.9,0.4c0.5,0.2,1,0.6,1.4,1.1
	c0.4,0.5,0.7,1,0.9,1.6c0.2,0.6,0.3,1.3,0.2,2c0,0.3-0.1,0.5-0.2,0.8c-0.1,0.2-0.3,0.4-0.5,0.6c-0.2,0.2-0.4,0.3-0.6,0.4L19.1,14
	v-1.1c0-0.3,0-0.5,0-0.7c0-0.2-0.1-0.5-0.1-0.7c0-0.1-0.1-0.3-0.1-0.4c0-0.1-0.1-0.3-0.2-0.4c-0.1-0.3-0.3-0.5-0.5-0.8
	c-0.2-0.2-0.5-0.4-0.7-0.6c-0.5-0.3-1.2-0.5-1.8-0.5c-0.9,0-1.8,0.3-2.4,1c-0.7,0.7-1,1.6-1,2.5c0,0.3,0,0.6,0.1,0.9
	c0.2,0.8,0.7,1.6,1.4,2.1c0.1,0.1,0.3,0.2,0.4,0.2c0.1,0.1,0.3,0.1,0.5,0.2c0.3,0.1,0.7,0.1,1,0.1h0.4l0.5-0.1
	c0.2,0,0.3-0.1,0.5-0.2v0.2h1.6h0.4l0.3-0.1l0.2-0.1h0.1c0.3-0.1,0.6-0.2,0.9-0.4c0.3-0.2,0.6-0.4,0.8-0.7c0.2-0.3,0.5-0.6,0.6-1
	c0.2-0.4,0.3-0.8,0.4-1.2c0.3-1.2,0.2-2.4-0.4-3.6c-0.3-0.5-0.6-1-1-1.4c-0.4-0.4-0.8-0.8-1.3-1.1c-0.5-0.3-1.1-0.5-1.7-0.7
	c-0.6-0.2-1.2-0.3-1.9-0.2c-0.6,0-1.2,0.1-1.9,0.2c-0.6,0.2-1.1,0.4-1.7,0.7c-1,0.6-1.9,1.4-2.5,2.4c-0.3,0.5-0.5,1.1-0.7,1.6
	c-0.3,1.2-0.3,2.4,0,3.6c0.2,0.6,0.4,1.1,0.7,1.6c0.6,1,1.5,1.8,2.5,2.4c1.1,0.6,2.3,0.9,3.5,0.9c0.5,0,1-0.1,1.4-0.1
	c0.5-0.1,0.9-0.2,1.4-0.4c1.4-0.7,2.7-1.7,3.8-2.9c1.5-1.8,2.8-3.7,4-5.8l0.3-0.5c1.2-1.8,2.2-3.6,3-5c0.2-0.3,0.3-0.6,0.5-0.8
	c0.4-0.7,0.8-1.4,1.2-2C32,1.1,32,0.8,31.9,0.5C31.7,0.2,31.4,0,31.1,0l0,0c-2.3,0.2-4.7,0.2-6.7,0.2h-9c-3.9,0-7.4,0-10.6-0.1H3.2
	c-0.8,0-1.5,0-2.3-0.1H0.8C0.6,0,0.4,0.1,0.3,0.2C0.1,0.4,0,0.6,0,0.9v24c0,0.5,0.4,0.8,0.9,0.9c1.9,0,3.9,0.1,6.2,0.1
	c2.6,0,5.2,0,7.8-0.1h0.1c2.5,0,5.1-0.1,7.7-0.1c3.3,0,6,0,8.5,0.1l0,0c0.2,0,0.4-0.1,0.6-0.2c0.2-0.1,0.3-0.4,0.3-0.6
	C32,22.2,31.9,19.9,31.8,17.5z M17.1,13.3l-0.1,0.1c-0.2,0.1-0.4,0.2-0.6,0.3c-0.2,0.1-0.4,0.1-0.6,0.1c-0.4,0-0.7-0.1-1-0.4
	c-0.3-0.3-0.4-0.7-0.4-1.1c0-0.4,0.1-0.8,0.4-1.1c0.5-0.5,1.4-0.5,1.9,0c0.3,0.3,0.4,0.7,0.4,1.1L17.1,13.3z M29.7,24.1l0.6-1.2
	c0,0.4,0,0.8,0,1.2L29.7,24.1z"/>
<linearGradient id="SVGID_1_" gradientUnits="userSpaceOnUse" x1="4.1" y1="2.625" x2="6.75" y2="2.625" gradientTransform="matrix(1 0 0 -1 0 25.73)">
	<stop  offset="0.25" style="stop-color:#CC2A31"/>
	<stop  offset="0.49" style="stop-color:#C92930"/>
	<stop  offset="0.67" style="stop-color:#C0272F"/>
	<stop  offset="0.82" style="stop-color:#B0242C"/>
	<stop  offset="0.96" style="stop-color:#9A1F28"/>
	<stop  offset="0.99" style="stop-color:#931D27"/>
</linearGradient>
<polygon class="st1" points="5.4,24.5 4.1,24.5 5.4,21.7 6.8,21.7 "/>
<linearGradient id="SVGID_2_" gradientUnits="userSpaceOnUse" x1="9.39" y1="2.625" x2="12.03" y2="2.625" gradientTransform="matrix(1 0 0 -1 0 25.73)">
	<stop  offset="0.25" style="stop-color:#CC2A31"/>
	<stop  offset="0.49" style="stop-color:#C92930"/>
	<stop  offset="0.67" style="stop-color:#C0272F"/>
	<stop  offset="0.82" style="stop-color:#B0242C"/>
	<stop  offset="0.96" style="stop-color:#9A1F28"/>
	<stop  offset="0.99" style="stop-color:#931D27"/>
</linearGradient>
<polygon class="st2" points="10.7,24.5 9.4,24.5 10.7,21.7 12,21.7 "/>
<linearGradient id="SVGID_3_" gradientUnits="userSpaceOnUse" x1="14.67" y1="2.625" x2="17.31" y2="2.625" gradientTransform="matrix(1 0 0 -1 0 25.73)">
	<stop  offset="0.25" style="stop-color:#CC2A31"/>
	<stop  offset="0.49" style="stop-color:#C92930"/>
	<stop  offset="0.67" style="stop-color:#C0272F"/>
	<stop  offset="0.82" style="stop-color:#B0242C"/>
	<stop  offset="0.96" style="stop-color:#9A1F28"/>
	<stop  offset="0.99" style="stop-color:#931D27"/>
</linearGradient>
<polygon class="st3" points="16,24.5 14.7,24.5 16,21.7 17.3,21.7 "/>
<linearGradient id="SVGID_4_" gradientUnits="userSpaceOnUse" x1="19.95" y1="2.625" x2="22.6" y2="2.625" gradientTransform="matrix(1 0 0 -1 0 25.73)">
	<stop  offset="0.25" style="stop-color:#CC2A31"/>
	<stop  offset="0.49" style="stop-color:#C92930"/>
	<stop  offset="0.67" style="stop-color:#C0272F"/>
	<stop  offset="0.82" style="stop-color:#B0242C"/>
	<stop  offset="0.96" style="stop-color:#9A1F28"/>
	<stop  offset="0.99" style="stop-color:#931D27"/>
</linearGradient>
<polygon class="st4" points="21.3,24.5 20,24.5 21.3,21.7 22.6,21.7 "/>
<linearGradient id="SVGID_5_" gradientUnits="userSpaceOnUse" x1="25.24" y1="2.625" x2="27.88" y2="2.625" gradientTransform="matrix(1 0 0 -1 0 25.73)">
	<stop  offset="0.25" style="stop-color:#CC2A31"/>
	<stop  offset="0.49" style="stop-color:#C92930"/>
	<stop  offset="0.67" style="stop-color:#C0272F"/>
	<stop  offset="0.82" style="stop-color:#B0242C"/>
	<stop  offset="0.96" style="stop-color:#9A1F28"/>
	<stop  offset="0.99" style="stop-color:#931D27"/>
</linearGradient>
<polygon class="st5" points="26.6,24.5 25.2,24.5 26.6,21.7 27.9,21.7 "/>
<linearGradient id="SVGID_6_" gradientUnits="userSpaceOnUse" x1="15.9866" y1="0.15" x2="15.9866" y2="25.47" gradientTransform="matrix(1 0 0 -1 0 25.73)">
	<stop  offset="0" style="stop-color:#2D5778"/>
	<stop  offset="1" style="stop-color:#1A97D4"/>
</linearGradient>
<path class="st6" d="M31.6,17.5c-0.1-3.5-0.2-6.8-0.1-10.9c0-0.3-0.2-0.6-0.5-0.6c0,0,0,0-0.1,0c-0.3,0-0.6,0.2-0.6,0.6c0,0,0,0,0,0
	c-0.1,4.1,0,7.4,0.1,10.9c0,1.4,0.1,2.7,0.1,4.2h-1.3L28,24.3c-1.3,0-2.6,0-3.9,0l1.2-2.5h-1.3l-1.2,2.5h-4l1.3-2.5h-1.4l-1.2,2.6
	h-2.6h-1.4l1.2-2.6h-1.3l-1.2,2.6h-4l1.2-2.7H8.1l-1.2,2.7c-1.3,0-2.7,0-4,0l1.2-2.7H2.8l-1.2,2.6H1.5V1.5c2.1,0.2,4.3,0.2,6.4,0.1
	c0.9,0,1.9,0,2.8,0c6,0,10.9,0,15.4,0h0.8c1,0,2.1,0,3.1-0.1c-0.2,0.3-0.4,0.6-0.5,0.9l-0.4,0.7c-0.8,1.4-1.8,3.1-2.9,4.8l-0.5,0.8
	c-1.1,1.8-3.1,5.1-5,6.7c-0.5,0.4-1.1,0.8-1.7,1.1l-0.1,0.1c-0.8,0.5-1.8,0.7-2.8,0.7c-0.5,0-1-0.1-1.4-0.2
	c-0.5-0.1-0.9-0.3-1.3-0.5c-0.4-0.2-0.8-0.5-1.1-0.8c-0.3-0.3-0.6-0.7-0.8-1.1c-0.2-0.4-0.4-0.8-0.5-1.3c-0.3-0.9-0.3-1.9,0-2.8
	c0.1-0.4,0.3-0.9,0.5-1.3c0.2-0.4,0.5-0.8,0.8-1.1c0.3-0.3,0.7-0.6,1.1-0.8c0.4-0.2,0.8-0.4,1.3-0.6c0.5-0.1,0.9-0.2,1.4-0.2
	c0.7,0,1.4,0.1,2,0.4c0.6,0.3,1.1,0.6,1.5,1.1c0.4,0.5,0.7,1.1,0.9,1.7c0.2,0.7,0.3,1.4,0.2,2.1c0,0.3-0.1,0.6-0.2,0.9
	c-0.1,0.2-0.3,0.5-0.5,0.6c-0.2,0.2-0.4,0.3-0.7,0.4c-0.2,0.1-0.4,0.1-0.5,0.2v-1.4c0-0.3,0-0.5,0-0.7c0-0.2,0-0.3-0.1-0.5
	c0-0.1-0.1-0.3-0.1-0.4c0-0.1-0.1-0.3-0.2-0.4c-0.1-0.3-0.3-0.5-0.5-0.7c-0.2-0.2-0.4-0.4-0.7-0.5c-0.5-0.3-1.1-0.5-1.6-0.4
	c-0.8,0-1.7,0.3-2.2,0.9c-0.6,0.6-0.9,1.5-0.9,2.3c0,0.3,0,0.5,0.1,0.8c0.2,0.8,0.7,1.4,1.3,1.9c0.1,0.1,0.2,0.2,0.4,0.2
	c0.1,0.1,0.3,0.1,0.4,0.2c0.4,0.1,0.9,0.2,1.3,0.1l0.4-0.1c0.3-0.1,0.5-0.2,0.8-0.3v0.3h1.3H19l0.3-0.1l0.2-0.1h0.1
	c0.3-0.1,0.6-0.2,0.9-0.4c0.3-0.2,0.5-0.4,0.8-0.7c0.2-0.3,0.4-0.6,0.6-0.9c0.2-0.3,0.3-0.7,0.3-1.1c0.2-1.1,0-2.3-0.5-3.3
	c-0.2-0.5-0.6-0.9-0.9-1.3c-0.4-0.4-0.8-0.7-1.3-1c-0.5-0.3-1-0.5-1.6-0.7c-1.7-0.5-3.6-0.2-5.1,0.7c-1,0.6-1.8,1.4-2.4,2.3
	c-0.3,0.5-0.5,1-0.7,1.6c-0.3,1.1-0.3,2.3,0,3.5c0.2,0.6,0.4,1.1,0.7,1.6c0.6,1,1.4,1.8,2.4,2.4c1.9,1.1,4.1,1.2,6,0.4
	c1.4-0.7,2.7-1.7,3.7-2.8c1.5-1.8,2.8-3.7,4-5.7l0.3-0.5c1.1-1.8,2.2-3.6,3-5c0.2-0.3,0.3-0.6,0.5-0.8c0.4-0.7,0.8-1.4,1.2-2
	c0.1-0.2,0.1-0.4,0-0.6c-0.1-0.2-0.3-0.3-0.5-0.3c-2.9,0.2-5.8,0.2-8.6,0.2h-2.6c-4.1-0.1-9.5-0.1-14.9-0.2H3.8c-1,0-1.9,0-2.9-0.1
	c-0.1,0-0.3,0-0.4,0.1C0.3,0.5,0.3,0.7,0.3,0.9v24c0,0.3,0.3,0.6,0.6,0.6c4.7,0.1,9.4,0.1,14,0c5.3-0.1,10.9-0.1,16.3,0.1l0,0
	c0.2,0,0.3-0.1,0.4-0.2c0.1-0.1,0.2-0.3,0.2-0.4C31.7,22.2,31.6,19.9,31.6,17.5z M17.3,13.4l-0.2,0.2c-0.2,0.2-0.4,0.3-0.7,0.4
	c-0.2,0.1-0.4,0.1-0.6,0.1c-0.5,0-0.9-0.2-1.2-0.5c-0.3-0.4-0.5-0.8-0.5-1.3c0-0.5,0.1-0.9,0.5-1.3c0.6-0.6,1.7-0.6,2.3,0
	c0,0,0,0,0,0c0.3,0.4,0.5,0.8,0.5,1.3L17.3,13.4z M29.3,24.3l1.2-2.6c0,0.8,0,1.7,0,2.6L29.3,24.3z"/>
<polygon class="st7" points="5.4,21.7 4.1,24.5 4.3,24.5 5.4,22.2 6.5,22.2 6.8,21.7 "/>
<polygon class="st7" points="10.7,21.7 9.4,24.5 9.6,24.5 10.7,22.2 11.8,22.2 12,21.7 "/>
<polygon class="st7" points="16,21.7 14.7,24.5 14.9,24.5 16,22.2 17.1,22.2 17.3,21.7 "/>
<polygon class="st7" points="21.3,21.7 20,24.5 20.2,24.5 21.3,22.2 22.4,22.2 22.6,21.7 "/>
<polygon class="st7" points="27.6,22.2 27.9,21.7 26.6,21.7 25.2,24.5 25.5,24.5 26.6,22.2 "/>
<path class="st7" d="M14.6,14.1c0.3,0.3,0.7,0.5,1.2,0.5c0.2,0,0.4,0,0.7-0.1c0.2-0.1,0.5-0.2,0.7-0.4l0.2-0.2v-0.5l-0.2,0.2
	c-0.2,0.2-0.4,0.3-0.7,0.4c-0.2,0.1-0.4,0.1-0.6,0.1c-0.5,0-0.9-0.2-1.2-0.5c-0.3-0.3-0.4-0.6-0.4-1c0,0.1,0,0.2,0,0.3
	C14.1,13.3,14.3,13.8,14.6,14.1z"/>
<path class="st7" d="M29.3,24.8h1.2c0-0.2,0-0.4,0-0.5h-1L29.3,24.8z"/>
<path class="st7" d="M2.8,21.7l-1.2,2.6H1.5v0.5h0.1l1.2-2.6h1.1l0.2-0.5L2.8,21.7z"/>
<path class="st7" d="M8.1,21.7l-1.2,2.7H3.1l-0.2,0.5c1.3,0,2.7,0,3.9,0l1.2-2.7h1.1l0.2-0.5H8.1z"/>
<path class="st7" d="M10.4,9.3c0.6-1,1.4-1.8,2.4-2.3c1.6-0.9,3.4-1.1,5.2-0.7C18.5,6.5,19,6.7,19.5,7c0.5,0.3,0.9,0.6,1.3,1
	c0.4,0.4,0.7,0.8,0.9,1.3c0.3,0.5,0.4,1.1,0.5,1.7c0,0.2,0,0.3,0,0.5c0-0.3,0-0.7,0-1C22.1,10,22,9.4,21.7,8.9
	c-0.2-0.5-0.6-0.9-0.9-1.3c-0.4-0.4-0.8-0.7-1.3-1c-0.5-0.3-1-0.5-1.6-0.7c-1.7-0.5-3.6-0.2-5.1,0.7c-1,0.6-1.8,1.4-2.4,2.3
	c-0.3,0.5-0.5,1-0.7,1.6c-0.2,0.6-0.2,1.2-0.2,1.8c0,0.1,0,0.2,0,0.3c0-0.5,0.1-1,0.2-1.5C9.9,10.4,10.1,9.9,10.4,9.3z"/>
<path class="st7" d="M15.7,9.6c0.6,0,1.2,0.2,1.7,0.4c0.2,0.2,0.5,0.3,0.7,0.5c0.2,0.2,0.4,0.5,0.5,0.7c0.1,0.1,0.1,0.2,0.2,0.4
	c0,0.1,0.1,0.3,0.1,0.4c0,0.2,0.1,0.3,0.1,0.5c0,0.2,0,0.4,0,0.7v-0.5c0-0.3,0-0.5,0-0.7c0-0.2,0-0.3-0.1-0.5c0-0.1-0.1-0.3-0.1-0.4
	c0-0.1-0.1-0.3-0.2-0.4c-0.1-0.3-0.3-0.5-0.5-0.7c-0.2-0.2-0.4-0.4-0.7-0.5c-0.5-0.3-1.1-0.5-1.6-0.4c-0.8,0-1.7,0.3-2.2,0.9
	c-0.6,0.6-0.9,1.5-0.9,2.3c0,0.1,0,0.2,0,0.3c0-0.8,0.3-1.5,0.9-2.1C14,9.9,14.9,9.6,15.7,9.6z"/>
<path class="st7" d="M29,3.2c-0.8,1.4-1.8,3.1-2.8,4.8l-0.5,0.8c-1.1,1.8-3.1,5.1-5,6.7c-0.5,0.4-1.1,0.8-1.7,1.1l-0.1,0.1
	c-0.8,0.5-1.8,0.7-2.8,0.7c-0.5,0-1-0.1-1.4-0.2c-0.5-0.1-0.9-0.3-1.3-0.5c-0.4-0.2-0.8-0.5-1.1-0.8c-0.3-0.3-0.6-0.7-0.8-1.1
	c-0.2-0.4-0.4-0.8-0.5-1.3c-0.1-0.4-0.2-0.7-0.2-1.1c0,0.1,0,0.2,0,0.3c0,0.5,0.1,0.9,0.2,1.3c0.1,0.4,0.3,0.9,0.5,1.3
	c0.2,0.4,0.5,0.8,0.8,1.1c0.3,0.3,0.7,0.6,1.1,0.8c0.4,0.2,0.8,0.4,1.3,0.5c0.5,0.1,0.9,0.2,1.4,0.2c1,0,2-0.2,2.8-0.7l0.1-0.1
	c0.6-0.3,1.1-0.7,1.6-1.1c1.8-1.6,3.9-4.9,4.9-6.7l0.5-0.8c1-1.7,2-3.4,2.9-4.8L29.5,3c0.2-0.3,0.3-0.6,0.5-0.9h-0.3l-0.2,0.4
	L29,3.2z"/>
<path class="st7" d="M20.6,13c-0.1,0.2-0.3,0.5-0.5,0.6c-0.2,0.2-0.4,0.3-0.7,0.4c-0.2,0.1-0.4,0.1-0.5,0.2v0.5
	c0.2,0,0.4-0.1,0.5-0.2c0.3-0.1,0.5-0.2,0.7-0.4c0.2-0.2,0.4-0.4,0.5-0.6c0.1-0.3,0.2-0.6,0.2-0.9c0-0.2,0-0.5,0-0.8
	c0,0.1,0,0.1,0,0.2C20.9,12.4,20.8,12.7,20.6,13z"/>
<path class="st7" d="M0.9,0.8c1,0.1,1.9,0.1,2.9,0.1h1.1C10.3,1,15.7,1,19.8,0.9h2.7c2.8,0,5.8,0,8.6-0.2c0.2,0,0.4,0.1,0.5,0.3l0,0
	c0.1-0.2,0.1-0.4,0-0.5c-0.1-0.2-0.3-0.3-0.5-0.3c-2.9,0.2-5.8,0.2-8.6,0.2h-2.7c-4.1,0-9.5,0-14.9,0H3.8c-1,0-1.9,0-2.9-0.1
	c-0.1,0-0.3,0-0.4,0.1C0.3,0.5,0.3,0.7,0.3,0.9v0.5c0-0.2,0.1-0.3,0.2-0.4C0.6,0.8,0.7,0.8,0.9,0.8z"/>
<path class="st7" d="M18.6,21.7l-1.2,2.6h-2.6h-1.1l-0.2,0.5h1.4h2.6l1.2-2.6h1.1l0.2-0.5L18.6,21.7z"/>
<path class="st7" d="M23.9,21.7l-1.2,2.5H19l-0.2,0.5h4l1.2-2.5h1l0.2-0.5L23.9,21.7z"/>
<path class="st7" d="M30.9,6c-0.3,0-0.6,0.2-0.6,0.6c0,0,0,0,0,0c0,1.6-0.1,3-0.1,4.4c0-1.2,0-2.5,0.1-3.9c0-0.3,0.3-0.6,0.6-0.6
	c0,0,0,0,0,0c0.3,0,0.5,0.2,0.5,0.5c0-0.2,0-0.3,0-0.4C31.5,6.3,31.3,6,30.9,6C30.9,6,30.9,6,30.9,6z"/>
<path class="st7" d="M28,24.3c-1.2,0-2.5,0-3.7,0l-0.2,0.5c1.3,0,2.6,0,3.9,0l1.2-2.6h1.1l0.2-0.4v-0.1h-1.3L28,24.3z"/>
<linearGradient id="SVGID_7_" gradientUnits="userSpaceOnUse" x1="31.58" y1="0.73" x2="31.58" y2="14.67" gradientTransform="matrix(1 0 0 -1 0 25.73)">
	<stop  offset="0" style="stop-color:#2D5778"/>
	<stop  offset="1" style="stop-color:#1A97D4"/>
</linearGradient>
<path class="st8" d="M31.6,17.5c-0.1-2.1-0.1-4.2-0.1-6.5c0,2.4,0.1,4.7,0.1,7s0.1,4.4,0.2,6.9l0,0C31.7,22.2,31.6,19.9,31.6,17.5z"
	/>
<path class="st7" d="M13.4,21.7l-1.2,2.6H8.4l-0.2,0.5h4l1.2-2.6h1.1l0.2-0.5L13.4,21.7z"/>
<linearGradient id="SVGID_8_" gradientUnits="userSpaceOnUse" x1="30.34" y1="4.05" x2="30.34" y2="14.69" gradientTransform="matrix(1 0 0 -1 0 25.73)">
	<stop  offset="0" style="stop-color:#2D5778"/>
	<stop  offset="1" style="stop-color:#1A97D4"/>
</linearGradient>
<path class="st9" d="M30.4,18c0,1.2,0.1,2.4,0.1,3.7l0,0c0-1.5-0.1-2.9-0.1-4.2c-0.1-2.1-0.1-4.2-0.1-6.4
	C30.2,13.5,30.3,15.7,30.4,18z"/>
<path class="st10" d="M21.8,13.3c-0.1,0.3-0.3,0.6-0.6,0.9c-0.2,0.3-0.5,0.5-0.8,0.7c-0.3,0.2-0.6,0.3-0.9,0.4h-0.1l-0.2,0.1
	L19,15.4h-0.3h-1.3V15c-0.3,0.1-0.5,0.3-0.8,0.3l-0.4,0.1c-0.4,0.1-0.9,0-1.3-0.1c-0.1,0-0.3-0.1-0.4-0.2c-0.1,0-0.2-0.1-0.4-0.2
	c-0.7-0.5-1.1-1.1-1.3-1.9c0-0.2-0.1-0.3-0.1-0.5c0,0.1,0,0.1,0,0.2c0,0.3,0,0.5,0.1,0.8c0.2,0.8,0.6,1.5,1.3,1.9
	c0.1,0.1,0.2,0.2,0.4,0.2c0.1,0.1,0.3,0.1,0.4,0.2c0.4,0.1,0.9,0.2,1.3,0.1l0.4-0.1c0.3-0.1,0.5-0.2,0.8-0.3V16h1.3H19l0.3-0.1
	l0.2-0.1h0.1c0.3-0.1,0.6-0.2,0.9-0.4c0.3-0.2,0.5-0.4,0.8-0.7c0.2-0.3,0.4-0.6,0.6-0.9c0.2-0.3,0.3-0.7,0.3-1.1
	c0.1-0.4,0.1-0.8,0.1-1.2c0,0.2,0,0.5-0.1,0.7C22.1,12.6,22,13,21.8,13.3z"/>
<linearGradient id="SVGID_9_" gradientUnits="userSpaceOnUse" x1="31.4544" y1="14.67" x2="31.4544" y2="18.65" gradientTransform="matrix(1 0 0 -1 0 25.73)">
	<stop  offset="0" style="stop-color:#2D5778"/>
	<stop  offset="1" style="stop-color:#1A97D4"/>
</linearGradient>
<path class="st11" d="M31.5,7.1c0,1.4-0.1,2.7,0,4C31.4,9.8,31.4,8.6,31.5,7.1C31.5,7.1,31.5,7.1,31.5,7.1z"/>
<path class="st10" d="M30.4,3.2c-0.1,0.3-0.3,0.6-0.5,0.8c-0.8,1.4-1.9,3.2-3,5l-0.3,0.5c-1.2,2-2.5,3.9-4,5.7
	c-1,1.2-2.3,2.2-3.7,2.8c-2,0.8-4.2,0.7-6.1-0.4c-1-0.6-1.8-1.4-2.4-2.4c-0.3-0.5-0.5-1-0.7-1.6c-0.1-0.5-0.2-1-0.2-1.5
	c0,0.1,0,0.2,0,0.3c0,0.6,0.1,1.2,0.2,1.8c0.1,0.6,0.3,1.1,0.6,1.6c0.6,1,1.4,1.8,2.4,2.4c1.9,1.1,4.1,1.2,6,0.4
	c1.4-0.7,2.7-1.7,3.7-2.8c1.5-1.8,2.8-3.7,4-5.7l0.3-0.5c1.1-1.8,2.2-3.6,3-5c0.2-0.3,0.3-0.6,0.5-0.8c0.4-0.7,0.8-1.4,1.2-2
	c0.1-0.2,0.1-0.4,0-0.6v0.1C31.1,1.9,30.7,2.5,30.4,3.2z"/>
<path class="st10" d="M11.5,10c0.2-0.4,0.5-0.8,0.8-1.1c0.3-0.3,0.7-0.6,1.1-0.8c0.4-0.2,0.8-0.4,1.3-0.5c0.5-0.1,0.9-0.2,1.4-0.2
	c0.7,0,1.4,0.1,2,0.4c0.6,0.3,1.1,0.6,1.5,1.1c0.4,0.5,0.7,1.1,0.9,1.7c0.1,0.4,0.2,0.9,0.2,1.3c0-0.6,0-1.2-0.2-1.8
	c-0.2-0.6-0.5-1.2-0.9-1.7c-0.4-0.5-0.9-0.9-1.5-1.1c-0.6-0.3-1.3-0.4-2-0.4c-0.5,0-1,0-1.4,0.1c-0.5,0.1-0.9,0.3-1.3,0.5
	c-0.4,0.2-0.8,0.5-1.1,0.8C12,8.7,11.8,9,11.5,9.4c-0.2,0.4-0.4,0.8-0.5,1.3c-0.1,0.5-0.2,0.9-0.2,1.4c0,0.1,0,0.2,0,0.3
	c0-0.4,0.1-0.8,0.2-1.1C11.1,10.8,11.3,10.4,11.5,10z"/>
<path class="st10" d="M26.8,1.6H26c-4.4,0-9.3,0.1-15.4,0c-0.9,0-1.9,0-2.8,0c-2.1,0.1-4.3,0-6.4-0.1V2c2.1,0.2,4.3,0.2,6.4,0.1
	c0.9,0,1.9,0,2.8,0c6,0,10.9,0,15.4,0h0.8c0.9,0,1.9,0,2.8,0l0.3-0.5C28.9,1.6,27.9,1.6,26.8,1.6z"/>
<path class="st10" d="M31.5,25.4c-0.1,0.1-0.2,0.2-0.4,0.2l0,0c-5.4-0.2-10.9-0.1-16.3-0.1c-4.6,0-9.3,0.1-14,0
	c-0.3,0-0.6-0.3-0.6-0.6v0.5c0,0.3,0.3,0.6,0.6,0.6c4.7,0.1,9.4,0.1,14,0c5.3-0.1,10.9-0.1,16.3,0.1l0,0c0.2,0,0.3-0.1,0.4-0.2
	c0.1-0.1,0.2-0.3,0.2-0.4c0-0.2,0-0.3,0-0.5C31.7,25.2,31.7,25.3,31.5,25.4z"/>
<path class="st10" d="M15.7,11c0.4,0,0.9,0.2,1.2,0.5c0.3,0.4,0.5,0.8,0.5,1.3v-0.5c0-0.5-0.1-0.9-0.5-1.3c-0.6-0.6-1.7-0.6-2.3,0
	c0,0,0,0,0,0c-0.3,0.4-0.5,0.8-0.5,1.3c0,0.1,0,0.2,0,0.3c0-0.4,0.2-0.7,0.4-1C14.8,11.2,15.3,11,15.7,11z"/>
</svg>
