<?xml version="1.0" encoding="utf-8"?>
<!-- Generator: Adobe Illustrator 21.0.0, SVG Export Plug-In . SVG Version: 6.00 Build 0)  -->
<svg version="1.1" id="katman_1" xmlns="http://www.w3.org/2000/svg" xmlns:xlink="http://www.w3.org/1999/xlink" x="0px" y="0px"
	 viewBox="0 0 32 30.8" style="enable-background:new 0 0 32 30.8;" xml:space="preserve">
<style type="text/css">
	.st0{opacity:0.2;enable-background:new    ;}
	.st1{fill:#793D1A;}
	.st2{fill:url(#SVGID_1_);}
	.st3{fill:url(#SVGID_2_);}
	.st4{fill:url(#SVGID_3_);}
	.st5{opacity:0.1;enable-background:new    ;}
	.st6{opacity:0.1;fill:#FFFFFF;enable-background:new    ;}
	.st7{fill:url(#SVGID_4_);}
	.st8{fill:url(#SVGID_5_);}
</style>
<title>user-bookmarks_4</title>
<polygon class="st0" points="29.3,27.6 32,23.4 31.4,23.4 29.3,26.7 "/>
<path class="st1" d="M31.8,3c0-0.4-0.3-0.8-0.7-0.8c0,0,0,0,0,0H19.3V0.8c0-0.4-0.3-0.8-0.8-0.8c0,0,0,0,0,0H10
	C9.6,0,9.2,0.3,9.2,0.8c0,0,0,0,0,0v1.4H7.1c-0.4,0-0.8,0.3-0.8,0.8c0,0,0,0,0,0.1v2.6L5.5,5.2C4.8,4.9,3.9,4.6,3.1,4.4
	c-0.6,0-1.7,1-2.1,1.5C0.6,6.4,0.2,7,0,7.5c-0.2,0.6,0.8,2.3,1.1,2.9l0.6,0.8l-1.4,2.4c-0.1,0.1-0.1,0.3-0.1,0.4v5.6
	c0,0.2,0.1,0.4,0.2,0.5l2.9,3l1.6,3.3c0.1,0.3,0.4,0.4,0.7,0.4h23.6h0.3l2.2-3.4l0.1-0.2V3z"/>
<linearGradient id="SVGID_1_" gradientUnits="userSpaceOnUse" x1="19.0396" y1="8.01" x2="19.0396" y2="32.55" gradientTransform="matrix(1 0 0 -1 0 31.29)">
	<stop  offset="0" style="stop-color:#793D1A;stop-opacity:0.8"/>
	<stop  offset="1" style="stop-color:#C96E28"/>
</linearGradient>
<path class="st2" d="M19,2.3V0.8c0-0.3-0.2-0.5-0.5-0.5l0,0H10c-0.3,0-0.5,0.2-0.5,0.5v1.5c0,0.1-0.1,0.1-0.1,0.1l0,0H7.1
	c-0.3,0-0.5,0.2-0.5,0.5c0,0,0,0,0,0.1v20.2h24.9V3c0-0.3-0.2-0.5-0.5-0.6c0,0,0,0,0,0H19.2C19.1,2.5,19,2.4,19,2.3
	C19,2.3,19,2.3,19,2.3z"/>
<linearGradient id="SVGID_2_" gradientUnits="userSpaceOnUse" x1="32.8517" y1="4.0618" x2="29.1317" y2="7.4818" gradientTransform="matrix(1 0 0 -1 0 31.29)">
	<stop  offset="0" style="stop-color:#C96E28"/>
	<stop  offset="1" style="stop-color:#793D1A;stop-opacity:0.8"/>
</linearGradient>
<polygon class="st3" points="29.3,26.7 31.5,23.2 28,23.2 "/>
<linearGradient id="SVGID_3_" gradientUnits="userSpaceOnUse" x1="14.745" y1="4.81" x2="14.745" y2="26.65" gradientTransform="matrix(1 0 0 -1 0 31.29)">
	<stop  offset="0" style="stop-color:#A3A4A4"/>
	<stop  offset="0.12" style="stop-color:#BABABA"/>
	<stop  offset="0.27" style="stop-color:#CECECE"/>
	<stop  offset="0.44" style="stop-color:#DCDBDB"/>
	<stop  offset="0.64" style="stop-color:#E4E4E4"/>
	<stop  offset="0.99" style="stop-color:#E7E6E6"/>
</linearGradient>
<path class="st4" d="M28.7,4.2h-19C9.1,4.9,8.5,5.6,8,6.4c-0.1,0-0.2,0.1-0.3,0.1L6.1,5.7L5.5,5.5C4.7,5.1,3.9,4.8,3.1,4.7
	c-0.4,0-1.5,0.9-1.9,1.4c-0.4,0.5-0.7,1-0.9,1.6c0.1,1,0.5,1.9,1.1,2.7l0.6,1l-1.5,2.5C0.4,14,0.4,14,0.4,14.1v5.6
	c0,0.1,0.1,0.3,0.1,0.4l2.9,3v0.1L5,26.4c0.1,0.2,0.3,0.3,0.5,0.3h23.8V4.8C29.2,4.5,29,4.3,28.7,4.2z"/>
<path class="st5" d="M29.6,3.4h-19C10.3,3.7,10,3.9,9.8,4.2h19c0.3,0,0.5,0.2,0.5,0.5v0v21.9l0.8-1.2V4c0-0.3-0.2-0.6-0.5-0.6
	C29.6,3.4,29.6,3.4,29.6,3.4z"/>
<path class="st6" d="M10,1.2h8.5c0.3,0,0.5,0.2,0.5,0.5c0,0,0,0,0,0v-1c0-0.3-0.2-0.5-0.5-0.5l0,0H10c-0.3,0-0.5,0.2-0.5,0.5v1
	C9.5,1.5,9.7,1.2,10,1.2z"/>
<path class="st6" d="M7.1,3.4h2.2c0.1,0,0.1-0.1,0.1-0.1v0v-1c0,0.1-0.1,0.1-0.1,0.1l0,0H7.1c-0.3,0-0.5,0.2-0.5,0.5c0,0,0,0,0,0.1
	v1C6.5,3.7,6.7,3.4,7.1,3.4C7.1,3.4,7.1,3.4,7.1,3.4z"/>
<path class="st6" d="M31,2.4H19.2c-0.1,0-0.1,0-0.2-0.1c0,0,0,0,0-0.1v1c0,0.1,0.1,0.1,0.1,0.1H31c0.3,0,0.5,0.2,0.5,0.5
	c0,0,0,0,0,0V3C31.6,2.7,31.3,2.5,31,2.4C31,2.4,31,2.4,31,2.4z"/>
<path class="st6" d="M28.7,4.2h-19C9.1,4.9,8.5,5.6,8,6.4c-0.1,0-0.2,0.1-0.3,0.1L6.1,5.7L5.5,5.5C4.7,5.1,3.9,4.8,3.1,4.7
	c-0.4,0-1.5,0.9-1.9,1.4c-0.4,0.5-0.7,1-0.9,1.6c0,0.2,0,0.5,0.1,0.7C0.6,7.9,0.9,7.4,1.2,7c0.4-0.5,1.5-1.4,1.9-1.4
	c0.8,0.2,1.6,0.4,2.3,0.8l0.6,0.3l1.6,0.7c0.1,0,0.2,0,0.3-0.1c0.5-0.8,1.1-1.5,1.7-2.1h19c0.3,0,0.5,0.2,0.5,0.5c0,0,0,0,0,0v-1
	C29.2,4.5,29,4.3,28.7,4.2z"/>
<path class="st0" d="M5,26.4l-1.5-3.3v-0.1l-2.9-3c-0.1-0.1-0.2-0.2-0.2-0.4v1c0,0.1,0.1,0.3,0.2,0.4l2.9,3v0.1L5,27.4
	c0.1,0.2,0.3,0.3,0.5,0.3h23.8v-1H5.5C5.3,26.7,5.1,26.6,5,26.4z"/>
<linearGradient id="SVGID_4_" gradientUnits="userSpaceOnUse" x1="20.9351" y1="3.97" x2="20.9351" y2="22.02" gradientTransform="matrix(1 0 0 -1 0 31.29)">
	<stop  offset="0" style="stop-color:#793D1A"/>
	<stop  offset="1" style="stop-color:#C96E28;stop-opacity:0.9"/>
</linearGradient>
<path class="st7" d="M27,29.9c-0.2,0-0.4-0.1-0.6-0.1l-4.9-2.6c-0.3-0.2-0.7-0.2-1,0l-4.9,2.6c-0.2,0.1-0.4,0.2-0.6,0.1
	c-0.4,0-0.8-0.2-1-0.5c-0.2-0.3-0.3-0.7-0.3-1l0.9-5.5c0.1-0.3,0-0.7-0.3-0.9l-4-3.9c-0.5-0.5-0.5-1.3,0-1.8
	c0.2-0.2,0.5-0.3,0.7-0.4l5.5-0.8c0.3,0,0.6-0.3,0.8-0.6l2.5-5c0.3-0.6,1.1-0.9,1.7-0.6c0.3,0.1,0.5,0.3,0.6,0.6l2.5,5
	c0.1,0.3,0.4,0.5,0.8,0.6l5.5,0.8c0.7,0.1,1.2,0.8,1.1,1.5c0,0.3-0.2,0.5-0.4,0.7L27.6,22c-0.3,0.2-0.4,0.6-0.3,0.9l0.9,5.5
	c0.1,0.4,0,0.7-0.2,1C27.8,29.7,27.4,29.9,27,29.9z"/>
<linearGradient id="SVGID_5_" gradientUnits="userSpaceOnUse" x1="28.4342" y1="1.4053" x2="10.1742" y2="24.1453" gradientTransform="matrix(1 0 0 -1 0 31.29)">
	<stop  offset="0" style="stop-color:#896307"/>
	<stop  offset="0.12" style="stop-color:#A77D07"/>
	<stop  offset="0.27" style="stop-color:#C69807"/>
	<stop  offset="0.43" style="stop-color:#DFAC07"/>
	<stop  offset="0.6" style="stop-color:#F0BB07"/>
	<stop  offset="0.78" style="stop-color:#FBC407"/>
	<stop  offset="1" style="stop-color:#FEC707"/>
</linearGradient>
<path class="st8" d="M22,9.6l2.5,5c0.2,0.3,0.5,0.6,0.9,0.6l5.5,0.8c0.6,0.1,1.1,0.7,1,1.3c0,0.3-0.2,0.5-0.3,0.7l-4,3.9
	c-0.3,0.3-0.4,0.6-0.3,1l0.9,5.5c0.1,0.6-0.3,1.2-1,1.3c-0.3,0-0.5,0-0.7-0.1L21.5,27c-0.3-0.2-0.7-0.2-1.1,0l-4.9,2.6
	c-0.6,0.3-1.3,0.1-1.6-0.5c-0.1-0.2-0.2-0.5-0.1-0.7l0.9-5.5c0.1-0.4-0.1-0.7-0.3-1l-4-3.9c-0.5-0.4-0.5-1.2,0-1.7
	c0.2-0.2,0.4-0.3,0.7-0.3l5.5-0.8c0.4-0.1,0.7-0.3,0.9-0.6l2.5-5c0.3-0.6,1-0.8,1.6-0.5C21.7,9.2,21.9,9.3,22,9.6L22,9.6z"/>
<path class="st6" d="M27.2,24l0.8,5c0.1-0.2,0.1-0.4,0.1-0.6l-0.9-5C27.1,23.6,27.1,23.8,27.2,24z"/>
<path class="st6" d="M11.1,17.1l5.5-0.8c0.4-0.1,0.7-0.3,0.9-0.6l2.5-5c0.3-0.6,1-0.8,1.6-0.5c0.2,0.1,0.4,0.3,0.5,0.5l2.5,5
	c0.2,0.3,0.5,0.6,0.9,0.6l5.5,0.8c0.4,0.1,0.7,0.3,0.9,0.6c0.3-0.6,0.1-1.3-0.5-1.6C31.1,16.1,31,16,30.8,16l-5.5-0.8
	c-0.4-0.1-0.7-0.3-0.9-0.6L22,9.6c-0.3-0.6-1-0.8-1.6-0.5c-0.2,0.1-0.4,0.3-0.5,0.5l-2.5,5c-0.2,0.3-0.5,0.6-0.9,0.6l-5.5,0.8
	c-0.6,0.1-1.1,0.7-1,1.3c0,0.1,0.1,0.2,0.1,0.4C10.4,17.4,10.7,17.1,11.1,17.1z"/>
<path class="st6" d="M14.7,23.3l-0.9,5.1c0,0.2,0,0.4,0.1,0.6l0.9-5C14.8,23.8,14.8,23.5,14.7,23.3z"/>
<path class="st5" d="M14.4,21.9l-4-3.9c-0.1-0.1-0.2-0.2-0.2-0.3c-0.2,0.5-0.1,1,0.2,1.4l4,3.9c0.1,0.1,0.2,0.2,0.3,0.4l0.1-0.4
	C14.8,22.5,14.7,22.2,14.4,21.9z"/>
<path class="st5" d="M31.5,18l-4,3.9c-0.3,0.3-0.4,0.6-0.3,1l0.1,0.4c0.1-0.2,0.2-0.3,0.3-0.4l4-3.9c0.4-0.4,0.5-0.9,0.2-1.4
	C31.7,17.8,31.6,17.9,31.5,18z"/>
<path class="st5" d="M26.4,29.6L21.5,27c-0.3-0.2-0.7-0.2-1.1,0l-4.9,2.6c-0.6,0.3-1.3,0.1-1.6-0.5c0,0,0-0.1,0-0.1l-0.1,0.4
	c-0.1,0.6,0.3,1.2,1,1.3c0.3,0,0.5,0,0.7-0.1l4.9-2.6c0.3-0.2,0.7-0.2,1.1,0l4.9,2.6c0.6,0.3,1.3,0.1,1.6-0.5
	c0.1-0.2,0.2-0.5,0.1-0.7L28,29C27.8,29.6,27.1,29.9,26.4,29.6C26.5,29.6,26.4,29.6,26.4,29.6z"/>
</svg>
