<?xml version="1.0" encoding="utf-8"?>
<!-- Generator: Adobe Illustrator 21.0.0, SVG Export Plug-In . SVG Version: 6.00 Build 0)  -->
<svg version="1.1" id="katman_1" xmlns="http://www.w3.org/2000/svg" xmlns:xlink="http://www.w3.org/1999/xlink" x="0px" y="0px"
	 viewBox="0 0 16 16" style="enable-background:new 0 0 16 16;" xml:space="preserve">
<style type="text/css">
	.st0{fill:#303234;}
</style>
<title>insert-link_2</title>
<path class="st0" d="M4.2,5.3h7.7c0.5,0,0.9,0.4,0.9,1v0.1c0,0.5-0.4,1-0.9,1H4.2c-0.5,0-1-0.4-1-1V6.2C3.2,5.7,3.7,5.3,4.2,5.3z"/>
<path class="st0" d="M10.1,11.2l-1.8,1.8c-0.2,0.2-0.4,0.2-0.6,0l0,0l-1.8-1.8H3.2l3.4,3.5l1.1,1.1c0.2,0.2,0.4,0.2,0.6,0l0,0
	l4.5-4.5L10.1,11.2z"/>
<path class="st0" d="M7.1,8.4h-3c-0.1,0-0.2,0-0.2,0v0C3,8.2,2.2,7.3,2.2,6.3c0-1,0.6-1.8,1.5-2.1c0.1,0,0.6-0.1,0.6-0.1h2.8
	c0.1,0,0.2-0.1,0.2-0.2V2.5c0-0.1-0.1-0.2-0.2-0.2H4c0,0,0,0,0,0v0C1.8,2.4,0,4.2,0,6.3c0,2.2,1.8,4,3.9,4v0c0,0,0,0,0,0h3.2
	c0.1,0,0.2-0.1,0.2-0.2V8.6C7.3,8.5,7.2,8.4,7.1,8.4z"/>
<path class="st0" d="M8.9,8.4h3c0.1,0,0.2,0,0.2,0v0c1-0.2,1.7-1.1,1.7-2.1c0-1-0.6-1.8-1.5-2.1c-0.1,0-0.6-0.1-0.6-0.1H8.9
	C8.8,4.1,8.7,4,8.7,3.9V2.5c0-0.1,0.1-0.2,0.2-0.2H12c0,0,0,0,0,0v0c2.2,0,3.9,1.8,3.9,4c0,2.2-1.8,4-3.9,4v0c0,0,0,0,0,0H8.9
	c-0.1,0-0.2-0.1-0.2-0.2V8.6C8.7,8.5,8.8,8.4,8.9,8.4z"/>
</svg>
