<?xml version="1.0" encoding="utf-8"?>
<!-- Generator: Adobe Illustrator 21.0.0, SVG Export Plug-In . SVG Version: 6.00 Build 0)  -->
<svg version="1.1" id="katman_1" xmlns="http://www.w3.org/2000/svg" xmlns:xlink="http://www.w3.org/1999/xlink" x="0px" y="0px"
	 viewBox="0 0 46.5 48" style="enable-background:new 0 0 46.5 48;" xml:space="preserve">
<style type="text/css">
	.st0{fill:url(#SVGID_1_);}
	.st1{fill:#F2F2F2;}
	.st2{opacity:0.1;fill:#FFFFFF;enable-background:new    ;}
	.st3{opacity:0.1;enable-background:new    ;}
</style>
<title>system-lock-screen_1</title>
<radialGradient id="SVGID_1_" cx="23.27" cy="24.46" r="23.27" gradientTransform="matrix(1 0 0 -1 0 47.73)" gradientUnits="userSpaceOnUse">
	<stop  offset="0" style="stop-color:#74BB6F"/>
	<stop  offset="0.26" style="stop-color:#70BA6E"/>
	<stop  offset="0.51" style="stop-color:#65B769"/>
	<stop  offset="0.74" style="stop-color:#52B362"/>
	<stop  offset="0.97" style="stop-color:#38AC58"/>
	<stop  offset="1" style="stop-color:#34AB56"/>
</radialGradient>
<circle class="st0" cx="23.3" cy="23.3" r="23.3"/>
<path class="st1" d="M34.2,19.5h-2v-2.1c0-4.8-3.8-8.8-8.6-8.9H23c-4.8,0.2-8.6,4.1-8.6,8.9v2.1h-2c-0.6,0-1.1,0.5-1.1,1.1v15.1
	c0,0.6,0.5,1.1,1.1,1.1c0,0,0,0,0,0h21.8c0.6,0,1.1-0.5,1.1-1.1v0V20.6C35.2,20,34.8,19.5,34.2,19.5L34.2,19.5z M17.7,17.3
	c0-3.1,2.5-5.5,5.5-5.5s5.5,2.5,5.5,5.5c0,0,0,0,0,0v2.1H17.7V17.3z M25.1,28.7v4c0,0.5-0.4,0.9-0.9,0.9h-1.9
	c-0.5,0-0.9-0.4-0.9-0.9v-4c-1-1-1-2.5,0-3.5c0.4-0.4,0.9-0.7,1.5-0.7h0.5c1.3,0.1,2.4,1.3,2.2,2.6C25.7,27.8,25.5,28.3,25.1,28.7
	L25.1,28.7z"/>
<path class="st2" d="M23.3,1.5c12.6,0,22.9,10,23.3,22.5c0-0.2,0-0.5,0-0.7c-0.3-12.8-10.9-23-23.7-22.8C10.3,0.7,0.3,10.8,0,23.3
	c0,0.2,0,0.5,0,0.7C0.4,11.4,10.7,1.4,23.3,1.5z"/>
<path class="st3" d="M23.3,46.6C10.7,46.6,0.4,36.6,0,24c0,0.2,0,0.5,0,0.7C0,37.6,10.4,48,23.3,48s23.3-10.4,23.3-23.3
	c0-0.2,0-0.5,0-0.7C46.2,36.6,35.8,46.6,23.3,46.6z"/>
<path class="st3" d="M34.2,36.7H12.4c-0.6,0-1.1-0.5-1.1-1.1l0,0v1.5c0,0.6,0.5,1.1,1.1,1.1c0,0,0,0,0,0h21.8c0.6,0,1.1-0.5,1.1-1.1
	v0v-1.5C35.2,36.2,34.8,36.7,34.2,36.7L34.2,36.7z"/>
<path class="st3" d="M23.3,11.8c-3.1,0-5.5,2.5-5.5,5.6v1.5c0-3.1,2.5-5.5,5.5-5.5s5.5,2.5,5.5,5.5c0,0,0,0,0,0v-1.5
	C28.8,14.3,26.3,11.8,23.3,11.8z"/>
<path class="st3" d="M23.5,24.6H23c-1.3,0.1-2.3,1.2-2.2,2.5c0,0.2,0,0.5,0.1,0.7c0.3-1,1.1-1.7,2.1-1.7h0.5c1,0.1,1.9,0.7,2.1,1.7
	c0.1-0.2,0.1-0.5,0.1-0.7C25.8,25.7,24.8,24.6,23.5,24.6z"/>
</svg>
