<?xml version="1.0" encoding="utf-8"?>
<!-- Generator: Adobe Illustrator 21.0.0, SVG Export Plug-In . SVG Version: 6.00 Build 0)  -->
<svg version="1.1" id="katman_1" xmlns="http://www.w3.org/2000/svg" xmlns:xlink="http://www.w3.org/1999/xlink" x="0px" y="0px"
	 viewBox="0 0 62.7 64" style="enable-background:new 0 0 62.7 64;" xml:space="preserve">
<style type="text/css">
	.st0{opacity:0.7;fill:#414042;enable-background:new    ;}
	.st1{fill:url(#SVGID_1_);}
	.st2{fill:url(#SVGID_2_);}
	.st3{opacity:0.2;fill:#231F20;enable-background:new    ;}
	.st4{fill:url(#SVGID_3_);}
	.st5{fill:url(#SVGID_4_);}
	.st6{opacity:0.1;fill:#FFFFFF;enable-background:new    ;}
	.st7{opacity:0.2;fill:#010101;enable-background:new    ;}
</style>
<title>konsole</title>
<path class="st0" d="M2.6,62.7c-1.4,0-2.6-1.2-2.6-2.6c0,0,0,0,0,0V2.6C0,1.2,1.2,0,2.6,0c0,0,0,0,0,0h57.5c1.4,0,2.6,1.2,2.6,2.6
	l0,0v57.5c0,1.4-1.2,2.6-2.6,2.6l0,0H2.6z M58,58V4.7H4.7V58H58z"/>
<linearGradient id="SVGID_1_" gradientUnits="userSpaceOnUse" x1="31.35" y1="6.23" x2="31.35" y2="62.33" gradientTransform="matrix(1 0 0 -1 0 63.73)">
	<stop  offset="0" style="stop-color:#1A1A1A"/>
	<stop  offset="1" style="stop-color:#404745"/>
</linearGradient>
<rect x="4" y="4" class="st1" width="54.7" height="54.7"/>
<linearGradient id="SVGID_2_" gradientUnits="userSpaceOnUse" x1="31.335" y1="3.02" x2="31.335" y2="66.01" gradientTransform="matrix(1 0 0 -1 0 63.73)">
	<stop  offset="0" style="stop-color:#A3A3A3"/>
	<stop  offset="0.13" style="stop-color:#BCBBBB"/>
	<stop  offset="0.27" style="stop-color:#D0CECE"/>
	<stop  offset="0.43" style="stop-color:#DEDCDB"/>
	<stop  offset="0.64" style="stop-color:#E6E4E3"/>
	<stop  offset="1" style="stop-color:#E8E6E5"/>
</linearGradient>
<path class="st2" d="M60.1,0.7H2.6c-1.1,0-1.9,0.9-1.9,1.9v57.5c0,1,0.9,1.9,1.9,1.9h57.5c1,0,1.9-0.9,1.9-1.9V2.6
	C62,1.5,61.2,0.7,60.1,0.7z M58,58H4.6V4.6H58V58z"/>
<path class="st3" d="M31.4,46.3c-1.9-0.1-3.4-1.7-3.3-3.6c0.1-1.8,1.5-3.2,3.3-3.3h19.4c1.9-0.1,3.5,1.4,3.6,3.3
	c0.1,1.9-1.4,3.5-3.3,3.6c-0.1,0-0.2,0-0.4,0H31.4z"/>
<linearGradient id="SVGID_3_" gradientUnits="userSpaceOnUse" x1="41.08" y1="54.11" x2="41.08" y2="12.07" gradientTransform="matrix(1 0 0 -1 0 63.73)">
	<stop  offset="0" style="stop-color:#E8E6E5"/>
	<stop  offset="0.48" style="stop-color:#E6E4E3"/>
	<stop  offset="0.66" style="stop-color:#DFDEDD"/>
	<stop  offset="0.78" style="stop-color:#D4D2D1"/>
	<stop  offset="0.88" style="stop-color:#C3C2C1"/>
	<stop  offset="0.97" style="stop-color:#ADADAD"/>
	<stop  offset="1" style="stop-color:#A3A3A3"/>
</linearGradient>
<path class="st4" d="M50.8,40.1H31.4c-1.5-0.1-2.8,1.1-2.9,2.6c-0.1,1.5,1.1,2.8,2.6,2.9c0.1,0,0.2,0,0.3,0h19.4
	c1.5,0.1,2.8-1.1,2.9-2.6c0.1-1.5-1.1-2.8-2.6-2.9C51,40.1,50.9,40.1,50.8,40.1z"/>
<path class="st3" d="M11.9,46.3c-1.9,0-3.4-1.6-3.4-3.5c0-0.9,0.4-1.8,1-2.4l11.3-11.3L9.5,17.8c-1.4-1.3-1.6-3.4-0.3-4.9
	s3.4-1.6,4.9-0.3c0.1,0.1,0.2,0.2,0.3,0.3l13.8,13.7c1.3,1.4,1.3,3.6,0,4.9L14.4,45.3C13.7,45.9,12.8,46.3,11.9,46.3z"/>
<linearGradient id="SVGID_4_" gradientUnits="userSpaceOnUse" x1="18.7554" y1="54.11" x2="18.7554" y2="12.07" gradientTransform="matrix(1 0 0 -1 0 63.73)">
	<stop  offset="0" style="stop-color:#E8E6E5"/>
	<stop  offset="0.48" style="stop-color:#E6E4E3"/>
	<stop  offset="0.66" style="stop-color:#DFDEDD"/>
	<stop  offset="0.78" style="stop-color:#D4D2D1"/>
	<stop  offset="0.88" style="stop-color:#C3C2C1"/>
	<stop  offset="0.97" style="stop-color:#ADADAD"/>
	<stop  offset="1" style="stop-color:#A3A3A3"/>
</linearGradient>
<path class="st5" d="M28.4,29.1c0-0.7-0.3-1.5-0.8-2L13.9,13.4c-1.1-1.1-2.8-1.2-3.9-0.1s-1.2,2.8-0.1,3.9c0,0,0.1,0.1,0.1,0.1
	l11.8,11.8L9.9,40.9c-1.1,1.1-1,2.9,0.1,3.9c1.1,1,2.7,1,3.8,0l13.7-13.8C28.1,30.5,28.4,29.8,28.4,29.1z"/>
<rect x="4.6" y="58" class="st6" width="53.4" height="2"/>
<path class="st6" d="M60.1,0.7H2.6c-1.1,0-1.9,0.9-1.9,1.9v2c0-1.1,0.8-1.9,1.9-2c0,0,0,0,0,0h57.5c1,0,1.9,0.9,1.9,1.9v-2
	C62,1.5,61.1,0.7,60.1,0.7z"/>
<rect x="4.6" y="4.6" class="st7" width="53.4" height="2"/>
<path class="st7" d="M60.1,62H2.6c-1,0-1.9-0.8-1.9-1.9v2c0,1,0.9,1.9,1.9,1.9h57.5c1,0,1.9-0.9,1.9-1.9v-2C62,61.1,61.2,62,60.1,62
	z"/>
<path class="st6" d="M31.4,42h19.4c1.2,0,2.2,0.7,2.6,1.8c0.6-1.4-0.2-3-1.6-3.6c-0.3-0.1-0.7-0.2-1-0.2H31.4
	c-1.5,0-2.8,1.2-2.8,2.7c0,0.3,0.1,0.7,0.2,1C29.2,42.7,30.2,42,31.4,42z"/>
<path class="st7" d="M50.8,45.6H31.4c-1.2,0-2.2-0.7-2.6-1.8c-0.6,1.4,0.2,3,1.6,3.6c0.3,0.1,0.7,0.2,1,0.2h19.4
	c1.5,0,2.8-1.2,2.8-2.7c0-0.3-0.1-0.7-0.2-1C53,44.9,52,45.6,50.8,45.6z"/>
<path class="st6" d="M21.8,31l-1-1L9.9,40.9c-0.8,0.8-1,1.9-0.6,2.9c0.1-0.4,0.4-0.7,0.6-1L21.8,31z"/>
<path class="st6" d="M13.9,15.3l13.7,13.7c0.3,0.3,0.5,0.6,0.6,1c0.1-0.3,0.2-0.7,0.2-1c0-0.7-0.3-1.5-0.8-2L13.9,13.4
	c-1.1-1.1-2.8-1.1-3.9,0c-0.8,0.8-1.1,2-0.6,3c0.5-1.4,2.1-2.2,3.6-1.6C13.3,14.8,13.6,15,13.9,15.3L13.9,15.3z"/>
<path class="st7" d="M9.9,17.3c-0.3-0.3-0.5-0.6-0.6-1c-0.4,1-0.1,2.2,0.6,2.9l10.8,10.8l1-1L9.9,17.3z"/>
<path class="st7" d="M27.6,31.1L13.9,44.8c-1.1,1.1-2.8,1.1-3.9,0c-0.3-0.3-0.5-0.6-0.6-1c-0.6,1.4,0.2,3,1.6,3.6
	c1,0.4,2.2,0.1,3-0.6L27.6,33c0.8-0.8,1-2,0.6-3C28.1,30.4,27.9,30.8,27.6,31.1z"/>
</svg>
