<?xml version="1.0" encoding="utf-8"?>
<!-- Generator: Adobe Illustrator 21.0.0, SVG Export Plug-In . SVG Version: 6.00 Build 0)  -->
<svg version="1.1" id="katman_1" xmlns="http://www.w3.org/2000/svg" xmlns:xlink="http://www.w3.org/1999/xlink" x="0px" y="0px"
	 viewBox="0 0 16 12" style="enable-background:new 0 0 16 12;" xml:space="preserve">
<style type="text/css">
	.st0{opacity:0.7;fill:#09172D;enable-background:new    ;}
	.st1{fill:url(#SVGID_1_);}
	.st2{opacity:0.8;fill:#0E141E;enable-background:new    ;}
	.st3{fill:url(#SVGID_2_);}
	.st4{opacity:0.1;fill:#FFFFFF;enable-background:new    ;}
	.st5{opacity:0.1;enable-background:new    ;}
</style>
<title>Varlık 6</title>
<rect x="0" y="0" class="st0" width="15.9" height="10.6"/>
<linearGradient id="SVGID_1_" gradientUnits="userSpaceOnUse" x1="8" y1="94.92" x2="8" y2="105.11" gradientTransform="matrix(1 0 0 1 0 -94.6)">
	<stop  offset="0" style="stop-color:#2A6D94"/>
	<stop  offset="1" style="stop-color:#2D5778"/>
</linearGradient>
<rect x="0.2" y="0.1" class="st1" width="15.7" height="10.4"/>
<path class="st2" d="M0.4,11.6c-0.2,0-0.4-0.2-0.4-0.4V9.9h16v1.3c0,0.2-0.2,0.4-0.4,0.4h0L0.4,11.6z"/>
<linearGradient id="SVGID_2_" gradientUnits="userSpaceOnUse" x1="8.005" y1="89.93" x2="8.005" y2="105.96" gradientTransform="matrix(1 0 0 1 0 -94.6)">
	<stop  offset="0" style="stop-color:#A3A4A4"/>
	<stop  offset="0.12" style="stop-color:#BBBBBB"/>
	<stop  offset="0.27" style="stop-color:#CFCECE"/>
	<stop  offset="0.43" style="stop-color:#DDDCDC"/>
	<stop  offset="0.64" style="stop-color:#E5E4E4"/>
	<stop  offset="1" style="stop-color:#E7E6E6"/>
</linearGradient>
<path class="st3" d="M15.9,10v1.2c0,0.1-0.1,0.3-0.3,0.3l0,0H0.4c-0.1,0-0.3-0.1-0.3-0.3l0,0V10H15.9z"/>
<rect x="0.2" y="0.1" class="st4" width="15.7" height="0.5"/>
<path class="st5" d="M15.6,11.5H0.4c-0.1,0-0.3-0.1-0.3-0.3l0,0v0.5c0,0.1,0.1,0.3,0.2,0.3c0,0,0,0,0,0h15.2c0.1,0,0.3-0.1,0.3-0.3
	l0,0v-0.5C15.9,11.4,15.7,11.5,15.6,11.5z"/>
<rect x="0.1" y="10" class="st4" width="15.8" height="0.5"/>
</svg>
