<?xml version="1.0" encoding="utf-8"?>
<!-- Generator: Adobe Illustrator 21.0.0, SVG Export Plug-In . SVG Version: 6.00 Build 0)  -->
<svg version="1.1" id="katman_1" xmlns="http://www.w3.org/2000/svg" xmlns:xlink="http://www.w3.org/1999/xlink" x="0px" y="0px"
	 viewBox="0 0 12.6 16" style="enable-background:new 0 0 12.6 16;" xml:space="preserve">
<style type="text/css">
	.st0{fill:url(#SVGID_1_);}
	.st1{fill:url(#SVGID_2_);}
	.st2{opacity:0.5;enable-background:new    ;}
	.st3{fill:url(#SVGID_3_);}
	.st4{opacity:0.2;fill:#FFFFFF;enable-background:new    ;}
	.st5{opacity:0.2;enable-background:new    ;}
	.st6{opacity:0.3;}
	.st7{fill:url(#SVGID_4_);}
	.st8{fill:url(#SVGID_5_);}
	.st9{fill:url(#SVGID_6_);}
	.st10{fill:url(#SVGID_7_);}
	.st11{fill:url(#SVGID_8_);}
	.st12{fill:url(#SVGID_9_);}
	.st13{fill:url(#SVGID_10_);}
	.st14{fill:url(#SVGID_11_);}
	.st15{fill:url(#SVGID_12_);}
	.st16{fill:url(#SVGID_13_);}
	.st17{fill:url(#SVGID_14_);}
	.st18{fill:url(#SVGID_15_);}
	.st19{fill:url(#SVGID_16_);}
	.st20{fill:url(#SVGID_17_);}
	.st21{fill:url(#SVGID_18_);}
	.st22{fill:url(#SVGID_19_);}
	.st23{fill:url(#SVGID_20_);}
	.st24{fill:url(#SVGID_21_);}
	.st25{fill:url(#SVGID_22_);}
	.st26{fill:url(#SVGID_23_);}
	.st27{fill:url(#SVGID_24_);}
	.st28{fill:url(#SVGID_25_);}
	.st29{fill:url(#SVGID_26_);}
	.st30{fill:url(#SVGID_27_);}
	.st31{fill:url(#SVGID_28_);}
	.st32{fill:url(#SVGID_29_);}
	.st33{fill:url(#SVGID_30_);}
	.st34{fill:url(#SVGID_31_);}
	.st35{fill:url(#SVGID_32_);}
	.st36{fill:url(#SVGID_33_);}
	.st37{fill:url(#SVGID_34_);}
</style>
<title>mugshot_5</title>
<linearGradient id="SVGID_1_" gradientUnits="userSpaceOnUse" x1="6.305" y1="-2.78" x2="6.305" y2="21.2" gradientTransform="matrix(1 0 0 -1 0 15.73)">
	<stop  offset="5.000000e-02" style="stop-color:#1A1A1A"/>
	<stop  offset="0.35" style="stop-color:#1F1F1F"/>
	<stop  offset="0.69" style="stop-color:#2C2C2C"/>
	<stop  offset="1" style="stop-color:#404040"/>
</linearGradient>
<rect y="0" class="st0" width="12.6" height="15.5"/>
<linearGradient id="SVGID_2_" gradientUnits="userSpaceOnUse" x1="6.3" y1="2.42" x2="6.3" y2="18.51" gradientTransform="matrix(1 0 0 -1 0 15.73)">
	<stop  offset="0" style="stop-color:#DD922E"/>
	<stop  offset="6.000000e-02" style="stop-color:#F9AE42"/>
	<stop  offset="0.42" style="stop-color:#F8DB6E"/>
	<stop  offset="1" style="stop-color:#FDDEB1"/>
</linearGradient>
<rect x="0.4" y="1" class="st1" width="11.9" height="11.6"/>
<circle class="st2" cx="6.3" cy="5.2" r="2.3"/>
<radialGradient id="SVGID_3_" cx="8.7693" cy="5.462" r="3.0797" gradientTransform="matrix(0.97 0 0 -0.97 -2.2 10.5181)" gradientUnits="userSpaceOnUse">
	<stop  offset="0" style="stop-color:#E7E6E6"/>
	<stop  offset="0.26" style="stop-color:#E3E3E3"/>
	<stop  offset="0.49" style="stop-color:#D9D8D8"/>
	<stop  offset="0.72" style="stop-color:#C6C6C6"/>
	<stop  offset="0.93" style="stop-color:#ADAEAE"/>
	<stop  offset="1" style="stop-color:#A3A4A4"/>
</radialGradient>
<circle class="st3" cx="6.3" cy="5.2" r="2.2"/>
<rect y="0" class="st4" width="12.6" height="0.5"/>
<rect y="15.5" class="st5" width="12.6" height="0.5"/>
<rect x="0.4" y="1" class="st4" width="11.9" height="0.5"/>
<rect x="0.4" y="12.6" class="st5" width="11.9" height="0.5"/>
<path class="st4" d="M6.3,3.5c1.1,0,2.1,0.9,2.2,2C8.7,4.3,7.8,3.2,6.6,3S4.2,3.7,4.1,5c0,0.2,0,0.3,0,0.5C4.2,4.3,5.2,3.5,6.3,3.5z
	"/>
<path class="st5" d="M6.3,7.4c-1.1,0-2.1-0.9-2.2-2C3.9,6.7,4.8,7.8,6,7.9S8.4,7.2,8.5,6c0-0.2,0-0.3,0-0.5C8.4,6.6,7.4,7.4,6.3,7.4
	z"/>
<rect x="0.4" y="15.1" class="st5" width="0.1" height="0.4"/>
<rect x="0.7" y="15.1" class="st5" width="0.1" height="0.4"/>
<rect x="1" y="15.1" class="st5" width="0.3" height="0.4"/>
<rect x="4.8" y="15.1" class="st5" width="0.3" height="0.4"/>
<rect x="1.4" y="15.1" class="st5" width="0.2" height="0.4"/>
<rect x="5.4" y="15.1" class="st5" width="0.2" height="0.4"/>
<rect x="4" y="15.1" class="st5" width="0.2" height="0.4"/>
<rect x="2" y="15.1" class="st5" width="0.1" height="0.4"/>
<rect x="2.4" y="15.1" class="st5" width="0.1" height="0.4"/>
<rect x="5.9" y="15.1" class="st5" width="0.1" height="0.4"/>
<rect x="6.1" y="15.1" class="st5" width="0.1" height="0.4"/>
<rect x="6.4" y="15.1" class="st5" width="0.1" height="0.4"/>
<rect x="11.8" y="15.1" class="st5" width="0.1" height="0.4"/>
<rect x="12.1" y="15.1" class="st5" width="0.1" height="0.4"/>
<rect x="6.6" y="15.1" class="st5" width="0.1" height="0.4"/>
<rect x="7.2" y="15.1" class="st5" width="0.1" height="0.4"/>
<rect x="7.5" y="15.1" class="st5" width="0.1" height="0.4"/>
<rect x="8" y="15.1" class="st5" width="0.1" height="0.4"/>
<rect x="8.9" y="15.1" class="st5" width="0.1" height="0.4"/>
<rect x="9.2" y="15.1" class="st5" width="0.1" height="0.4"/>
<rect x="9.4" y="15.1" class="st5" width="0.1" height="0.4"/>
<rect x="10.9" y="15.1" class="st5" width="0.1" height="0.4"/>
<rect x="10.1" y="15.1" class="st5" width="0.2" height="0.4"/>
<rect x="10.4" y="15.1" class="st5" width="0.2" height="0.4"/>
<rect x="8.3" y="15.1" class="st5" width="0.4" height="0.4"/>
<rect x="11.2" y="15.1" class="st5" width="0.4" height="0.4"/>
<rect x="2.7" y="15.1" class="st5" width="0.1" height="0.4"/>
<rect x="4.4" y="15.1" class="st5" width="0.1" height="0.4"/>
<rect x="3.7" y="15.1" class="st5" width="0.1" height="0.4"/>
<rect x="3" y="15.1" class="st5" width="0.3" height="0.4"/>
<g class="st6">
	
		<linearGradient id="SVGID_4_" gradientUnits="userSpaceOnUse" x1="0.44" y1="1.63" x2="0.56" y2="1.63" gradientTransform="matrix(1 0 0 -1 0 15.73)">
		<stop  offset="0" style="stop-color:#E9E3E2"/>
		<stop  offset="0.14" style="stop-color:#E8E4E4"/>
		<stop  offset="1" style="stop-color:#E7E6E6"/>
	</linearGradient>
	<rect x="0.4" y="13.1" class="st7" width="0.1" height="2"/>
	
		<linearGradient id="SVGID_5_" gradientUnits="userSpaceOnUse" x1="0.67" y1="1.63" x2="0.79" y2="1.63" gradientTransform="matrix(1 0 0 -1 0 15.73)">
		<stop  offset="0" style="stop-color:#E9E3E2"/>
		<stop  offset="0.14" style="stop-color:#E8E4E4"/>
		<stop  offset="1" style="stop-color:#E7E6E6"/>
	</linearGradient>
	<rect x="0.7" y="13.1" class="st8" width="0.1" height="2"/>
	
		<linearGradient id="SVGID_6_" gradientUnits="userSpaceOnUse" x1="0.96" y1="1.63" x2="1.27" y2="1.63" gradientTransform="matrix(1 0 0 -1 0 15.73)">
		<stop  offset="0" style="stop-color:#E9E3E2"/>
		<stop  offset="0.14" style="stop-color:#E8E4E4"/>
		<stop  offset="1" style="stop-color:#E7E6E6"/>
	</linearGradient>
	<rect x="1" y="13.1" class="st9" width="0.3" height="2"/>
	
		<linearGradient id="SVGID_7_" gradientUnits="userSpaceOnUse" x1="4.8" y1="1.63" x2="5.1" y2="1.63" gradientTransform="matrix(1 0 0 -1 0 15.73)">
		<stop  offset="0" style="stop-color:#E9E3E2"/>
		<stop  offset="0.14" style="stop-color:#E8E4E4"/>
		<stop  offset="1" style="stop-color:#E7E6E6"/>
	</linearGradient>
	<rect x="4.8" y="13.1" class="st10" width="0.3" height="2"/>
	
		<linearGradient id="SVGID_8_" gradientUnits="userSpaceOnUse" x1="1.42" y1="1.63" x2="1.65" y2="1.63" gradientTransform="matrix(1 0 0 -1 0 15.73)">
		<stop  offset="0" style="stop-color:#E9E3E2"/>
		<stop  offset="0.14" style="stop-color:#E8E4E4"/>
		<stop  offset="1" style="stop-color:#E7E6E6"/>
	</linearGradient>
	<rect x="1.4" y="13.1" class="st11" width="0.2" height="2"/>
	
		<linearGradient id="SVGID_9_" gradientUnits="userSpaceOnUse" x1="5.37" y1="1.63" x2="5.6" y2="1.63" gradientTransform="matrix(1 0 0 -1 0 15.73)">
		<stop  offset="0" style="stop-color:#E9E3E2"/>
		<stop  offset="0.14" style="stop-color:#E8E4E4"/>
		<stop  offset="1" style="stop-color:#E7E6E6"/>
	</linearGradient>
	<rect x="5.4" y="13.1" class="st12" width="0.2" height="2"/>
	
		<linearGradient id="SVGID_10_" gradientUnits="userSpaceOnUse" x1="4.03" y1="1.63" x2="4.26" y2="1.63" gradientTransform="matrix(1 0 0 -1 0 15.73)">
		<stop  offset="0" style="stop-color:#E9E3E2"/>
		<stop  offset="0.14" style="stop-color:#E8E4E4"/>
		<stop  offset="1" style="stop-color:#E7E6E6"/>
	</linearGradient>
	<rect x="4" y="13.1" class="st13" width="0.2" height="2"/>
	
		<linearGradient id="SVGID_11_" gradientUnits="userSpaceOnUse" x1="2.04" y1="1.63" x2="2.16" y2="1.63" gradientTransform="matrix(1 0 0 -1 0 15.73)">
		<stop  offset="0" style="stop-color:#E9E3E2"/>
		<stop  offset="0.14" style="stop-color:#E8E4E4"/>
		<stop  offset="1" style="stop-color:#E7E6E6"/>
	</linearGradient>
	<rect x="2" y="13.1" class="st14" width="0.1" height="2"/>
	
		<linearGradient id="SVGID_12_" gradientUnits="userSpaceOnUse" x1="2.41" y1="1.63" x2="2.53" y2="1.63" gradientTransform="matrix(1 0 0 -1 0 15.73)">
		<stop  offset="0" style="stop-color:#E9E3E2"/>
		<stop  offset="0.14" style="stop-color:#E8E4E4"/>
		<stop  offset="1" style="stop-color:#E7E6E6"/>
	</linearGradient>
	<rect x="2.4" y="13.1" class="st15" width="0.1" height="2"/>
	
		<linearGradient id="SVGID_13_" gradientUnits="userSpaceOnUse" x1="5.87" y1="1.63" x2="5.99" y2="1.63" gradientTransform="matrix(1 0 0 -1 0 15.73)">
		<stop  offset="0" style="stop-color:#E9E3E2"/>
		<stop  offset="0.14" style="stop-color:#E8E4E4"/>
		<stop  offset="1" style="stop-color:#E7E6E6"/>
	</linearGradient>
	<rect x="5.9" y="13.1" class="st16" width="0.1" height="2"/>
	
		<linearGradient id="SVGID_14_" gradientUnits="userSpaceOnUse" x1="6.12" y1="1.63" x2="6.23" y2="1.63" gradientTransform="matrix(1 0 0 -1 0 15.73)">
		<stop  offset="0" style="stop-color:#E9E3E2"/>
		<stop  offset="0.14" style="stop-color:#E8E4E4"/>
		<stop  offset="1" style="stop-color:#E7E6E6"/>
	</linearGradient>
	<rect x="6.1" y="13.1" class="st17" width="0.1" height="2"/>
	
		<linearGradient id="SVGID_15_" gradientUnits="userSpaceOnUse" x1="6.37" y1="1.63" x2="6.49" y2="1.63" gradientTransform="matrix(1 0 0 -1 0 15.73)">
		<stop  offset="0" style="stop-color:#E9E3E2"/>
		<stop  offset="0.14" style="stop-color:#E8E4E4"/>
		<stop  offset="1" style="stop-color:#E7E6E6"/>
	</linearGradient>
	<rect x="6.4" y="13.1" class="st18" width="0.1" height="2"/>
	
		<linearGradient id="SVGID_16_" gradientUnits="userSpaceOnUse" x1="11.79" y1="1.63" x2="11.91" y2="1.63" gradientTransform="matrix(1 0 0 -1 0 15.73)">
		<stop  offset="0" style="stop-color:#E9E3E2"/>
		<stop  offset="0.14" style="stop-color:#E8E4E4"/>
		<stop  offset="1" style="stop-color:#E7E6E6"/>
	</linearGradient>
	<rect x="11.8" y="13.1" class="st19" width="0.1" height="2"/>
	
		<linearGradient id="SVGID_17_" gradientUnits="userSpaceOnUse" x1="12.05" y1="1.63" x2="12.16" y2="1.63" gradientTransform="matrix(1 0 0 -1 0 15.73)">
		<stop  offset="0" style="stop-color:#E9E3E2"/>
		<stop  offset="0.14" style="stop-color:#E8E4E4"/>
		<stop  offset="1" style="stop-color:#E7E6E6"/>
	</linearGradient>
	<rect x="12.1" y="13.1" class="st20" width="0.1" height="2"/>
	
		<linearGradient id="SVGID_18_" gradientUnits="userSpaceOnUse" x1="6.63" y1="1.63" x2="6.74" y2="1.63" gradientTransform="matrix(1 0 0 -1 0 15.73)">
		<stop  offset="0" style="stop-color:#E9E3E2"/>
		<stop  offset="0.14" style="stop-color:#E8E4E4"/>
		<stop  offset="1" style="stop-color:#E7E6E6"/>
	</linearGradient>
	<rect x="6.6" y="13.1" class="st21" width="0.1" height="2"/>
	
		<linearGradient id="SVGID_19_" gradientUnits="userSpaceOnUse" x1="7.2" y1="1.63" x2="7.32" y2="1.63" gradientTransform="matrix(1 0 0 -1 0 15.73)">
		<stop  offset="0" style="stop-color:#E9E3E2"/>
		<stop  offset="0.14" style="stop-color:#E8E4E4"/>
		<stop  offset="1" style="stop-color:#E7E6E6"/>
	</linearGradient>
	<rect x="7.2" y="13.1" class="st22" width="0.1" height="2"/>
	
		<linearGradient id="SVGID_20_" gradientUnits="userSpaceOnUse" x1="7.49" y1="1.63" x2="7.6" y2="1.63" gradientTransform="matrix(1 0 0 -1 0 15.73)">
		<stop  offset="0" style="stop-color:#E9E3E2"/>
		<stop  offset="0.14" style="stop-color:#E8E4E4"/>
		<stop  offset="1" style="stop-color:#E7E6E6"/>
	</linearGradient>
	<rect x="7.5" y="13.1" class="st23" width="0.1" height="2"/>
	
		<linearGradient id="SVGID_21_" gradientUnits="userSpaceOnUse" x1="7.97" y1="1.63" x2="8.09" y2="1.63" gradientTransform="matrix(1 0 0 -1 0 15.73)">
		<stop  offset="0" style="stop-color:#E9E3E2"/>
		<stop  offset="0.14" style="stop-color:#E8E4E4"/>
		<stop  offset="1" style="stop-color:#E7E6E6"/>
	</linearGradient>
	<rect x="8" y="13.1" class="st24" width="0.1" height="2"/>
	
		<linearGradient id="SVGID_22_" gradientUnits="userSpaceOnUse" x1="8.89" y1="1.63" x2="9.01" y2="1.63" gradientTransform="matrix(1 0 0 -1 0 15.73)">
		<stop  offset="0" style="stop-color:#E9E3E2"/>
		<stop  offset="0.14" style="stop-color:#E8E4E4"/>
		<stop  offset="1" style="stop-color:#E7E6E6"/>
	</linearGradient>
	<rect x="8.9" y="13.1" class="st25" width="0.1" height="2"/>
	
		<linearGradient id="SVGID_23_" gradientUnits="userSpaceOnUse" x1="9.21" y1="1.63" x2="9.33" y2="1.63" gradientTransform="matrix(1 0 0 -1 0 15.73)">
		<stop  offset="0" style="stop-color:#E9E3E2"/>
		<stop  offset="0.14" style="stop-color:#E8E4E4"/>
		<stop  offset="1" style="stop-color:#E7E6E6"/>
	</linearGradient>
	<rect x="9.2" y="13.1" class="st26" width="0.1" height="2"/>
	
		<linearGradient id="SVGID_24_" gradientUnits="userSpaceOnUse" x1="9.45" y1="1.63" x2="9.57" y2="1.63" gradientTransform="matrix(1 0 0 -1 0 15.73)">
		<stop  offset="0" style="stop-color:#E9E3E2"/>
		<stop  offset="0.14" style="stop-color:#E8E4E4"/>
		<stop  offset="1" style="stop-color:#E7E6E6"/>
	</linearGradient>
	<rect x="9.4" y="13.1" class="st27" width="0.1" height="2"/>
	
		<linearGradient id="SVGID_25_" gradientUnits="userSpaceOnUse" x1="10.92" y1="1.63" x2="11.04" y2="1.63" gradientTransform="matrix(1 0 0 -1 0 15.73)">
		<stop  offset="0" style="stop-color:#E9E3E2"/>
		<stop  offset="0.14" style="stop-color:#E8E4E4"/>
		<stop  offset="1" style="stop-color:#E7E6E6"/>
	</linearGradient>
	<rect x="10.9" y="13.1" class="st28" width="0.1" height="2"/>
	
		<linearGradient id="SVGID_26_" gradientUnits="userSpaceOnUse" x1="10.07" y1="1.63" x2="10.3" y2="1.63" gradientTransform="matrix(1 0 0 -1 0 15.73)">
		<stop  offset="0" style="stop-color:#E9E3E2"/>
		<stop  offset="0.14" style="stop-color:#E8E4E4"/>
		<stop  offset="1" style="stop-color:#E7E6E6"/>
	</linearGradient>
	<rect x="10.1" y="13.1" class="st29" width="0.2" height="2"/>
	
		<linearGradient id="SVGID_27_" gradientUnits="userSpaceOnUse" x1="10.44" y1="1.63" x2="10.67" y2="1.63" gradientTransform="matrix(1 0 0 -1 0 15.73)">
		<stop  offset="0" style="stop-color:#E9E3E2"/>
		<stop  offset="0.14" style="stop-color:#E8E4E4"/>
		<stop  offset="1" style="stop-color:#E7E6E6"/>
	</linearGradient>
	<rect x="10.4" y="13.1" class="st30" width="0.2" height="2"/>
	
		<linearGradient id="SVGID_28_" gradientUnits="userSpaceOnUse" x1="8.33" y1="1.63" x2="8.72" y2="1.63" gradientTransform="matrix(1 0 0 -1 0 15.73)">
		<stop  offset="0" style="stop-color:#E9E3E2"/>
		<stop  offset="0.14" style="stop-color:#E8E4E4"/>
		<stop  offset="1" style="stop-color:#E7E6E6"/>
	</linearGradient>
	<rect x="8.3" y="13.1" class="st31" width="0.4" height="2"/>
	
		<linearGradient id="SVGID_29_" gradientUnits="userSpaceOnUse" x1="11.18" y1="1.63" x2="11.57" y2="1.63" gradientTransform="matrix(1 0 0 -1 0 15.73)">
		<stop  offset="0" style="stop-color:#E9E3E2"/>
		<stop  offset="0.14" style="stop-color:#E8E4E4"/>
		<stop  offset="1" style="stop-color:#E7E6E6"/>
	</linearGradient>
	<rect x="11.2" y="13.1" class="st32" width="0.4" height="2"/>
	
		<linearGradient id="SVGID_30_" gradientUnits="userSpaceOnUse" x1="2.67" y1="1.63" x2="2.78" y2="1.63" gradientTransform="matrix(1 0 0 -1 0 15.73)">
		<stop  offset="0" style="stop-color:#E9E3E2"/>
		<stop  offset="0.14" style="stop-color:#E8E4E4"/>
		<stop  offset="1" style="stop-color:#E7E6E6"/>
	</linearGradient>
	<rect x="2.7" y="13.1" class="st33" width="0.1" height="2"/>
	
		<linearGradient id="SVGID_31_" gradientUnits="userSpaceOnUse" x1="4.38" y1="1.63" x2="4.49" y2="1.63" gradientTransform="matrix(1 0 0 -1 0 15.73)">
		<stop  offset="0" style="stop-color:#E9E3E2"/>
		<stop  offset="0.14" style="stop-color:#E8E4E4"/>
		<stop  offset="1" style="stop-color:#E7E6E6"/>
	</linearGradient>
	<rect x="4.4" y="13.1" class="st34" width="0.1" height="2"/>
	
		<linearGradient id="SVGID_32_" gradientUnits="userSpaceOnUse" x1="3.65" y1="1.63" x2="3.77" y2="1.63" gradientTransform="matrix(1 0 0 -1 0 15.73)">
		<stop  offset="0" style="stop-color:#E9E3E2"/>
		<stop  offset="0.14" style="stop-color:#E8E4E4"/>
		<stop  offset="1" style="stop-color:#E7E6E6"/>
	</linearGradient>
	<rect x="3.7" y="13.1" class="st35" width="0.1" height="2"/>
	
		<linearGradient id="SVGID_33_" gradientUnits="userSpaceOnUse" x1="3.04" y1="1.63" x2="3.35" y2="1.63" gradientTransform="matrix(1 0 0 -1 0 15.73)">
		<stop  offset="0" style="stop-color:#E9E3E2"/>
		<stop  offset="0.14" style="stop-color:#E8E4E4"/>
		<stop  offset="1" style="stop-color:#E7E6E6"/>
	</linearGradient>
	<rect x="3" y="13.1" class="st36" width="0.3" height="2"/>
</g>
<rect x="0.4" y="13.1" class="st4" width="0.1" height="0.4"/>
<rect x="0.7" y="13.1" class="st4" width="0.1" height="0.4"/>
<rect x="1" y="13.1" class="st4" width="0.3" height="0.4"/>
<rect x="4.8" y="13.1" class="st4" width="0.3" height="0.4"/>
<rect x="1.4" y="13.1" class="st4" width="0.2" height="0.4"/>
<rect x="5.4" y="13.1" class="st4" width="0.2" height="0.4"/>
<rect x="4" y="13.1" class="st4" width="0.2" height="0.4"/>
<rect x="2" y="13.1" class="st4" width="0.1" height="0.4"/>
<rect x="2.4" y="13.1" class="st4" width="0.1" height="0.4"/>
<rect x="5.9" y="13.1" class="st4" width="0.1" height="0.4"/>
<rect x="6.1" y="13.1" class="st4" width="0.1" height="0.4"/>
<rect x="6.4" y="13.1" class="st4" width="0.1" height="0.4"/>
<rect x="11.8" y="13.1" class="st4" width="0.1" height="0.4"/>
<rect x="12.1" y="13.1" class="st4" width="0.1" height="0.4"/>
<rect x="6.6" y="13.1" class="st4" width="0.1" height="0.4"/>
<rect x="7.2" y="13.1" class="st4" width="0.1" height="0.4"/>
<rect x="7.5" y="13.1" class="st4" width="0.1" height="0.4"/>
<rect x="8" y="13.1" class="st4" width="0.1" height="0.4"/>
<rect x="8.9" y="13.1" class="st4" width="0.1" height="0.4"/>
<rect x="9.2" y="13.1" class="st4" width="0.1" height="0.4"/>
<rect x="9.4" y="13.1" class="st4" width="0.1" height="0.4"/>
<rect x="10.9" y="13.1" class="st4" width="0.1" height="0.4"/>
<rect x="10.1" y="13.1" class="st4" width="0.2" height="0.4"/>
<rect x="10.4" y="13.1" class="st4" width="0.2" height="0.4"/>
<rect x="8.3" y="13.1" class="st4" width="0.4" height="0.4"/>
<rect x="11.2" y="13.1" class="st4" width="0.4" height="0.4"/>
<rect x="2.7" y="13.1" class="st4" width="0.1" height="0.4"/>
<rect x="4.4" y="13.1" class="st4" width="0.1" height="0.4"/>
<rect x="3.7" y="13.1" class="st4" width="0.1" height="0.4"/>
<rect x="3" y="13.1" class="st4" width="0.3" height="0.4"/>
<path class="st2" d="M1.1,12.7v-0.3l0,0c0.2-2.8,2.6-5,5.5-4.8c2.6,0.2,4.7,2.2,4.8,4.8l0,0v0.3H1.1z"/>
<radialGradient id="SVGID_34_" cx="5.46" cy="0.57" r="5.63" gradientTransform="matrix(1 0 0 -1 0 15.73)" gradientUnits="userSpaceOnUse">
	<stop  offset="0" style="stop-color:#E7E6E6"/>
	<stop  offset="0.26" style="stop-color:#E3E3E3"/>
	<stop  offset="0.49" style="stop-color:#D9D8D8"/>
	<stop  offset="0.72" style="stop-color:#C6C6C6"/>
	<stop  offset="0.93" style="stop-color:#ADAEAE"/>
	<stop  offset="1" style="stop-color:#A3A4A4"/>
</radialGradient>
<path class="st37" d="M11.3,12.6v-0.1l0,0c0-2.8-2.3-5-5-5s-5,2.3-5,5l0,0l0,0v0.1H11.3z"/>
<path class="st4" d="M11.3,12.5L11.3,12.5c0-2.8-2.3-5-5-5s-5,2.3-5,5l0,0l0,0v0.1l0,0c0-2.8,2.2-5,5-5s5,2.2,5,5l0,0L11.3,12.5z"/>
</svg>
