<?xml version="1.0" encoding="utf-8"?>
<!-- Generator: Adobe Illustrator 21.0.0, SVG Export Plug-In . SVG Version: 6.00 Build 0)  -->
<svg version="1.1" id="katman_1" xmlns="http://www.w3.org/2000/svg" xmlns:xlink="http://www.w3.org/1999/xlink" x="0px" y="0px"
	 viewBox="0 0 32 29.2" style="enable-background:new 0 0 32 29.2;" xml:space="preserve">
<style type="text/css">
	.st0{fill:url(#_Dikdörtgen__1_);}
	.st1{opacity:0.7;fill:#1C1C1C;enable-background:new    ;}
	.st2{fill:url(#_Yol__1_);}
	.st3{fill:url(#_Bileşik_Yol__1_);}
	.st4{fill:url(#_Yol_2_1_);}
	.st5{opacity:0.1;fill:#FFFFFF;enable-background:new    ;}
	.st6{opacity:0.2;fill:#030303;enable-background:new    ;}
</style>
<title>Varlık 11</title>
<linearGradient id="_Dikdörtgen__1_" gradientUnits="userSpaceOnUse" x1="16" y1="10.25" x2="16" y2="28" gradientTransform="matrix(1 0 0 -1 0 29.73)">
	<stop  offset="0" style="stop-color:#2D5879"/>
	<stop  offset="1" style="stop-color:#2C6E95"/>
</linearGradient>
<rect id="_Dikdörtgen_" x="1.9" y="1.7" class="st0" width="28.3" height="17.8"/>
<path class="st1" d="M7.9,28.8v-0.7c0-0.5,0.4-0.9,0.9-0.9c0,0,0,0,0,0c1.6,0,2.9-1.9,2.9-4.2c0-0.5-0.1-1.1-0.2-1.6v-0.2h9v0.2
	c-0.1,0.5-0.2,1.1-0.2,1.6c0,2.3,1.3,4.2,2.9,4.2c0.5,0,0.9,0.4,0.9,0.9v0.6H7.9z"/>
<linearGradient id="_Yol__1_" gradientUnits="userSpaceOnUse" x1="16.005" y1="0.83" x2="16.005" y2="11.02" gradientTransform="matrix(1 0 0 -1 0 29.73)">
	<stop  offset="0" style="stop-color:#A3A3A3"/>
	<stop  offset="6.000000e-02" style="stop-color:#BBBBBA"/>
	<stop  offset="0.14" style="stop-color:#CFCECD"/>
	<stop  offset="0.22" style="stop-color:#DDDCDB"/>
	<stop  offset="0.33" style="stop-color:#E6E4E3"/>
	<stop  offset="0.51" style="stop-color:#E8E6E5"/>
	<stop  offset="0.7" style="stop-color:#C6C5C4"/>
	<stop  offset="0.89" style="stop-color:#ACACAC"/>
	<stop  offset="1" style="stop-color:#A3A3A3"/>
</linearGradient>
<path id="_Yol_" class="st2" d="M23.1,27.4c-1.7,0-3.1-2-3.1-4.4c0-0.5,0.1-1.1,0.2-1.6h-8.6c0.1,0.5,0.2,1.1,0.2,1.6
	c0,2.4-1.4,4.4-3.1,4.4l0,0c-0.4,0-0.8,0.3-0.8,0.7c0,0,0,0,0,0v0.5h15.9v-0.5C23.9,27.8,23.6,27.4,23.1,27.4
	C23.1,27.4,23.1,27.4,23.1,27.4L23.1,27.4z"/>
<path class="st1" d="M0.7,21.3C0.3,21.3,0,21,0,20.6V0.7C0,0.3,0.3,0,0.7,0h30.5C31.7,0,32,0.3,32,0.7v19.9c0,0.4-0.3,0.7-0.7,0.7
	H0.7z M29.9,19.2V2.1H2.1v17.1L29.9,19.2z"/>
<linearGradient id="_Bileşik_Yol__1_" gradientUnits="userSpaceOnUse" x1="16" y1="8.54" x2="16" y2="29.6" gradientTransform="matrix(1 0 0 -1 0 29.73)">
	<stop  offset="0" style="stop-color:#A3A3A3"/>
	<stop  offset="0.13" style="stop-color:#BCBBBB"/>
	<stop  offset="0.27" style="stop-color:#D0CECE"/>
	<stop  offset="0.43" style="stop-color:#DEDCDB"/>
	<stop  offset="0.64" style="stop-color:#E6E4E3"/>
	<stop  offset="1" style="stop-color:#E8E6E5"/>
</linearGradient>
<path id="_Bileşik_Yol_" class="st3" d="M31.3,0.1H0.7c-0.3,0-0.6,0.3-0.6,0.6c0,0,0,0,0,0v19.9c0,0.3,0.3,0.6,0.6,0.6c0,0,0,0,0,0
	h30.5c0.3,0,0.6-0.3,0.6-0.6l0,0V0.7C31.9,0.4,31.6,0.1,31.3,0.1C31.3,0.1,31.3,0.1,31.3,0.1z M30,19.3H2V2h28V19.3z"/>
<linearGradient id="_Yol_2_1_" gradientUnits="userSpaceOnUse" x1="16" y1="1.02" x2="16" y2="2.2901" gradientTransform="matrix(1 0 0 -1 0 29.73)">
	<stop  offset="0" style="stop-color:#A3A3A3"/>
	<stop  offset="0.39" style="stop-color:#C4C4C3"/>
	<stop  offset="0.77" style="stop-color:#DEDDDC"/>
	<stop  offset="1" style="stop-color:#E8E6E5"/>
</linearGradient>
<path id="_Yol_2" class="st4" d="M23.1,27.4H8.8c-0.4,0-0.8,0.3-0.8,0.7c0,0,0,0,0,0v0.5h15.9v-0.5C23.9,27.8,23.6,27.4,23.1,27.4
	C23.1,27.4,23.1,27.4,23.1,27.4z"/>
<rect x="2" y="19.3" class="st5" width="28" height="1"/>
<path class="st5" d="M31.3,0.1H0.7c-0.3,0-0.6,0.3-0.6,0.6c0,0,0,0,0,0v1c0-0.3,0.3-0.6,0.6-0.6l0,0h30.5c0.3,0,0.6,0.3,0.6,0.6
	c0,0,0,0,0,0v-1C31.9,0.4,31.6,0.1,31.3,0.1C31.3,0.1,31.3,0.1,31.3,0.1z"/>
<path class="st6" d="M31.3,21.2H0.7c-0.3,0-0.6-0.3-0.6-0.6c0,0,0,0,0,0v1c0,0.3,0.3,0.6,0.6,0.6c0,0,0,0,0,0h30.5
	c0.3,0,0.6-0.3,0.6-0.6l0,0v-1C31.9,20.9,31.6,21.2,31.3,21.2L31.3,21.2z"/>
<rect x="2" y="2" class="st6" width="28" height="1"/>
<path class="st5" d="M23.9,28.2c0-0.4-0.4-0.8-0.8-0.8c0,0,0,0,0,0H8.8c-0.4,0-0.8,0.3-0.8,0.7c0,0,0,0,0,0v0.5
	c0-0.4,0.3-0.7,0.8-0.7c0,0,0,0,0,0h14.3c0.4,0,0.8,0.3,0.8,0.8l0,0L23.9,28.2z"/>
<path class="st6" d="M8.1,29.2h15.9v-0.5H8.1V29.2z"/>
</svg>
