<?xml version="1.0" encoding="utf-8"?>
<!-- Generator: Adobe Illustrator 21.0.0, SVG Export Plug-In . SVG Version: 6.00 Build 0)  -->
<svg version="1.1" id="katman_1" xmlns="http://www.w3.org/2000/svg" xmlns:xlink="http://www.w3.org/1999/xlink" x="0px" y="0px"
	 viewBox="0 0 64.1 49.9" style="enable-background:new 0 0 64.1 49.9;" xml:space="preserve">
<style type="text/css">
	.st0{fill:#4D4D4D;}
	.st1{fill:url(#SVGID_1_);}
	.st2{fill:#FFFFFF;}
	.st3{opacity:0.7;fill:#FFFFFF;enable-background:new    ;}
	.st4{opacity:0.2;enable-background:new    ;}
	.st5{fill:url(#SVGID_2_);}
	.st6{opacity:0.3;fill:url(#SVGID_3_);enable-background:new    ;}
	.st7{opacity:0.2;fill:#FFFFFF;enable-background:new    ;}
	.st8{fill:url(#SVGID_4_);}
	.st9{fill:url(#SVGID_5_);}
	.st10{fill:url(#SVGID_6_);}
	.st11{fill:url(#SVGID_7_);}
	.st12{fill:url(#SVGID_8_);}
	.st13{fill:url(#SVGID_9_);}
	.st14{fill:url(#SVGID_10_);}
	.st15{fill:url(#SVGID_11_);}
	.st16{fill:url(#SVGID_12_);}
	.st17{fill:url(#SVGID_13_);}
	.st18{fill:url(#SVGID_14_);}
	.st19{fill:url(#SVGID_15_);}
	.st20{fill:url(#SVGID_16_);}
	.st21{fill:url(#SVGID_17_);}
	.st22{fill:url(#SVGID_18_);}
	.st23{fill:url(#SVGID_19_);}
	.st24{fill:url(#SVGID_20_);}
	.st25{fill:url(#SVGID_21_);}
	.st26{fill:url(#SVGID_22_);}
	.st27{fill:url(#SVGID_23_);}
	.st28{fill:url(#SVGID_24_);}
	.st29{fill:url(#SVGID_25_);}
	.st30{fill:url(#SVGID_26_);}
	.st31{fill:url(#SVGID_27_);}
	.st32{fill:url(#SVGID_28_);}
	.st33{fill:url(#SVGID_29_);}
	.st34{fill:url(#SVGID_30_);}
	.st35{fill:url(#SVGID_31_);}
	.st36{fill:url(#SVGID_32_);}
	.st37{fill:url(#SVGID_33_);}
	.st38{fill:url(#SVGID_34_);}
	.st39{fill:url(#SVGID_35_);}
	.st40{fill:url(#SVGID_36_);}
	.st41{fill:url(#SVGID_37_);}
	.st42{fill:url(#SVGID_38_);}
	.st43{fill:url(#SVGID_39_);}
	.st44{fill:url(#SVGID_40_);}
	.st45{fill:url(#SVGID_41_);}
	.st46{fill:url(#SVGID_42_);}
	.st47{fill:url(#SVGID_43_);}
	.st48{fill:url(#SVGID_44_);}
	.st49{fill:url(#SVGID_45_);}
	.st50{fill:url(#SVGID_46_);}
	.st51{fill:url(#SVGID_47_);}
	.st52{fill:url(#SVGID_48_);}
	.st53{fill:url(#SVGID_49_);}
	.st54{fill:url(#SVGID_50_);}
	.st55{fill:url(#SVGID_51_);}
	.st56{fill:url(#SVGID_52_);}
	.st57{fill:url(#SVGID_53_);}
	.st58{fill:url(#SVGID_54_);}
	.st59{fill:url(#SVGID_55_);}
	.st60{fill:url(#SVGID_56_);}
	.st61{fill:url(#SVGID_57_);}
	.st62{fill:url(#SVGID_58_);}
	.st63{fill:url(#SVGID_59_);}
	.st64{fill:url(#SVGID_60_);}
	.st65{fill:url(#SVGID_61_);}
	.st66{fill:url(#SVGID_62_);}
	.st67{fill:url(#SVGID_63_);}
	.st68{fill:url(#SVGID_64_);}
	.st69{fill:url(#SVGID_65_);}
	.st70{fill:url(#SVGID_66_);}
	.st71{fill:url(#SVGID_67_);}
	.st72{fill:url(#SVGID_68_);}
	.st73{fill:url(#SVGID_69_);}
	.st74{fill:url(#SVGID_70_);}
	.st75{fill:url(#SVGID_71_);}
	.st76{fill:url(#SVGID_72_);}
	.st77{fill:url(#SVGID_73_);}
	.st78{fill:url(#SVGID_74_);}
	.st79{fill:url(#SVGID_75_);}
	.st80{fill:url(#SVGID_76_);}
	.st81{fill:url(#SVGID_77_);}
	.st82{fill:url(#SVGID_78_);}
	.st83{fill:url(#SVGID_79_);}
	.st84{fill:url(#SVGID_80_);}
	.st85{fill:url(#SVGID_81_);}
	.st86{fill:url(#SVGID_82_);}
	.st87{fill:url(#SVGID_83_);}
	.st88{fill:url(#SVGID_84_);}
	.st89{fill:url(#SVGID_85_);}
	.st90{fill:url(#SVGID_86_);}
	.st91{fill:url(#SVGID_87_);}
	.st92{fill:url(#SVGID_88_);}
	.st93{fill:url(#SVGID_89_);}
	.st94{fill:url(#SVGID_90_);}
	.st95{fill:url(#SVGID_91_);}
	.st96{fill:url(#SVGID_92_);}
	.st97{fill:url(#SVGID_93_);}
	.st98{fill:url(#SVGID_94_);}
	.st99{fill:url(#SVGID_95_);}
	.st100{fill:url(#SVGID_96_);}
	.st101{fill:url(#SVGID_97_);}
	.st102{fill:url(#SVGID_98_);}
	.st103{fill:url(#SVGID_99_);}
	.st104{fill:url(#SVGID_100_);}
	.st105{fill:url(#SVGID_101_);}
	.st106{fill:url(#SVGID_102_);}
	.st107{fill:url(#SVGID_103_);}
	.st108{fill:url(#SVGID_104_);}
	.st109{fill:url(#SVGID_105_);}
	.st110{fill:url(#SVGID_106_);}
	.st111{fill:url(#SVGID_107_);}
	.st112{fill:url(#SVGID_108_);}
	.st113{fill:url(#SVGID_109_);}
	.st114{fill:url(#SVGID_110_);}
	.st115{fill:url(#SVGID_111_);}
	.st116{fill:url(#SVGID_112_);}
	.st117{fill:url(#SVGID_113_);}
	.st118{fill:url(#SVGID_114_);}
	.st119{fill:url(#SVGID_115_);}
	.st120{fill:url(#SVGID_116_);}
	.st121{fill:url(#SVGID_117_);}
	.st122{fill:url(#SVGID_118_);}
	.st123{fill:url(#SVGID_119_);}
	.st124{fill:url(#SVGID_120_);}
	.st125{fill:url(#SVGID_121_);}
	.st126{fill:url(#SVGID_122_);}
	.st127{fill:url(#SVGID_123_);}
	.st128{fill:url(#SVGID_124_);}
	.st129{fill:url(#SVGID_125_);}
	.st130{fill:url(#SVGID_126_);}
	.st131{fill:url(#SVGID_127_);}
	.st132{fill:url(#SVGID_128_);}
	.st133{fill:url(#SVGID_129_);}
	.st134{fill:url(#SVGID_130_);}
	.st135{fill:url(#SVGID_131_);}
	.st136{fill:url(#SVGID_132_);}
	.st137{fill:url(#SVGID_133_);}
	.st138{fill:url(#SVGID_134_);}
	.st139{fill:url(#SVGID_135_);}
	.st140{fill:url(#SVGID_136_);}
	.st141{fill:url(#SVGID_137_);}
	.st142{fill:url(#SVGID_138_);}
	.st143{fill:url(#SVGID_139_);}
	.st144{fill:url(#SVGID_140_);}
	.st145{fill:url(#SVGID_141_);}
	.st146{fill:url(#SVGID_142_);}
	.st147{fill:url(#SVGID_143_);}
	.st148{fill:url(#SVGID_144_);}
	.st149{fill:url(#SVGID_145_);}
</style>
<title>input-keyboard</title>
<path class="st0" d="M2.4,16.6h59.3c1.3,0,2.4,1.1,2.4,2.4v27c0,1.3-1.1,2.4-2.4,2.4H2.4C1.1,48.4,0,47.4,0,46V19
	C0,17.7,1.1,16.6,2.4,16.6z"/>
<path class="st0" d="M31.9,18.7c-1.6-1.8-3.6-6.1,0.1-9.7c0.6-0.6,1.1-1,1.6-1.5c2.7-2.5,3.2-3,1.5-5.9l-0.3-0.4l2-1.1l0.2,0.4
	C39.7,5,38,6.5,35.2,9.1c-0.5,0.4-1,0.9-1.5,1.4c-3.1,3-0.1,6.5,0.1,6.6l0.3,0.4L32.3,19L31.9,18.7z"/>
<linearGradient id="SVGID_1_" gradientUnits="userSpaceOnUse" x1="34.1537" y1="31.38" x2="34.1537" y2="49.06" gradientTransform="matrix(1 0 0 -1 0 49.73)">
	<stop  offset="0" style="stop-color:#CCCCCC"/>
	<stop  offset="1" style="stop-color:#F7F7F7"/>
</linearGradient>
<path class="st1" d="M32.3,18.4c-1.5-1.7-3.4-5.7,0-9c0.6-0.6,1.1-1,1.6-1.5c2.8-2.5,3.5-3.2,1.6-6.6l1.2-0.7c2.5,4.2,1,5.5-1.8,8.1
	c-0.5,0.4-1,0.9-1.6,1.5c-3.4,3.3-0.1,7.2,0,7.3L32.3,18.4z"/>
<path class="st2" d="M36.6,1.7c0.6,0.9,1,2,1.2,3.1c0.2-1-0.2-2.3-1.2-4.1l-1.1,0.6c0.2,0.3,0.3,0.5,0.4,0.8L36.6,1.7z"/>
<path class="st3" d="M32.3,10.3c0.6-0.6,1.1-1,1.6-1.5c2-1.8,2.9-2.7,2.6-4.2c-0.2,1-1.1,1.8-2.6,3.2c-0.5,0.4-1,0.9-1.6,1.5
	c-1.3,1.2-2,3-1.9,4.8C30.6,12.6,31.3,11.3,32.3,10.3z"/>
<path class="st4" d="M32.8,17.9l0.5-0.4c-0.8-1-1.4-2.2-1.5-3.4C31.7,15.5,32.1,16.8,32.8,17.9z"/>
<linearGradient id="SVGID_2_" gradientUnits="userSpaceOnUse" x1="32.04" y1="1.79" x2="32.04" y2="32.61" gradientTransform="matrix(1 0 0 -1 0 49.73)">
	<stop  offset="0" style="stop-color:#CCCCCC"/>
	<stop  offset="1" style="stop-color:#F7F7F7"/>
</linearGradient>
<path class="st5" d="M2.4,17.1h59.3c1.1,0,1.9,0.9,1.9,1.9v27c0,1.1-0.9,1.9-1.9,1.9H2.4c-1.1,0-1.9-0.9-1.9-1.9V19
	C0.5,18,1.4,17.1,2.4,17.1z"/>
<linearGradient id="SVGID_3_" gradientUnits="userSpaceOnUse" x1="32.04" y1="1.79" x2="32.04" y2="32.61" gradientTransform="matrix(1 0 0 -1 0 49.73)">
	<stop  offset="0" style="stop-color:#666666"/>
	<stop  offset="6.000000e-02" style="stop-color:#E6E6E6"/>
	<stop  offset="0.17" style="stop-color:#B3B3B3"/>
	<stop  offset="1" style="stop-color:#CCCCCC"/>
</linearGradient>
<path class="st6" d="M2.4,17.1h59.3c1.1,0,1.9,0.9,1.9,1.9v27c0,1.1-0.9,1.9-1.9,1.9H2.4c-1.1,0-1.9-0.9-1.9-1.9V19
	C0.5,18,1.4,17.1,2.4,17.1z"/>
<path class="st7" d="M61.7,17.1H2.4c-1,0-1.9,0.8-1.9,1.9v2c0-1.1,0.9-1.9,1.9-1.9h59.3c1.1,0,1.9,0.9,1.9,1.9c0,0,0,0,0,0v-2
	C63.6,18,62.7,17.1,61.7,17.1z"/>
<path class="st4" d="M61.7,47.9H2.4c-1.1,0-1.9-0.9-1.9-1.9c0,0,0,0,0,0v2c0,1.1,0.9,1.9,1.9,1.9h59.3c1.1,0,1.9-0.9,1.9-1.9v0v-2
	C63.6,47.1,62.8,47.9,61.7,47.9C61.7,47.9,61.7,47.9,61.7,47.9z"/>
<linearGradient id="SVGID_4_" gradientUnits="userSpaceOnUse" x1="23.76" y1="27.72" x2="23.76" y2="30.11" gradientTransform="matrix(1 0 0 -1 0 49.73)">
	<stop  offset="0" style="stop-color:#1A1A1A"/>
	<stop  offset="1" style="stop-color:#595959"/>
</linearGradient>
<path class="st8" d="M22.3,22c-0.2,0-0.3-0.2-0.3-0.4c0,0,0,0,0,0V20c0-0.2,0.1-0.4,0.3-0.4c0,0,0,0,0,0h3c0.2,0,0.3,0.2,0.3,0.4
	c0,0,0,0,0,0v1.6c0,0.2-0.1,0.4-0.3,0.4c0,0,0,0,0,0L22.3,22z"/>
<linearGradient id="SVGID_5_" gradientUnits="userSpaceOnUse" x1="19.97" y1="27.72" x2="19.97" y2="30.11" gradientTransform="matrix(1 0 0 -1 0 49.73)">
	<stop  offset="0" style="stop-color:#1A1A1A"/>
	<stop  offset="1" style="stop-color:#595959"/>
</linearGradient>
<path class="st9" d="M18.5,22c-0.2,0-0.3-0.2-0.3-0.4c0,0,0,0,0,0V20c0-0.2,0.1-0.4,0.3-0.4c0,0,0,0,0,0h3c0.2,0,0.3,0.2,0.3,0.4
	c0,0,0,0,0,0v1.6c0,0.2-0.1,0.4-0.3,0.4c0,0,0,0,0,0L18.5,22z"/>
<linearGradient id="SVGID_6_" gradientUnits="userSpaceOnUse" x1="16.1801" y1="27.72" x2="16.1801" y2="30.11" gradientTransform="matrix(1 0 0 -1 0 49.73)">
	<stop  offset="0" style="stop-color:#1A1A1A"/>
	<stop  offset="1" style="stop-color:#595959"/>
</linearGradient>
<path class="st10" d="M14.7,22c-0.2,0-0.3-0.2-0.3-0.4V20c0-0.2,0.1-0.4,0.3-0.4h3c0.2,0,0.3,0.2,0.3,0.4v1.6c0,0.2-0.1,0.4-0.3,0.4
	L14.7,22z"/>
<linearGradient id="SVGID_7_" gradientUnits="userSpaceOnUse" x1="12.4" y1="27.72" x2="12.4" y2="30.11" gradientTransform="matrix(1 0 0 -1 0 49.73)">
	<stop  offset="0" style="stop-color:#1A1A1A"/>
	<stop  offset="1" style="stop-color:#595959"/>
</linearGradient>
<path class="st11" d="M10.9,22c-0.2,0-0.3-0.2-0.3-0.4V20c0-0.2,0.1-0.4,0.3-0.4h3c0.2,0,0.3,0.2,0.3,0.4v1.6c0,0.2-0.1,0.4-0.3,0.4
	L10.9,22z"/>
<linearGradient id="SVGID_8_" gradientUnits="userSpaceOnUse" x1="41" y1="27.72" x2="41" y2="30.11" gradientTransform="matrix(1 0 0 -1 0 49.73)">
	<stop  offset="0" style="stop-color:#1A1A1A"/>
	<stop  offset="1" style="stop-color:#595959"/>
</linearGradient>
<path class="st12" d="M39.5,22c-0.2,0-0.3-0.2-0.3-0.4c0,0,0,0,0,0V20c0-0.2,0.1-0.4,0.3-0.4c0,0,0,0,0,0h3c0.2,0,0.3,0.2,0.3,0.4
	c0,0,0,0,0,0v1.6c0,0.2-0.1,0.4-0.3,0.4c0,0,0,0,0,0L39.5,22z"/>
<linearGradient id="SVGID_9_" gradientUnits="userSpaceOnUse" x1="37.1903" y1="27.72" x2="37.1903" y2="30.11" gradientTransform="matrix(1 0 0 -1 0 49.73)">
	<stop  offset="0" style="stop-color:#1A1A1A"/>
	<stop  offset="1" style="stop-color:#595959"/>
</linearGradient>
<path class="st13" d="M35.7,22c-0.2,0-0.3-0.2-0.3-0.4c0,0,0,0,0,0V20c0-0.2,0.1-0.4,0.3-0.4c0,0,0,0,0,0h3c0.2,0,0.3,0.2,0.3,0.4
	v1.6c0,0.2-0.1,0.4-0.3,0.4c0,0,0,0,0,0L35.7,22z"/>
<linearGradient id="SVGID_10_" gradientUnits="userSpaceOnUse" x1="33.42" y1="27.72" x2="33.42" y2="30.11" gradientTransform="matrix(1 0 0 -1 0 49.73)">
	<stop  offset="0" style="stop-color:#1A1A1A"/>
	<stop  offset="1" style="stop-color:#595959"/>
</linearGradient>
<path class="st14" d="M31.9,22c-0.2,0-0.3-0.2-0.3-0.4V20c0-0.2,0.1-0.4,0.3-0.4h3c0.2,0,0.3,0.2,0.3,0.4v1.6c0,0.2-0.1,0.4-0.3,0.4
	L31.9,22z"/>
<linearGradient id="SVGID_11_" gradientUnits="userSpaceOnUse" x1="29.63" y1="27.72" x2="29.63" y2="30.11" gradientTransform="matrix(1 0 0 -1 0 49.73)">
	<stop  offset="0" style="stop-color:#1A1A1A"/>
	<stop  offset="1" style="stop-color:#595959"/>
</linearGradient>
<path class="st15" d="M28.1,22c-0.2,0-0.3-0.2-0.3-0.4V20c0-0.2,0.1-0.4,0.3-0.4h3c0.2,0,0.3,0.2,0.3,0.4v1.6c0,0.2-0.1,0.4-0.3,0.4
	L28.1,22z"/>
<linearGradient id="SVGID_12_" gradientUnits="userSpaceOnUse" x1="58.2006" y1="27.72" x2="58.2006" y2="30.11" gradientTransform="matrix(1 0 0 -1 0 49.73)">
	<stop  offset="0" style="stop-color:#1A1A1A"/>
	<stop  offset="1" style="stop-color:#595959"/>
</linearGradient>
<path class="st16" d="M56.7,22c-0.2,0-0.3-0.2-0.3-0.4c0,0,0,0,0,0V20c0-0.2,0.1-0.4,0.3-0.4c0,0,0,0,0,0h3c0.2,0,0.3,0.2,0.3,0.4
	v1.6c0,0.2-0.1,0.4-0.3,0.4c0,0,0,0,0,0L56.7,22z"/>
<linearGradient id="SVGID_13_" gradientUnits="userSpaceOnUse" x1="54.44" y1="27.72" x2="54.44" y2="30.11" gradientTransform="matrix(1 0 0 -1 0 49.73)">
	<stop  offset="0" style="stop-color:#1A1A1A"/>
	<stop  offset="1" style="stop-color:#595959"/>
</linearGradient>
<path class="st17" d="M52.9,22c-0.2,0-0.3-0.2-0.3-0.4c0,0,0,0,0,0V20c0-0.2,0.1-0.4,0.3-0.4c0,0,0,0,0,0h3c0.2,0,0.3,0.2,0.3,0.4
	c0,0,0,0,0,0v1.6c0,0.2-0.1,0.4-0.3,0.4c0,0,0,0,0,0L52.9,22z"/>
<linearGradient id="SVGID_14_" gradientUnits="userSpaceOnUse" x1="50.66" y1="27.72" x2="50.66" y2="30.11" gradientTransform="matrix(1 0 0 -1 0 49.73)">
	<stop  offset="0" style="stop-color:#1A1A1A"/>
	<stop  offset="1" style="stop-color:#595959"/>
</linearGradient>
<path class="st18" d="M49.2,22c-0.2,0-0.3-0.2-0.3-0.4V20c0-0.2,0.1-0.4,0.3-0.4h3c0.2,0,0.3,0.2,0.3,0.4v1.6c0,0.2-0.1,0.4-0.3,0.4
	L49.2,22z"/>
<linearGradient id="SVGID_15_" gradientUnits="userSpaceOnUse" x1="46.87" y1="27.72" x2="46.87" y2="30.11" gradientTransform="matrix(1 0 0 -1 0 49.73)">
	<stop  offset="0" style="stop-color:#1A1A1A"/>
	<stop  offset="1" style="stop-color:#595959"/>
</linearGradient>
<path class="st19" d="M45.4,22c-0.2,0-0.3-0.2-0.3-0.4V20c0-0.2,0.1-0.4,0.3-0.4h3c0.2,0,0.3,0.2,0.3,0.4v1.6c0,0.2-0.1,0.4-0.3,0.4
	L45.4,22z"/>
<linearGradient id="SVGID_16_" gradientUnits="userSpaceOnUse" x1="5.88" y1="27.72" x2="5.88" y2="30.11" gradientTransform="matrix(1 0 0 -1 0 49.73)">
	<stop  offset="0" style="stop-color:#1A1A1A"/>
	<stop  offset="1" style="stop-color:#595959"/>
</linearGradient>
<path class="st20" d="M4.4,22c-0.2,0-0.3-0.2-0.3-0.4V20c0-0.2,0.1-0.4,0.3-0.4h3c0.2,0,0.3,0.2,0.3,0.4v1.6c0,0.2-0.1,0.4-0.3,0.4
	L4.4,22z"/>
<linearGradient id="SVGID_17_" gradientUnits="userSpaceOnUse" x1="23.76" y1="27.96" x2="23.76" y2="29.87" gradientTransform="matrix(1 0 0 -1 0 49.73)">
	<stop  offset="0" style="stop-color:#CCCCCC"/>
	<stop  offset="1" style="stop-color:#F7F7F7"/>
</linearGradient>
<path class="st21" d="M22.3,19.9h3c0,0,0.1,0.1,0.1,0.2v1.6c0,0.1,0,0.2-0.1,0.2h-3c0,0-0.1-0.1-0.1-0.2V20
	C22.2,19.9,22.2,19.9,22.3,19.9z"/>
<linearGradient id="SVGID_18_" gradientUnits="userSpaceOnUse" x1="19.97" y1="27.96" x2="19.97" y2="29.87" gradientTransform="matrix(1 0 0 -1 0 49.73)">
	<stop  offset="0" style="stop-color:#CCCCCC"/>
	<stop  offset="1" style="stop-color:#F7F7F7"/>
</linearGradient>
<path class="st22" d="M18.5,19.9h3c0,0,0.1,0.1,0.1,0.2v1.6c0,0.1,0,0.2-0.1,0.2h-3c0,0-0.1-0.1-0.1-0.2V20
	C18.4,19.9,18.4,19.9,18.5,19.9z"/>
<linearGradient id="SVGID_19_" gradientUnits="userSpaceOnUse" x1="16.19" y1="27.96" x2="16.19" y2="29.87" gradientTransform="matrix(1 0 0 -1 0 49.73)">
	<stop  offset="0" style="stop-color:#CCCCCC"/>
	<stop  offset="1" style="stop-color:#F7F7F7"/>
</linearGradient>
<path class="st23" d="M14.7,19.9h3c0,0,0.1,0.1,0.1,0.2v1.6c0,0.1,0,0.2-0.1,0.2h-3c-0.1,0-0.1-0.1-0.1-0.2V20
	C14.6,19.9,14.6,19.9,14.7,19.9z"/>
<linearGradient id="SVGID_20_" gradientUnits="userSpaceOnUse" x1="12.4" y1="27.96" x2="12.4" y2="29.87" gradientTransform="matrix(1 0 0 -1 0 49.73)">
	<stop  offset="0" style="stop-color:#CCCCCC"/>
	<stop  offset="1" style="stop-color:#F7F7F7"/>
</linearGradient>
<path class="st24" d="M10.9,19.9h3c0.1,0,0.1,0.1,0.1,0.2v1.6c0,0.1,0,0.2-0.1,0.2h-3c-0.1,0-0.1-0.1-0.1-0.2V20
	C10.8,19.9,10.9,19.9,10.9,19.9z"/>
<linearGradient id="SVGID_21_" gradientUnits="userSpaceOnUse" x1="41" y1="27.96" x2="41" y2="29.87" gradientTransform="matrix(1 0 0 -1 0 49.73)">
	<stop  offset="0" style="stop-color:#CCCCCC"/>
	<stop  offset="1" style="stop-color:#F7F7F7"/>
</linearGradient>
<path class="st25" d="M39.5,19.9h3c0,0,0.1,0.1,0.1,0.2v1.6c0,0.1,0,0.2-0.1,0.2h-3c0,0-0.1-0.1-0.1-0.2V20
	C39.4,19.9,39.5,19.9,39.5,19.9z"/>
<linearGradient id="SVGID_22_" gradientUnits="userSpaceOnUse" x1="37.21" y1="27.96" x2="37.21" y2="29.87" gradientTransform="matrix(1 0 0 -1 0 49.73)">
	<stop  offset="0" style="stop-color:#CCCCCC"/>
	<stop  offset="1" style="stop-color:#F7F7F7"/>
</linearGradient>
<path class="st26" d="M35.7,19.9h3c0,0,0.1,0.1,0.1,0.2v1.6c0,0.1,0,0.2-0.1,0.2h-3c0,0-0.1-0.1-0.1-0.2V20
	C35.6,19.9,35.7,19.9,35.7,19.9z"/>
<linearGradient id="SVGID_23_" gradientUnits="userSpaceOnUse" x1="33.42" y1="27.96" x2="33.42" y2="29.87" gradientTransform="matrix(1 0 0 -1 0 49.73)">
	<stop  offset="0" style="stop-color:#CCCCCC"/>
	<stop  offset="1" style="stop-color:#F7F7F7"/>
</linearGradient>
<path class="st27" d="M31.9,19.9h3c0,0,0.1,0.1,0.1,0.2v1.6c0,0.1,0,0.2-0.1,0.2h-3c0,0-0.1-0.1-0.1-0.2V20
	C31.8,19.9,31.9,19.9,31.9,19.9z"/>
<linearGradient id="SVGID_24_" gradientUnits="userSpaceOnUse" x1="29.6267" y1="27.96" x2="29.6267" y2="29.87" gradientTransform="matrix(1 0 0 -1 0 49.73)">
	<stop  offset="0" style="stop-color:#CCCCCC"/>
	<stop  offset="1" style="stop-color:#F7F7F7"/>
</linearGradient>
<path class="st28" d="M28.1,19.9h3c0,0,0.1,0.1,0.1,0.2v1.6c0,0.1,0,0.2-0.1,0.2h-3c0,0-0.1-0.1-0.1-0.2V20
	C28,19.9,28.1,19.9,28.1,19.9z"/>
<linearGradient id="SVGID_25_" gradientUnits="userSpaceOnUse" x1="58.23" y1="27.96" x2="58.23" y2="29.87" gradientTransform="matrix(1 0 0 -1 0 49.73)">
	<stop  offset="0" style="stop-color:#CCCCCC"/>
	<stop  offset="1" style="stop-color:#F7F7F7"/>
</linearGradient>
<path class="st29" d="M56.7,19.9h3c0,0,0.1,0.1,0.1,0.2v1.6c0,0.1,0,0.2-0.1,0.2h-3c0,0-0.1-0.1-0.1-0.2V20
	C56.6,19.9,56.7,19.9,56.7,19.9z"/>
<linearGradient id="SVGID_26_" gradientUnits="userSpaceOnUse" x1="54.44" y1="27.96" x2="54.44" y2="29.87" gradientTransform="matrix(1 0 0 -1 0 49.73)">
	<stop  offset="0" style="stop-color:#CCCCCC"/>
	<stop  offset="1" style="stop-color:#F7F7F7"/>
</linearGradient>
<path class="st30" d="M52.9,19.9h3c0,0,0.1,0.1,0.1,0.2v1.6c0,0.1,0,0.2-0.1,0.2h-3c0,0-0.1-0.1-0.1-0.2V20
	C52.8,19.9,52.9,19.9,52.9,19.9z"/>
<linearGradient id="SVGID_27_" gradientUnits="userSpaceOnUse" x1="50.66" y1="27.96" x2="50.66" y2="29.87" gradientTransform="matrix(1 0 0 -1 0 49.73)">
	<stop  offset="0" style="stop-color:#CCCCCC"/>
	<stop  offset="1" style="stop-color:#F7F7F7"/>
</linearGradient>
<path class="st31" d="M49.2,19.9h3c0,0,0.1,0.1,0.1,0.2v1.6c0,0.1,0,0.2-0.1,0.2h-3c0,0-0.1-0.1-0.1-0.2V20
	C49.1,19.9,49.1,19.9,49.2,19.9z"/>
<linearGradient id="SVGID_28_" gradientUnits="userSpaceOnUse" x1="46.87" y1="27.96" x2="46.87" y2="29.87" gradientTransform="matrix(1 0 0 -1 0 49.73)">
	<stop  offset="0" style="stop-color:#CCCCCC"/>
	<stop  offset="1" style="stop-color:#F7F7F7"/>
</linearGradient>
<path class="st32" d="M45.4,19.9h3c0,0,0.1,0.1,0.1,0.2v1.6c0,0.1,0,0.2-0.1,0.2h-3c0,0-0.1-0.1-0.1-0.2V20
	C45.3,19.9,45.3,19.9,45.4,19.9z"/>
<linearGradient id="SVGID_29_" gradientUnits="userSpaceOnUse" x1="5.88" y1="27.96" x2="5.88" y2="29.87" gradientTransform="matrix(1 0 0 -1 0 49.73)">
	<stop  offset="0" style="stop-color:#CCCCCC"/>
	<stop  offset="1" style="stop-color:#F7F7F7"/>
</linearGradient>
<path class="st33" d="M4.4,19.9h3c0.1,0,0.1,0.1,0.1,0.2v1.6c0,0.1,0,0.2-0.1,0.2h-3c-0.1,0-0.1-0.1-0.1-0.2V20
	C4.3,19.9,4.3,19.9,4.4,19.9z"/>
<path class="st2" d="M22.3,20.9h3c0,0,0.1,0.1,0.1,0.2v-1c0-0.1,0-0.2-0.1-0.2h-3c0,0-0.1,0.1-0.1,0.2v1
	C22.2,20.9,22.2,20.9,22.3,20.9z"/>
<path class="st2" d="M18.5,20.9h3c0,0,0.1,0.1,0.1,0.2v-1c0-0.1,0-0.2-0.1-0.2h-3c0,0-0.1,0.1-0.1,0.2v1
	C18.4,20.9,18.4,20.9,18.5,20.9z"/>
<path class="st2" d="M14.7,20.9h3c0,0,0.1,0.1,0.1,0.2v-1c0-0.1,0-0.2-0.1-0.2h-3c-0.1,0-0.1,0.1-0.1,0.2v1
	C14.6,20.9,14.6,20.9,14.7,20.9z"/>
<path class="st2" d="M10.9,20.9h3c0.1,0,0.1,0.1,0.1,0.2v-1c0-0.1,0-0.2-0.1-0.2h-3c-0.1,0-0.1,0.1-0.1,0.2v1
	C10.8,20.9,10.9,20.9,10.9,20.9z"/>
<path class="st2" d="M39.5,20.9h3c0,0,0.1,0.1,0.1,0.2v-1c0-0.1,0-0.2-0.1-0.2h-3c0,0-0.1,0.1-0.1,0.2v1
	C39.4,20.9,39.5,20.9,39.5,20.9z"/>
<path class="st2" d="M35.7,20.9h3c0,0,0.1,0.1,0.1,0.2v-1c0-0.1,0-0.2-0.1-0.2h-3c0,0-0.1,0.1-0.1,0.2v1
	C35.6,20.9,35.7,20.9,35.7,20.9z"/>
<path class="st2" d="M31.9,20.9h3c0,0,0.1,0.1,0.1,0.2v-1c0-0.1,0-0.2-0.1-0.2h-3c0,0-0.1,0.1-0.1,0.2v1
	C31.8,20.9,31.9,20.9,31.9,20.9z"/>
<path class="st2" d="M28.1,20.9h3c0,0,0.1,0.1,0.1,0.2v-1c0-0.1,0-0.2-0.1-0.2h-3c0,0-0.1,0.1-0.1,0.2v1
	C28,20.9,28.1,20.9,28.1,20.9z"/>
<path class="st2" d="M56.7,20.9h3c0,0,0.1,0.1,0.1,0.2v-1c0-0.1,0-0.2-0.1-0.2h-3c0,0-0.1,0.1-0.1,0.2v1
	C56.6,20.9,56.7,20.9,56.7,20.9z"/>
<path class="st2" d="M52.9,20.9h3c0,0,0.1,0.1,0.1,0.2v-1c0-0.1,0-0.2-0.1-0.2h-3c0,0-0.1,0.1-0.1,0.2v1
	C52.8,20.9,52.9,20.9,52.9,20.9z"/>
<path class="st2" d="M49.2,20.9h3c0,0,0.1,0.1,0.1,0.2v-1c0-0.1,0-0.2-0.1-0.2h-3c0,0-0.1,0.1-0.1,0.2v1
	C49.1,20.9,49.1,20.9,49.2,20.9z"/>
<path class="st2" d="M45.4,20.9h3c0,0,0.1,0.1,0.1,0.2v-1c0-0.1,0-0.2-0.1-0.2h-3c0,0-0.1,0.1-0.1,0.2v1
	C45.3,20.9,45.3,20.9,45.4,20.9z"/>
<path class="st2" d="M4.4,20.9h3c0.1,0,0.1,0.1,0.1,0.2v-1c0-0.1,0-0.2-0.1-0.2h-3c-0.1,0-0.1,0.1-0.1,0.2v1
	C4.3,20.9,4.3,20.9,4.4,20.9z"/>
<path class="st4" d="M19.4,44.3h-2.9c-0.1,0-0.2-0.1-0.2-0.2v1c0,0.1,0.1,0.2,0.2,0.2h2.9c0.1,0,0.2-0.1,0.2-0.2v-1
	C19.6,44.2,19.5,44.3,19.4,44.3z"/>
<path class="st4" d="M15.4,44.3h-2.9c-0.1,0-0.2-0.1-0.2-0.2v1c0,0.1,0.1,0.2,0.2,0.2h2.9c0.1,0,0.2-0.1,0.2-0.2v-1
	C15.6,44.2,15.5,44.3,15.4,44.3z"/>
<path class="st4" d="M11.4,44.3H8.5c-0.1,0-0.2-0.1-0.2-0.2v1c0,0.1,0.1,0.2,0.2,0.2h2.9c0.1,0,0.2-0.1,0.2-0.2v-1
	C11.6,44.2,11.5,44.3,11.4,44.3z"/>
<path class="st4" d="M7.4,44.3H4.5c-0.1,0-0.2-0.1-0.2-0.2v1c0,0.1,0.1,0.2,0.2,0.2h2.9c0.1,0,0.2-0.1,0.2-0.2v-1
	C7.6,44.2,7.5,44.3,7.4,44.3z"/>
<path class="st4" d="M59.6,44.3h-2.9c-0.1,0-0.2-0.1-0.2-0.2v1c0,0.1,0.1,0.2,0.2,0.2h2.9c0.1,0,0.2-0.1,0.2-0.2v-1
	C59.8,44.2,59.7,44.3,59.6,44.3z"/>
<path class="st4" d="M55.6,44.3h-2.9c-0.1,0-0.2-0.1-0.2-0.2v1c0,0.1,0.1,0.2,0.2,0.2h2.9c0.1,0,0.2-0.1,0.2-0.2v-1
	C55.8,44.2,55.7,44.3,55.6,44.3z"/>
<path class="st4" d="M51.6,44.3h-2.9c-0.1,0-0.2-0.1-0.2-0.2v1c0,0.1,0.1,0.2,0.2,0.2h2.9c0.1,0,0.2-0.1,0.2-0.2v-1
	C51.8,44.2,51.7,44.2,51.6,44.3z"/>
<path class="st4" d="M47.6,44.3h-2.9c-0.1,0-0.2-0.1-0.2-0.2v1c0,0.1,0.1,0.2,0.2,0.2h2.9c0.1,0,0.2-0.1,0.2-0.2v-1
	C47.8,44.2,47.7,44.3,47.6,44.3z"/>
<path class="st4" d="M9.5,32.3C9.5,32.3,9.5,32.2,9.5,32.3v-1.1c0,0.1-0.1,0.1-0.1,0.1H4.4c-0.1,0-0.2-0.1-0.2-0.1v1
	c0,0,0,0.1,0.1,0.1l0,0L9.5,32.3z"/>
<path class="st4" d="M11.4,36.6C11.4,36.6,11.4,36.6,11.4,36.6v-1.1c0,0.1,0,0.1-0.1,0.1l0,0H4.4c-0.1,0-0.1,0-0.1-0.1l0,0v1
	c0,0,0,0.1,0.1,0.1c0,0,0.1,0,0.1,0L11.4,36.6z"/>
<path class="st4" d="M13.2,40.9c0.1,0,0.2-0.1,0.2-0.2v-1c0,0.1-0.1,0.2-0.2,0.2H4.4c-0.1,0-0.2-0.1-0.2-0.2v1
	c0,0.1,0.1,0.2,0.2,0.2H13.2z"/>
<path class="st4" d="M59.6,40.9L59.6,40.9c0.1,0,0.2-0.1,0.2-0.2l0,0v-1c0,0.1-0.1,0.2-0.2,0.2l0,0h-8.7c-0.1,0-0.2-0.1-0.2-0.2l0,0
	v1c0,0.1,0.1,0.2,0.2,0.2l0,0H59.6z"/>
<path class="st4" d="M59.6,36.6c0.1,0,0.2-0.1,0.2-0.2v-1c0,0.1-0.1,0.2-0.2,0.2h0h-6.7c-0.1,0-0.2-0.1-0.2-0.2v0v1
	c0,0.1,0.1,0.2,0.1,0.2L59.6,36.6L59.6,36.6z"/>
<path class="st4" d="M22.3,22.8h3c0,0,0.1-0.1,0.1-0.2v-1c0,0.1,0,0.2-0.1,0.2h-3c0,0-0.1-0.1-0.1-0.2v1
	C22.2,22.7,22.2,22.8,22.3,22.8z"/>
<path class="st4" d="M18.5,22.8h3c0,0,0.1-0.1,0.1-0.2v-1c0,0.1,0,0.2-0.1,0.2h-3c0,0-0.1-0.1-0.1-0.2v1
	C18.4,22.7,18.4,22.8,18.5,22.8z"/>
<path class="st4" d="M14.7,22.8h3c0,0,0.1-0.1,0.1-0.2v-1c0,0.1,0,0.2-0.1,0.2h-3c-0.1,0-0.1-0.1-0.1-0.2v1
	C14.6,22.7,14.6,22.8,14.7,22.8z"/>
<path class="st4" d="M10.9,22.8h3c0.1,0,0.1-0.1,0.1-0.2v-1c0,0.1,0,0.2-0.1,0.2h-3c-0.1,0-0.1-0.1-0.1-0.2v1
	C10.8,22.7,10.9,22.8,10.9,22.8z"/>
<path class="st4" d="M39.5,22.8h3c0,0,0.1-0.1,0.1-0.2v-1c0,0.1,0,0.2-0.1,0.2h-3c0,0-0.1-0.1-0.1-0.2v1
	C39.4,22.7,39.5,22.8,39.5,22.8z"/>
<path class="st4" d="M35.7,22.8h3c0,0,0.1-0.1,0.1-0.2v-1c0,0.1,0,0.2-0.1,0.2h-3c0,0-0.1-0.1-0.1-0.2v1
	C35.6,22.7,35.7,22.8,35.7,22.8z"/>
<path class="st4" d="M31.9,22.8h3c0,0,0.1-0.1,0.1-0.2v-1c0,0.1,0,0.2-0.1,0.2h-3c0,0-0.1-0.1-0.1-0.2v1
	C31.8,22.7,31.9,22.8,31.9,22.8z"/>
<path class="st4" d="M28.1,22.8h3c0,0,0.1-0.1,0.1-0.2v-1c0,0.1,0,0.2-0.1,0.2h-3c0,0-0.1-0.1-0.1-0.2v1
	C28,22.7,28.1,22.8,28.1,22.8z"/>
<path class="st4" d="M56.7,22.8h3c0,0,0.1-0.1,0.1-0.2v-1c0,0.1,0,0.2-0.1,0.2h-3c0,0-0.1-0.1-0.1-0.2v1
	C56.6,22.7,56.7,22.8,56.7,22.8z"/>
<path class="st4" d="M52.9,22.8h3c0,0,0.1-0.1,0.1-0.2v-1c0,0.1,0,0.2-0.1,0.2h-3c0,0-0.1-0.1-0.1-0.2v1
	C52.8,22.7,52.9,22.8,52.9,22.8z"/>
<path class="st4" d="M49.2,22.8h3c0,0,0.1-0.1,0.1-0.2v-1c0,0.1,0,0.2-0.1,0.2h-3c0,0-0.1-0.1-0.1-0.2v1
	C49.1,22.7,49.1,22.8,49.2,22.8z"/>
<path class="st4" d="M45.4,22.8h3c0,0,0.1-0.1,0.1-0.2v-1c0,0.1,0,0.2-0.1,0.2h-3c0,0-0.1-0.1-0.1-0.2v1
	C45.3,22.7,45.3,22.8,45.4,22.8z"/>
<path class="st4" d="M4.4,22.8h3c0.1,0,0.1-0.1,0.1-0.2v-1c0,0.1,0,0.2-0.1,0.2h-3c-0.1,0-0.1-0.1-0.1-0.2v1
	C4.3,22.7,4.3,22.8,4.4,22.8z"/>
<path class="st4" d="M59.6,28c0.1,0,0.1-0.1,0.1-0.2v-1c0,0.1-0.1,0.2-0.2,0.2h-2.9c-0.1,0-0.2-0.1-0.2-0.2v1c0,0.1,0,0.1,0.1,0.1
	L59.6,28L59.6,28z"/>
<path class="st4" d="M53.6,28h1.6c0,0,0.1,0,0.1,0h0.4c0.1,0,0.1-0.1,0.1-0.1v-1c0,0.1-0.1,0.2-0.2,0.2h-2.9c-0.1,0-0.2-0.1-0.2-0.2
	v1c0,0.1,0.1,0.2,0.2,0.2L53.6,28L53.6,28z"/>
<path class="st4" d="M49.6,28h1l0,0h1c0.1,0,0.2-0.1,0.2-0.2v-1c0,0.1-0.1,0.2-0.2,0.2h-2.9c-0.1,0-0.2-0.1-0.2-0.2v1
	c0,0.1,0.1,0.2,0.2,0.2H49.6L49.6,28z"/>
<path class="st4" d="M45.6,28h1l0,0h1c0.1,0,0.2-0.1,0.2-0.2v-1c0,0.1-0.1,0.2-0.2,0.2h-2.9c-0.1,0-0.2-0.1-0.2-0.2v1
	c0,0.1,0.1,0.2,0.2,0.2H45.6L45.6,28z"/>
<path class="st4" d="M41.6,28h1l0,0h1c0.1,0,0.2-0.1,0.2-0.2v-1c0,0.1-0.1,0.2-0.2,0.2h-2.9c-0.1,0-0.2-0.1-0.2-0.2v1
	c0,0.1,0.1,0.2,0.2,0.2H41.6L41.6,28z"/>
<path class="st4" d="M37.5,28h1l0,0h1c0.1,0,0.2-0.1,0.2-0.2v-1c0,0.1-0.1,0.2-0.2,0.2h-2.9c-0.1,0-0.2-0.1-0.2-0.2v1
	c0,0.1,0.1,0.2,0.2,0.2C36.6,28,37.6,28,37.5,28z"/>
<path class="st4" d="M33.5,28h1l0,0h1c0.1,0,0.2-0.1,0.2-0.2v-1c0,0.1-0.1,0.2-0.2,0.2h-2.9c-0.1,0-0.2-0.1-0.2-0.2v1
	c0,0.1,0.1,0.2,0.2,0.2C32.5,28,33.5,28,33.5,28z"/>
<path class="st4" d="M29.5,28h1l0,0h1c0.1,0,0.2-0.1,0.1-0.2v-1c0,0.1-0.1,0.2-0.2,0.2c0,0,0,0,0,0h-2.9c-0.1,0-0.2-0.1-0.2-0.2
	c0,0,0,0,0,0v1c0,0.1,0.1,0.2,0.1,0.2C28.5,28,29.5,28,29.5,28z"/>
<path class="st4" d="M25.5,28h1l0,0h1c0.1,0,0.2-0.1,0.1-0.2v-1c0,0.1-0.1,0.2-0.2,0.2c0,0,0,0,0,0h-2.9c-0.1,0-0.2-0.1-0.2-0.2
	c0,0,0,0,0,0v1c0,0.1,0.1,0.2,0.1,0.2C24.5,28,25.5,28,25.5,28z"/>
<path class="st4" d="M21.5,28h1l0,0h1c0.1,0,0.2-0.1,0.1-0.2v-1c0,0.1-0.1,0.2-0.2,0.2c0,0,0,0,0,0h-2.9c-0.1,0-0.2-0.1-0.2-0.2
	c0,0,0,0,0,0v1c0,0.1,0.1,0.2,0.1,0.2C20.5,28,21.5,28,21.5,28z"/>
<path class="st4" d="M17.5,28h1l0,0h1c0.1,0,0.2-0.1,0.1-0.2v-1c0,0.1-0.1,0.2-0.2,0.2c0,0,0,0,0,0h-2.9c-0.1,0-0.2-0.1-0.2-0.2
	c0,0,0,0,0,0v1c0,0.1,0.1,0.2,0.1,0.2H17.5z"/>
<path class="st4" d="M13.5,28h1l0,0h1c0.1,0,0.2-0.1,0.1-0.2v-1c0,0.1-0.1,0.2-0.2,0.2l0,0h-2.9c-0.1,0-0.2-0.1-0.2-0.2l0,0v1
	c0,0.1,0.1,0.2,0.1,0.2H13.5z"/>
<path class="st4" d="M9.5,28h1l0,0h1c0.1,0,0.2-0.1,0.1-0.2v-1c0,0.1-0.1,0.2-0.2,0.2l0,0H8.5c-0.1,0-0.2-0.1-0.2-0.2l0,0v1
	c0,0.1,0,0.1,0.1,0.1L9.5,28C9.4,28,9.5,28,9.5,28z"/>
<path class="st4" d="M7.5,28c0.1,0,0.1-0.1,0.1-0.1v-1C7.6,27,7.5,27,7.4,27h0H4.5c-0.1,0-0.2-0.1-0.2-0.2l0,0v1
	c0,0.1,0,0.1,0.1,0.2L7.5,28L7.5,28z"/>
<path class="st4" d="M53.6,32.3c0.1,0,0.1-0.1,0.1-0.2v-1c0,0.1-0.1,0.2-0.2,0.2h-2.9c-0.1,0-0.2-0.1-0.2-0.2v1
	c0,0.1,0.1,0.2,0.2,0.2h2.2c0,0,0,0,0.1,0L53.6,32.3z"/>
<path class="st4" d="M49.7,32.1v-1c0,0.1-0.1,0.2-0.2,0.2h-2.9c-0.1,0-0.2-0.1-0.2-0.2v1c0,0.1,0.1,0.2,0.2,0.2h2.9
	C49.6,32.3,49.7,32.2,49.7,32.1z"/>
<path class="st4" d="M45.7,32.1v-1c0,0.1-0.1,0.2-0.2,0.2h-2.9c-0.1,0-0.2-0.1-0.2-0.2v1c0,0.1,0.1,0.2,0.2,0.2h2.9
	C45.6,32.3,45.7,32.2,45.7,32.1L45.7,32.1z"/>
<path class="st4" d="M41.7,32.1v-1c0,0.1-0.1,0.2-0.2,0.2h-2.9c-0.1,0-0.2-0.1-0.2-0.2v1c0,0.1,0.1,0.2,0.2,0.2h2.9
	C41.6,32.3,41.7,32.2,41.7,32.1L41.7,32.1z"/>
<path class="st4" d="M37.7,32.1v-1c0,0.1-0.1,0.2-0.2,0.2h-2.9c-0.1,0-0.2-0.1-0.2-0.2v1c0,0.1,0.1,0.2,0.2,0.2h2.9
	C37.6,32.3,37.7,32.2,37.7,32.1z"/>
<path class="st4" d="M33.7,32.1v-1c0,0.1-0.1,0.2-0.2,0.2h-2.9c-0.1,0-0.2-0.1-0.2-0.2c0,0,0,0,0,0v1c0,0.1,0.1,0.2,0.2,0.2h2.9
	C33.6,32.3,33.7,32.2,33.7,32.1z"/>
<path class="st4" d="M29.7,32.1v-1c0,0.1-0.1,0.2-0.2,0.2c0,0,0,0,0,0h-2.9c-0.1,0-0.2-0.1-0.2-0.2c0,0,0,0,0,0v1
	c0,0.1,0.1,0.2,0.2,0.2h2.9C29.6,32.3,29.7,32.2,29.7,32.1z"/>
<path class="st4" d="M25.7,32.1v-1c0,0.1-0.1,0.2-0.2,0.2c0,0,0,0,0,0h-2.9c-0.1,0-0.2-0.1-0.2-0.2c0,0,0,0,0,0v1
	c0,0.1,0.1,0.2,0.2,0.2h2.9C25.6,32.3,25.7,32.2,25.7,32.1z"/>
<path class="st4" d="M21.7,32.1v-1c0,0.1-0.1,0.2-0.2,0.2c0,0,0,0,0,0h-2.9c-0.1,0-0.2-0.1-0.2-0.2c0,0,0,0,0,0v1
	c0,0.1,0.1,0.2,0.2,0.2h2.9C21.6,32.3,21.7,32.2,21.7,32.1z"/>
<path class="st4" d="M17.6,32.1v-1c0,0.1-0.1,0.2-0.2,0.2c0,0,0,0,0,0h-2.9c-0.1,0-0.2-0.1-0.2-0.2l0,0v1c0,0.1,0.1,0.2,0.2,0.2h2.9
	C17.6,32.3,17.6,32.2,17.6,32.1z"/>
<path class="st4" d="M11.4,32.3h2c0.1,0,0.2-0.1,0.2-0.2v-1c0,0.1-0.1,0.2-0.2,0.2l0,0h-2.9c-0.1,0-0.2-0.1-0.2-0.2l0,0v1
	c0,0.1,0.1,0.1,0.1,0.2L11.4,32.3C11.4,32.3,11.4,32.3,11.4,32.3z"/>
<path class="st4" d="M49.5,36.6h1.2c0,0,0.1,0,0.1,0h0.8c0.1,0,0.1-0.1,0.1-0.2v-1c0,0.1-0.1,0.2-0.2,0.2h-2.9
	c-0.1,0-0.2-0.1-0.2-0.2v1c0,0.1,0.1,0.2,0.2,0.2L49.5,36.6L49.5,36.6z"/>
<path class="st4" d="M45.5,36.6h2c0.1,0,0.2-0.1,0.2-0.2v-1c0,0.1-0.1,0.2-0.2,0.2h-2.9c-0.1,0-0.2-0.1-0.2-0.2v1
	c0,0.1,0.1,0.2,0.2,0.2H45.5L45.5,36.6z"/>
<path class="st4" d="M41.5,36.6h2c0.1,0,0.2-0.1,0.2-0.2v-1c0,0.1-0.1,0.2-0.2,0.2h-2.9c-0.1,0-0.2-0.1-0.2-0.2v1
	c0,0.1,0.1,0.2,0.2,0.2H41.5L41.5,36.6z"/>
<path class="st4" d="M37.5,36.6h2c0.1,0,0.2-0.1,0.2-0.2v-1c0,0.1-0.1,0.2-0.2,0.2h-2.9c-0.1,0-0.2-0.1-0.2-0.2v1
	c0,0.1,0.1,0.2,0.2,0.2H37.5L37.5,36.6z"/>
<path class="st4" d="M33.5,36.6h2c0.1,0,0.2-0.1,0.2-0.2v-1c0,0.1-0.1,0.2-0.2,0.2h-2.9c-0.1,0-0.2-0.1-0.2-0.2v1
	c0,0.1,0.1,0.2,0.2,0.2H33.5z"/>
<path class="st4" d="M29.5,36.6h2c0.1,0,0.2-0.1,0.2-0.2v-1c0,0.1-0.1,0.2-0.2,0.2h-2.9c-0.1,0-0.2-0.1-0.2-0.2v1
	c0,0.1,0.1,0.2,0.2,0.2H29.5z"/>
<path class="st4" d="M25.5,36.6h2c0.1,0,0.2-0.1,0.2-0.2v-1c0,0.1-0.1,0.2-0.2,0.2h-2.9c-0.1,0-0.2-0.1-0.2-0.2v1
	c0,0.1,0.1,0.2,0.2,0.2H25.5z"/>
<path class="st4" d="M21.5,36.6h2c0.1,0,0.2-0.1,0.2-0.2v-1c0,0.1-0.1,0.2-0.2,0.2h-2.9c-0.1,0-0.2-0.1-0.2-0.2v1
	c0,0.1,0.1,0.2,0.2,0.2H21.5z"/>
<path class="st4" d="M17.5,36.6h2c0.1,0,0.2-0.1,0.2-0.2v-1c0,0.1-0.1,0.2-0.2,0.2h-2.9c-0.1,0-0.2-0.1-0.2-0.2v1
	c0,0.1,0.1,0.2,0.2,0.2C16.5,36.6,17.5,36.6,17.5,36.6z"/>
<path class="st4" d="M13.3,36.6h2.2c0.1,0,0.2-0.1,0.2-0.2v-1c0,0.1-0.1,0.2-0.2,0.2h-2.9c-0.1,0-0.2-0.1-0.2-0.2v1
	c0,0.1,0,0.1,0.1,0.2h0.8C13.2,36.6,13.3,36.6,13.3,36.6z"/>
<path class="st4" d="M49.5,40.9c0.1,0,0.2-0.1,0.2-0.2v-1c0,0.1-0.1,0.2-0.2,0.2h-2.9c-0.1,0-0.2-0.1-0.2-0.2v1
	c0,0.1,0.1,0.2,0.2,0.2H49.5L49.5,40.9z"/>
<path class="st4" d="M45.5,40.9c0.1,0,0.2-0.1,0.2-0.2v-1c0,0.1-0.1,0.2-0.2,0.2h-2.9c-0.1,0-0.2-0.1-0.2-0.2v1c0,0.1,0,0.1,0.1,0.2
	h0.8c0,0,0.1,0,0.1,0L45.5,40.9L45.5,40.9z"/>
<path class="st4" d="M41.7,40.8v-1c0,0.1-0.1,0.2-0.2,0.2h-2.9c-0.1,0-0.2-0.1-0.2-0.2v1c0,0.1,0,0.1,0.1,0.2h3.1
	C41.7,40.9,41.7,40.8,41.7,40.8z"/>
<path class="st4" d="M37.7,40.8v-1c0,0.1-0.1,0.2-0.2,0.2h-2.9c-0.1,0-0.2-0.1-0.2-0.2v1c0,0.1,0,0.1,0.1,0.2h3.1
	C37.7,40.9,37.7,40.8,37.7,40.8z"/>
<path class="st4" d="M33.7,40.8v-1c0,0.1-0.1,0.2-0.2,0.2h-2.9c-0.1,0-0.2-0.1-0.2-0.2v1c0,0.1,0,0.1,0.1,0.2h3.1
	C33.7,40.9,33.7,40.8,33.7,40.8z"/>
<path class="st4" d="M29.7,40.8v-1c0,0.1-0.1,0.2-0.2,0.2h-2.9c-0.1,0-0.2-0.1-0.2-0.2v1c0,0.1,0,0.1,0.1,0.2h3.1
	C29.7,40.9,29.7,40.8,29.7,40.8z"/>
<path class="st4" d="M25.7,40.8v-1c0,0.1-0.1,0.2-0.2,0.2h-2.9c-0.1,0-0.2-0.1-0.2-0.2v1c0,0.1,0,0.1,0.1,0.2h3.1
	C25.6,40.9,25.7,40.8,25.7,40.8z"/>
<path class="st4" d="M21.6,40.9c0.1,0,0.1-0.1,0.1-0.2v-1c0,0.1-0.1,0.2-0.2,0.2h-2.9c-0.1,0-0.2-0.1-0.2-0.2v1
	c0,0.1,0.1,0.2,0.2,0.2h2.1c0,0,0.1,0,0.1,0L21.6,40.9z"/>
<path class="st4" d="M17.5,40.9c0.1,0,0.2-0.1,0.2-0.2v-1c0,0.1-0.1,0.2-0.2,0.2h-2.9c-0.1,0-0.2-0.1-0.2-0.2v1
	c0,0.1,0.1,0.2,0.2,0.2H17.5L17.5,40.9z"/>
<path class="st4" d="M43.3,44.3H20.7c-0.1,0-0.2-0.1-0.2-0.2v1c0,0.1,0.1,0.2,0.2,0.2h22.6c0.1,0,0.2-0.1,0.2-0.2v-1
	C43.5,44.2,43.4,44.3,43.3,44.3z"/>
<linearGradient id="SVGID_30_" gradientUnits="userSpaceOnUse" x1="58.11" y1="22.45" x2="58.11" y2="26.23" gradientTransform="matrix(1 0 0 -1 0 49.73)">
	<stop  offset="0" style="stop-color:#1A1A1A"/>
	<stop  offset="1" style="stop-color:#595959"/>
</linearGradient>
<path class="st34" d="M56.7,23.5h2.9c0.2,0,0.4,0.2,0.4,0.4v2.9c0,0.2-0.2,0.4-0.4,0.4h-2.9c-0.2,0-0.4-0.2-0.4-0.4v-2.9
	C56.2,23.7,56.4,23.5,56.7,23.5z"/>
<linearGradient id="SVGID_31_" gradientUnits="userSpaceOnUse" x1="54.1" y1="22.45" x2="54.1" y2="26.23" gradientTransform="matrix(1 0 0 -1 0 49.73)">
	<stop  offset="0" style="stop-color:#1A1A1A"/>
	<stop  offset="1" style="stop-color:#595959"/>
</linearGradient>
<path class="st35" d="M52.6,23.5h2.9c0.2,0,0.4,0.2,0.4,0.4v2.9c0,0.2-0.2,0.4-0.4,0.4h-2.9c-0.2,0-0.4-0.2-0.4-0.4v-2.9
	C52.2,23.7,52.4,23.5,52.6,23.5z"/>
<linearGradient id="SVGID_32_" gradientUnits="userSpaceOnUse" x1="50.09" y1="22.45" x2="50.09" y2="26.23" gradientTransform="matrix(1 0 0 -1 0 49.73)">
	<stop  offset="0" style="stop-color:#1A1A1A"/>
	<stop  offset="1" style="stop-color:#595959"/>
</linearGradient>
<path class="st36" d="M48.6,23.5h2.9c0.2,0,0.4,0.2,0.4,0.4v2.9c0,0.2-0.2,0.4-0.4,0.4h-2.9c-0.2,0-0.4-0.2-0.4-0.4v-2.9
	C48.2,23.7,48.4,23.5,48.6,23.5z"/>
<linearGradient id="SVGID_33_" gradientUnits="userSpaceOnUse" x1="46.08" y1="22.45" x2="46.08" y2="26.23" gradientTransform="matrix(1 0 0 -1 0 49.73)">
	<stop  offset="0" style="stop-color:#1A1A1A"/>
	<stop  offset="1" style="stop-color:#595959"/>
</linearGradient>
<path class="st37" d="M44.6,23.5h2.9c0.2,0,0.4,0.2,0.4,0.4v2.9c0,0.2-0.2,0.4-0.4,0.4h-2.9c-0.2,0-0.4-0.2-0.4-0.4v-2.9
	C44.2,23.7,44.4,23.5,44.6,23.5z"/>
<linearGradient id="SVGID_34_" gradientUnits="userSpaceOnUse" x1="42.06" y1="22.45" x2="42.06" y2="26.23" gradientTransform="matrix(1 0 0 -1 0 49.73)">
	<stop  offset="0" style="stop-color:#1A1A1A"/>
	<stop  offset="1" style="stop-color:#595959"/>
</linearGradient>
<path class="st38" d="M40.6,23.5h2.9c0.2,0,0.4,0.2,0.4,0.4v2.9c0,0.2-0.2,0.4-0.4,0.4h-2.9c-0.2,0-0.4-0.2-0.4-0.4v-2.9
	C40.2,23.7,40.4,23.5,40.6,23.5z"/>
<linearGradient id="SVGID_35_" gradientUnits="userSpaceOnUse" x1="38.05" y1="22.45" x2="38.05" y2="26.23" gradientTransform="matrix(1 0 0 -1 0 49.73)">
	<stop  offset="0" style="stop-color:#1A1A1A"/>
	<stop  offset="1" style="stop-color:#595959"/>
</linearGradient>
<path class="st39" d="M36.6,23.5h2.9c0.2,0,0.4,0.2,0.4,0.4v2.9c0,0.2-0.2,0.4-0.4,0.4h-2.9c-0.2,0-0.4-0.2-0.4-0.4v-2.9
	C36.2,23.7,36.4,23.5,36.6,23.5z"/>
<linearGradient id="SVGID_36_" gradientUnits="userSpaceOnUse" x1="34.04" y1="22.45" x2="34.04" y2="26.23" gradientTransform="matrix(1 0 0 -1 0 49.73)">
	<stop  offset="0" style="stop-color:#1A1A1A"/>
	<stop  offset="1" style="stop-color:#595959"/>
</linearGradient>
<path class="st40" d="M32.6,23.5h2.9c0.2,0,0.4,0.2,0.4,0.4v2.9c0,0.2-0.2,0.4-0.4,0.4h-2.9c-0.2,0-0.4-0.2-0.4-0.4v-2.9
	C32.2,23.7,32.3,23.5,32.6,23.5z"/>
<linearGradient id="SVGID_37_" gradientUnits="userSpaceOnUse" x1="30.03" y1="22.45" x2="30.03" y2="26.23" gradientTransform="matrix(1 0 0 -1 0 49.73)">
	<stop  offset="0" style="stop-color:#1A1A1A"/>
	<stop  offset="1" style="stop-color:#595959"/>
</linearGradient>
<path class="st41" d="M28.6,23.5h2.9c0.2,0,0.4,0.2,0.4,0.4v2.9c0,0.2-0.2,0.4-0.4,0.4h-2.9c-0.2,0-0.4-0.2-0.4-0.4v-2.9
	C28.1,23.7,28.3,23.5,28.6,23.5z"/>
<linearGradient id="SVGID_38_" gradientUnits="userSpaceOnUse" x1="26.02" y1="22.45" x2="26.02" y2="26.23" gradientTransform="matrix(1 0 0 -1 0 49.73)">
	<stop  offset="0" style="stop-color:#1A1A1A"/>
	<stop  offset="1" style="stop-color:#595959"/>
</linearGradient>
<path class="st42" d="M24.6,23.5h2.9c0.2,0,0.4,0.2,0.4,0.4v2.9c0,0.2-0.2,0.4-0.4,0.4h-2.9c-0.2,0-0.4-0.2-0.4-0.4v-2.9
	C24.1,23.7,24.3,23.5,24.6,23.5z"/>
<linearGradient id="SVGID_39_" gradientUnits="userSpaceOnUse" x1="22.01" y1="22.45" x2="22.01" y2="26.23" gradientTransform="matrix(1 0 0 -1 0 49.73)">
	<stop  offset="0" style="stop-color:#1A1A1A"/>
	<stop  offset="1" style="stop-color:#595959"/>
</linearGradient>
<path class="st43" d="M20.6,23.5h2.9c0.2,0,0.4,0.2,0.4,0.4v2.9c0,0.2-0.2,0.4-0.4,0.4h-2.9c-0.2,0-0.4-0.2-0.4-0.4v-2.9
	C20.1,23.7,20.3,23.5,20.6,23.5z"/>
<linearGradient id="SVGID_40_" gradientUnits="userSpaceOnUse" x1="18" y1="22.45" x2="18" y2="26.23" gradientTransform="matrix(1 0 0 -1 0 49.73)">
	<stop  offset="0" style="stop-color:#1A1A1A"/>
	<stop  offset="1" style="stop-color:#595959"/>
</linearGradient>
<path class="st44" d="M16.5,23.5h2.9c0.2,0,0.4,0.2,0.4,0.4v2.9c0,0.2-0.2,0.4-0.4,0.4h-2.9c-0.2,0-0.4-0.2-0.4-0.4v-2.9
	C16.1,23.7,16.3,23.5,16.5,23.5z"/>
<linearGradient id="SVGID_41_" gradientUnits="userSpaceOnUse" x1="13.99" y1="22.45" x2="13.99" y2="26.23" gradientTransform="matrix(1 0 0 -1 0 49.73)">
	<stop  offset="0" style="stop-color:#1A1A1A"/>
	<stop  offset="1" style="stop-color:#595959"/>
</linearGradient>
<path class="st45" d="M12.5,23.5h2.9c0.2,0,0.4,0.2,0.4,0.4v2.9c0,0.2-0.2,0.4-0.4,0.4h-2.9c-0.2,0-0.4-0.2-0.4-0.4v-2.9
	C12.1,23.7,12.3,23.5,12.5,23.5z"/>
<linearGradient id="SVGID_42_" gradientUnits="userSpaceOnUse" x1="9.98" y1="22.45" x2="9.98" y2="26.23" gradientTransform="matrix(1 0 0 -1 0 49.73)">
	<stop  offset="0" style="stop-color:#1A1A1A"/>
	<stop  offset="1" style="stop-color:#595959"/>
</linearGradient>
<path class="st46" d="M8.5,23.5h2.9c0.2,0,0.4,0.2,0.4,0.4v2.9c0,0.2-0.2,0.4-0.4,0.4H8.5c-0.2,0-0.4-0.2-0.4-0.4v-2.9
	C8.1,23.7,8.3,23.5,8.5,23.5z"/>
<linearGradient id="SVGID_43_" gradientUnits="userSpaceOnUse" x1="5.97" y1="22.45" x2="5.97" y2="26.23" gradientTransform="matrix(1 0 0 -1 0 49.73)">
	<stop  offset="0" style="stop-color:#1A1A1A"/>
	<stop  offset="1" style="stop-color:#595959"/>
</linearGradient>
<path class="st47" d="M4.5,23.5h2.9c0.2,0,0.4,0.2,0.4,0.4v2.9c0,0.2-0.2,0.4-0.4,0.4H4.5c-0.2,0-0.4-0.2-0.4-0.4v-2.9
	C4.1,23.7,4.3,23.5,4.5,23.5z"/>
<linearGradient id="SVGID_44_" gradientUnits="userSpaceOnUse" x1="56.45" y1="24.34" x2="59.76" y2="24.34" gradientTransform="matrix(1 0 0 -1 0 49.73)">
	<stop  offset="0" style="stop-color:#CCCCCC"/>
	<stop  offset="1" style="stop-color:#F7F7F7"/>
</linearGradient>
<path class="st48" d="M56.6,23.7h2.9c0.1,0,0.2,0.1,0.2,0.2v2.9c0,0.1-0.1,0.2-0.2,0.2h-2.9c-0.1,0-0.2-0.1-0.2-0.2v-2.9
	C56.5,23.8,56.5,23.7,56.6,23.7z"/>
<linearGradient id="SVGID_45_" gradientUnits="userSpaceOnUse" x1="52.44" y1="24.34" x2="55.75" y2="24.34" gradientTransform="matrix(1 0 0 -1 0 49.73)">
	<stop  offset="0" style="stop-color:#CCCCCC"/>
	<stop  offset="1" style="stop-color:#F7F7F7"/>
</linearGradient>
<path class="st49" d="M52.6,23.7h2.9c0.1,0,0.2,0.1,0.2,0.2v2.9c0,0.1-0.1,0.2-0.2,0.2h-2.9c-0.1,0-0.2-0.1-0.2-0.2v-2.9
	C52.4,23.8,52.5,23.7,52.6,23.7z"/>
<linearGradient id="SVGID_46_" gradientUnits="userSpaceOnUse" x1="48.43" y1="24.34" x2="51.74" y2="24.34" gradientTransform="matrix(1 0 0 -1 0 49.73)">
	<stop  offset="0" style="stop-color:#CCCCCC"/>
	<stop  offset="1" style="stop-color:#F7F7F7"/>
</linearGradient>
<path class="st50" d="M48.6,23.7h2.9c0.1,0,0.2,0.1,0.2,0.2v2.9c0,0.1-0.1,0.2-0.2,0.2h-2.9c-0.1,0-0.2-0.1-0.2-0.2v-2.9
	C48.4,23.8,48.5,23.7,48.6,23.7z"/>
<linearGradient id="SVGID_47_" gradientUnits="userSpaceOnUse" x1="44.42" y1="24.34" x2="47.73" y2="24.34" gradientTransform="matrix(1 0 0 -1 0 49.73)">
	<stop  offset="0" style="stop-color:#CCCCCC"/>
	<stop  offset="1" style="stop-color:#F7F7F7"/>
</linearGradient>
<path class="st51" d="M44.6,23.7h2.9c0.1,0,0.2,0.1,0.2,0.2v2.9c0,0.1-0.1,0.2-0.2,0.2h-2.9c-0.1,0-0.2-0.1-0.2-0.2v-2.9
	C44.4,23.8,44.5,23.7,44.6,23.7z"/>
<linearGradient id="SVGID_48_" gradientUnits="userSpaceOnUse" x1="40.41" y1="24.34" x2="43.72" y2="24.34" gradientTransform="matrix(1 0 0 -1 0 49.73)">
	<stop  offset="0" style="stop-color:#CCCCCC"/>
	<stop  offset="1" style="stop-color:#F7F7F7"/>
</linearGradient>
<path class="st52" d="M40.6,23.7h2.9c0.1,0,0.2,0.1,0.2,0.2v2.9c0,0.1-0.1,0.2-0.2,0.2h-2.9c-0.1,0-0.2-0.1-0.2-0.2v-2.9
	C40.4,23.8,40.5,23.7,40.6,23.7z"/>
<linearGradient id="SVGID_49_" gradientUnits="userSpaceOnUse" x1="36.4" y1="24.34" x2="39.71" y2="24.34" gradientTransform="matrix(1 0 0 -1 0 49.73)">
	<stop  offset="0" style="stop-color:#CCCCCC"/>
	<stop  offset="1" style="stop-color:#F7F7F7"/>
</linearGradient>
<path class="st53" d="M36.6,23.7h2.9c0.1,0,0.2,0.1,0.2,0.2v2.9c0,0.1-0.1,0.2-0.2,0.2h-2.9c-0.1,0-0.2-0.1-0.2-0.2v-2.9
	C36.4,23.8,36.5,23.7,36.6,23.7z"/>
<linearGradient id="SVGID_50_" gradientUnits="userSpaceOnUse" x1="32.39" y1="24.34" x2="35.7" y2="24.34" gradientTransform="matrix(1 0 0 -1 0 49.73)">
	<stop  offset="0" style="stop-color:#CCCCCC"/>
	<stop  offset="1" style="stop-color:#F7F7F7"/>
</linearGradient>
<path class="st54" d="M32.6,23.7h2.9c0.1,0,0.2,0.1,0.2,0.2v2.9c0,0.1-0.1,0.2-0.2,0.2h-2.9c-0.1,0-0.2-0.1-0.2-0.2v-2.9
	C32.4,23.8,32.5,23.7,32.6,23.7z"/>
<linearGradient id="SVGID_51_" gradientUnits="userSpaceOnUse" x1="28.38" y1="24.34" x2="31.69" y2="24.34" gradientTransform="matrix(1 0 0 -1 0 49.73)">
	<stop  offset="0" style="stop-color:#CCCCCC"/>
	<stop  offset="1" style="stop-color:#F7F7F7"/>
</linearGradient>
<path class="st55" d="M28.6,23.7h2.9c0.1,0,0.2,0.1,0.2,0.2v2.9c0,0.1-0.1,0.2-0.2,0.2h-2.9c-0.1,0-0.2-0.1-0.2-0.2v-2.9
	C28.4,23.8,28.5,23.7,28.6,23.7z"/>
<linearGradient id="SVGID_52_" gradientUnits="userSpaceOnUse" x1="24.37" y1="24.34" x2="27.68" y2="24.34" gradientTransform="matrix(1 0 0 -1 0 49.73)">
	<stop  offset="0" style="stop-color:#CCCCCC"/>
	<stop  offset="1" style="stop-color:#F7F7F7"/>
</linearGradient>
<path class="st56" d="M24.6,23.7h2.9c0.1,0,0.2,0.1,0.2,0.2v2.9c0,0.1-0.1,0.2-0.2,0.2h-2.9c-0.1,0-0.2-0.1-0.2-0.2v-2.9
	C24.4,23.8,24.5,23.7,24.6,23.7z"/>
<linearGradient id="SVGID_53_" gradientUnits="userSpaceOnUse" x1="20.36" y1="24.34" x2="23.67" y2="24.34" gradientTransform="matrix(1 0 0 -1 0 49.73)">
	<stop  offset="0" style="stop-color:#CCCCCC"/>
	<stop  offset="1" style="stop-color:#F7F7F7"/>
</linearGradient>
<path class="st57" d="M20.6,23.7h2.9c0.1,0,0.2,0.1,0.2,0.2v2.9c0,0.1-0.1,0.2-0.2,0.2h-2.9c-0.1,0-0.2-0.1-0.2-0.2v-2.9
	C20.4,23.8,20.4,23.7,20.6,23.7z"/>
<linearGradient id="SVGID_54_" gradientUnits="userSpaceOnUse" x1="16.35" y1="24.34" x2="19.66" y2="24.34" gradientTransform="matrix(1 0 0 -1 0 49.73)">
	<stop  offset="0" style="stop-color:#CCCCCC"/>
	<stop  offset="1" style="stop-color:#F7F7F7"/>
</linearGradient>
<path class="st58" d="M16.5,23.7h2.9c0.1,0,0.2,0.1,0.2,0.2v2.9c0,0.1-0.1,0.2-0.2,0.2h-2.9c-0.1,0-0.2-0.1-0.2-0.2v-2.9
	C16.4,23.8,16.4,23.7,16.5,23.7z"/>
<linearGradient id="SVGID_55_" gradientUnits="userSpaceOnUse" x1="12.34" y1="24.34" x2="15.65" y2="24.34" gradientTransform="matrix(1 0 0 -1 0 49.73)">
	<stop  offset="0" style="stop-color:#CCCCCC"/>
	<stop  offset="1" style="stop-color:#F7F7F7"/>
</linearGradient>
<path class="st59" d="M12.5,23.7h2.9c0.1,0,0.2,0.1,0.2,0.2v2.9c0,0.1-0.1,0.2-0.2,0.2h-2.9c-0.1,0-0.2-0.1-0.2-0.2v-2.9
	C12.3,23.8,12.4,23.7,12.5,23.7z"/>
<linearGradient id="SVGID_56_" gradientUnits="userSpaceOnUse" x1="8.33" y1="24.34" x2="11.64" y2="24.34" gradientTransform="matrix(1 0 0 -1 0 49.73)">
	<stop  offset="0" style="stop-color:#CCCCCC"/>
	<stop  offset="1" style="stop-color:#F7F7F7"/>
</linearGradient>
<path class="st60" d="M8.5,23.7h2.9c0.1,0,0.2,0.1,0.2,0.2v2.9c0,0.1-0.1,0.2-0.2,0.2H8.5c-0.1,0-0.2-0.1-0.2-0.2v-2.9
	C8.3,23.8,8.4,23.7,8.5,23.7z"/>
<linearGradient id="SVGID_57_" gradientUnits="userSpaceOnUse" x1="4.32" y1="24.34" x2="7.63" y2="24.34" gradientTransform="matrix(1 0 0 -1 0 49.73)">
	<stop  offset="0" style="stop-color:#CCCCCC"/>
	<stop  offset="1" style="stop-color:#F7F7F7"/>
</linearGradient>
<path class="st61" d="M4.5,23.7h2.9c0.1,0,0.2,0.1,0.2,0.2v2.9C7.6,27,7.5,27,7.4,27H4.5c-0.1,0-0.2-0.1-0.2-0.2v-2.9
	C4.3,23.8,4.4,23.7,4.5,23.7z"/>
<path class="st2" d="M56.7,24.7h2.9c0.1,0,0.2,0.1,0.2,0.2v-1c0-0.1-0.1-0.2-0.2-0.2h-2.9c-0.1,0-0.2,0.1-0.2,0.2v1
	C56.5,24.8,56.5,24.7,56.7,24.7z"/>
<path class="st2" d="M52.6,24.7h2.9c0.1,0,0.2,0.1,0.2,0.2v-1c0-0.1-0.1-0.2-0.2-0.2h-2.9c-0.1,0-0.2,0.1-0.2,0.2v1
	C52.5,24.8,52.5,24.7,52.6,24.7z"/>
<path class="st2" d="M48.6,24.7h2.9c0.1,0,0.2,0.1,0.2,0.2v-1c0-0.1-0.1-0.2-0.2-0.2h-2.9c-0.1,0-0.2,0.1-0.2,0.2v1
	C48.4,24.8,48.5,24.7,48.6,24.7z"/>
<path class="st2" d="M44.6,24.7h2.9c0.1,0,0.2,0.1,0.2,0.2v-1c0-0.1-0.1-0.2-0.2-0.2h-2.9c-0.1,0-0.2,0.1-0.2,0.2v1
	C44.4,24.8,44.5,24.7,44.6,24.7z"/>
<path class="st2" d="M40.4,23.9v1c0-0.1,0.1-0.2,0.2-0.2h2.9c0.1,0,0.2,0.1,0.2,0.2v-1c0-0.1-0.1-0.2-0.2-0.2h-2.9
	C40.5,23.7,40.4,23.8,40.4,23.9C40.4,23.9,40.4,23.9,40.4,23.9z"/>
<path class="st2" d="M36.6,23.7c-0.1,0-0.2,0.1-0.2,0.2v1c0-0.1,0.1-0.2,0.2-0.2h2.9c0.1,0,0.2,0.1,0.2,0.2v-1
	c0-0.1-0.1-0.2-0.2-0.2H36.6z"/>
<path class="st2" d="M32.4,23.9v1c0-0.1,0.1-0.2,0.2-0.2h2.9c0.1,0,0.2,0.1,0.2,0.2v-1c0-0.1-0.1-0.2-0.2-0.2h-2.9
	C32.5,23.7,32.4,23.8,32.4,23.9C32.4,23.9,32.4,23.9,32.4,23.9z"/>
<path class="st2" d="M28.4,23.9v1c0-0.1,0.1-0.2,0.2-0.2c0,0,0,0,0,0h2.9c0.1,0,0.2,0.1,0.2,0.2c0,0,0,0,0,0v-1
	c0-0.1-0.1-0.2-0.2-0.2c0,0,0,0,0,0h-2.9C28.5,23.7,28.4,23.8,28.4,23.9C28.4,23.9,28.4,23.9,28.4,23.9z"/>
<path class="st2" d="M24.4,23.9v1c0-0.1,0.1-0.2,0.2-0.2c0,0,0,0,0,0h2.9c0.1,0,0.2,0.1,0.2,0.2c0,0,0,0,0,0v-1
	c0-0.1-0.1-0.2-0.2-0.2c0,0,0,0,0,0h-2.9C24.5,23.7,24.4,23.8,24.4,23.9z"/>
<path class="st2" d="M20.5,23.7c-0.1,0-0.2,0.1-0.2,0.2c0,0,0,0,0,0v1c0-0.1,0.1-0.2,0.2-0.2c0,0,0,0,0,0h2.9c0.1,0,0.2,0.1,0.2,0.2
	c0,0,0,0,0,0v-1c0-0.1-0.1-0.2-0.2-0.2c0,0,0,0,0,0H20.5z"/>
<path class="st2" d="M16.5,23.7c-0.1,0-0.2,0.1-0.2,0.2c0,0,0,0,0,0v1c0-0.1,0.1-0.2,0.2-0.2c0,0,0,0,0,0h2.9c0.1,0,0.2,0.1,0.2,0.2
	c0,0,0,0,0,0v-1c0-0.1-0.1-0.2-0.2-0.2c0,0,0,0,0,0H16.5z"/>
<path class="st2" d="M12.5,23.7c-0.1,0-0.2,0.1-0.2,0.2l0,0v1c0-0.1,0.1-0.2,0.2-0.2l0,0h2.9c0.1,0,0.2,0.1,0.2,0.2l0,0v-1
	c0-0.1-0.1-0.2-0.2-0.2l0,0H12.5z"/>
<path class="st2" d="M8.5,24.7h2.9c0.1,0,0.2,0.1,0.2,0.2l0,0v-1c0-0.1-0.1-0.2-0.2-0.2l0,0H8.5c-0.1,0-0.2,0.1-0.2,0.2l0,0v1
	C8.3,24.8,8.4,24.7,8.5,24.7L8.5,24.7z"/>
<path class="st2" d="M4.5,23.7c-0.1,0-0.2,0.1-0.2,0.2l0,0v1c0-0.1,0.1-0.2,0.2-0.2h0h2.9c0.1,0,0.2,0.1,0.2,0.2l0,0v-1
	c0-0.1-0.1-0.2-0.2-0.2h0H4.5z"/>
<linearGradient id="SVGID_58_" gradientUnits="userSpaceOnUse" x1="50.09" y1="13.85" x2="50.09" y2="17.63" gradientTransform="matrix(1 0 0 -1 0 49.73)">
	<stop  offset="0" style="stop-color:#1A1A1A"/>
	<stop  offset="1" style="stop-color:#595959"/>
</linearGradient>
<path class="st62" d="M48.6,32.1h2.9c0.2,0,0.4,0.2,0.4,0.4v2.9c0,0.2-0.2,0.4-0.4,0.4h-2.9c-0.2,0-0.4-0.2-0.4-0.4v-2.9
	C48.2,32.3,48.4,32.1,48.6,32.1z"/>
<linearGradient id="SVGID_59_" gradientUnits="userSpaceOnUse" x1="46.08" y1="13.85" x2="46.08" y2="17.63" gradientTransform="matrix(1 0 0 -1 0 49.73)">
	<stop  offset="0" style="stop-color:#1A1A1A"/>
	<stop  offset="1" style="stop-color:#595959"/>
</linearGradient>
<path class="st63" d="M44.6,32.1h2.9c0.2,0,0.4,0.2,0.4,0.4v2.9c0,0.2-0.2,0.4-0.4,0.4h-2.9c-0.2,0-0.4-0.2-0.4-0.4v-2.9
	C44.2,32.3,44.4,32.1,44.6,32.1z"/>
<linearGradient id="SVGID_60_" gradientUnits="userSpaceOnUse" x1="42.07" y1="13.85" x2="42.07" y2="17.63" gradientTransform="matrix(1 0 0 -1 0 49.73)">
	<stop  offset="0" style="stop-color:#1A1A1A"/>
	<stop  offset="1" style="stop-color:#595959"/>
</linearGradient>
<path class="st64" d="M40.6,32.1h2.9c0.2,0,0.4,0.2,0.4,0.4v2.9c0,0.2-0.2,0.4-0.4,0.4h-2.9c-0.2,0-0.4-0.2-0.4-0.4v-2.9
	C40.2,32.3,40.4,32.1,40.6,32.1z"/>
<linearGradient id="SVGID_61_" gradientUnits="userSpaceOnUse" x1="38.05" y1="13.85" x2="38.05" y2="17.63" gradientTransform="matrix(1 0 0 -1 0 49.73)">
	<stop  offset="0" style="stop-color:#1A1A1A"/>
	<stop  offset="1" style="stop-color:#595959"/>
</linearGradient>
<path class="st65" d="M36.6,32.1h2.9c0.2,0,0.4,0.2,0.4,0.4v2.9c0,0.2-0.2,0.4-0.4,0.4h-2.9c-0.2,0-0.4-0.2-0.4-0.4v-2.9
	C36.2,32.3,36.4,32.1,36.6,32.1z"/>
<linearGradient id="SVGID_62_" gradientUnits="userSpaceOnUse" x1="34.04" y1="13.85" x2="34.04" y2="17.63" gradientTransform="matrix(1 0 0 -1 0 49.73)">
	<stop  offset="0" style="stop-color:#1A1A1A"/>
	<stop  offset="1" style="stop-color:#595959"/>
</linearGradient>
<path class="st66" d="M32.6,32.1h2.9c0.2,0,0.4,0.2,0.4,0.4v2.9c0,0.2-0.2,0.4-0.4,0.4h-2.9c-0.2,0-0.4-0.2-0.4-0.4v-2.9
	C32.2,32.3,32.3,32.1,32.6,32.1z"/>
<linearGradient id="SVGID_63_" gradientUnits="userSpaceOnUse" x1="30.03" y1="13.85" x2="30.03" y2="17.63" gradientTransform="matrix(1 0 0 -1 0 49.73)">
	<stop  offset="0" style="stop-color:#1A1A1A"/>
	<stop  offset="1" style="stop-color:#595959"/>
</linearGradient>
<path class="st67" d="M28.6,32.1h2.9c0.2,0,0.4,0.2,0.4,0.4v2.9c0,0.2-0.2,0.4-0.4,0.4h-2.9c-0.2,0-0.4-0.2-0.4-0.4v-2.9
	C28.1,32.3,28.3,32.1,28.6,32.1z"/>
<linearGradient id="SVGID_64_" gradientUnits="userSpaceOnUse" x1="26.02" y1="13.85" x2="26.02" y2="17.63" gradientTransform="matrix(1 0 0 -1 0 49.73)">
	<stop  offset="0" style="stop-color:#1A1A1A"/>
	<stop  offset="1" style="stop-color:#595959"/>
</linearGradient>
<path class="st68" d="M24.6,32.1h2.9c0.2,0,0.4,0.2,0.4,0.4v2.9c0,0.2-0.2,0.4-0.4,0.4h-2.9c-0.2,0-0.4-0.2-0.4-0.4v-2.9
	C24.1,32.3,24.3,32.1,24.6,32.1z"/>
<linearGradient id="SVGID_65_" gradientUnits="userSpaceOnUse" x1="22.01" y1="13.85" x2="22.01" y2="17.63" gradientTransform="matrix(1 0 0 -1 0 49.73)">
	<stop  offset="0" style="stop-color:#1A1A1A"/>
	<stop  offset="1" style="stop-color:#595959"/>
</linearGradient>
<path class="st69" d="M20.6,32.1h2.9c0.2,0,0.4,0.2,0.4,0.4v2.9c0,0.2-0.2,0.4-0.4,0.4h-2.9c-0.2,0-0.4-0.2-0.4-0.4v-2.9
	C20.1,32.3,20.3,32.1,20.6,32.1z"/>
<linearGradient id="SVGID_66_" gradientUnits="userSpaceOnUse" x1="18" y1="13.85" x2="18" y2="17.63" gradientTransform="matrix(1 0 0 -1 0 49.73)">
	<stop  offset="0" style="stop-color:#1A1A1A"/>
	<stop  offset="1" style="stop-color:#595959"/>
</linearGradient>
<path class="st70" d="M16.5,32.1h2.9c0.2,0,0.4,0.2,0.4,0.4v2.9c0,0.2-0.2,0.4-0.4,0.4h-2.9c-0.2,0-0.4-0.2-0.4-0.4v-2.9
	C16.1,32.3,16.3,32.1,16.5,32.1z"/>
<linearGradient id="SVGID_67_" gradientUnits="userSpaceOnUse" x1="13.99" y1="13.85" x2="13.99" y2="17.63" gradientTransform="matrix(1 0 0 -1 0 49.73)">
	<stop  offset="0" style="stop-color:#1A1A1A"/>
	<stop  offset="1" style="stop-color:#595959"/>
</linearGradient>
<path class="st71" d="M12.5,32.1h2.9c0.2,0,0.4,0.2,0.4,0.4v2.9c0,0.2-0.2,0.4-0.4,0.4h-2.9c-0.2,0-0.4-0.2-0.4-0.4v-2.9
	C12.1,32.3,12.3,32.1,12.5,32.1z"/>
<linearGradient id="SVGID_68_" gradientUnits="userSpaceOnUse" x1="48.43" y1="15.74" x2="51.74" y2="15.74" gradientTransform="matrix(1 0 0 -1 0 49.73)">
	<stop  offset="0" style="stop-color:#CCCCCC"/>
	<stop  offset="1" style="stop-color:#F7F7F7"/>
</linearGradient>
<path class="st72" d="M48.6,32.3h2.9c0.1,0,0.2,0.1,0.2,0.2v2.9c0,0.1-0.1,0.2-0.2,0.2h-2.9c-0.1,0-0.2-0.1-0.2-0.2v-2.9
	C48.4,32.4,48.5,32.3,48.6,32.3z"/>
<linearGradient id="SVGID_69_" gradientUnits="userSpaceOnUse" x1="44.42" y1="15.74" x2="47.73" y2="15.74" gradientTransform="matrix(1 0 0 -1 0 49.73)">
	<stop  offset="0" style="stop-color:#CCCCCC"/>
	<stop  offset="1" style="stop-color:#F7F7F7"/>
</linearGradient>
<path class="st73" d="M44.6,32.3h2.9c0.1,0,0.2,0.1,0.2,0.2v2.9c0,0.1-0.1,0.2-0.2,0.2h-2.9c-0.1,0-0.2-0.1-0.2-0.2v-2.9
	C44.4,32.4,44.5,32.3,44.6,32.3z"/>
<linearGradient id="SVGID_70_" gradientUnits="userSpaceOnUse" x1="40.41" y1="15.74" x2="43.72" y2="15.74" gradientTransform="matrix(1 0 0 -1 0 49.73)">
	<stop  offset="0" style="stop-color:#CCCCCC"/>
	<stop  offset="1" style="stop-color:#F7F7F7"/>
</linearGradient>
<path class="st74" d="M40.6,32.3h2.9c0.1,0,0.2,0.1,0.2,0.2v2.9c0,0.1-0.1,0.2-0.2,0.2h-2.9c-0.1,0-0.2-0.1-0.2-0.2v-2.9
	C40.4,32.4,40.5,32.3,40.6,32.3z"/>
<linearGradient id="SVGID_71_" gradientUnits="userSpaceOnUse" x1="36.4" y1="15.74" x2="39.71" y2="15.74" gradientTransform="matrix(1 0 0 -1 0 49.73)">
	<stop  offset="0" style="stop-color:#CCCCCC"/>
	<stop  offset="1" style="stop-color:#F7F7F7"/>
</linearGradient>
<path class="st75" d="M36.6,32.3h2.9c0.1,0,0.2,0.1,0.2,0.2v2.9c0,0.1-0.1,0.2-0.2,0.2h-2.9c-0.1,0-0.2-0.1-0.2-0.2v-2.9
	C36.4,32.4,36.5,32.3,36.6,32.3z"/>
<linearGradient id="SVGID_72_" gradientUnits="userSpaceOnUse" x1="32.39" y1="15.74" x2="35.7" y2="15.74" gradientTransform="matrix(1 0 0 -1 0 49.73)">
	<stop  offset="0" style="stop-color:#CCCCCC"/>
	<stop  offset="1" style="stop-color:#F7F7F7"/>
</linearGradient>
<path class="st76" d="M32.6,32.3h2.9c0.1,0,0.2,0.1,0.2,0.2v2.9c0,0.1-0.1,0.2-0.2,0.2h-2.9c-0.1,0-0.2-0.1-0.2-0.2v-2.9
	C32.4,32.4,32.5,32.3,32.6,32.3z"/>
<linearGradient id="SVGID_73_" gradientUnits="userSpaceOnUse" x1="28.38" y1="15.74" x2="31.69" y2="15.74" gradientTransform="matrix(1 0 0 -1 0 49.73)">
	<stop  offset="0" style="stop-color:#CCCCCC"/>
	<stop  offset="1" style="stop-color:#F7F7F7"/>
</linearGradient>
<path class="st77" d="M28.6,32.3h2.9c0.1,0,0.2,0.1,0.2,0.2v2.9c0,0.1-0.1,0.2-0.2,0.2h-2.9c-0.1,0-0.2-0.1-0.2-0.2v-2.9
	C28.4,32.4,28.5,32.3,28.6,32.3z"/>
<linearGradient id="SVGID_74_" gradientUnits="userSpaceOnUse" x1="24.37" y1="15.74" x2="27.68" y2="15.74" gradientTransform="matrix(1 0 0 -1 0 49.73)">
	<stop  offset="0" style="stop-color:#CCCCCC"/>
	<stop  offset="1" style="stop-color:#F7F7F7"/>
</linearGradient>
<path class="st78" d="M24.6,32.3h2.9c0.1,0,0.2,0.1,0.2,0.2v2.9c0,0.1-0.1,0.2-0.2,0.2h-2.9c-0.1,0-0.2-0.1-0.2-0.2v-2.9
	C24.4,32.4,24.5,32.3,24.6,32.3z"/>
<linearGradient id="SVGID_75_" gradientUnits="userSpaceOnUse" x1="20.36" y1="15.74" x2="23.67" y2="15.74" gradientTransform="matrix(1 0 0 -1 0 49.73)">
	<stop  offset="0" style="stop-color:#CCCCCC"/>
	<stop  offset="1" style="stop-color:#F7F7F7"/>
</linearGradient>
<path class="st79" d="M20.6,32.3h2.9c0.1,0,0.2,0.1,0.2,0.2v2.9c0,0.1-0.1,0.2-0.2,0.2h-2.9c-0.1,0-0.2-0.1-0.2-0.2v-2.9
	C20.4,32.4,20.4,32.3,20.6,32.3z"/>
<linearGradient id="SVGID_76_" gradientUnits="userSpaceOnUse" x1="16.35" y1="15.74" x2="19.66" y2="15.74" gradientTransform="matrix(1 0 0 -1 0 49.73)">
	<stop  offset="0" style="stop-color:#CCCCCC"/>
	<stop  offset="1" style="stop-color:#F7F7F7"/>
</linearGradient>
<path class="st80" d="M16.5,32.3h2.9c0.1,0,0.2,0.1,0.2,0.2v2.9c0,0.1-0.1,0.2-0.2,0.2h-2.9c-0.1,0-0.2-0.1-0.2-0.2v-2.9
	C16.4,32.4,16.4,32.3,16.5,32.3z"/>
<linearGradient id="SVGID_77_" gradientUnits="userSpaceOnUse" x1="12.34" y1="15.74" x2="15.65" y2="15.74" gradientTransform="matrix(1 0 0 -1 0 49.73)">
	<stop  offset="0" style="stop-color:#CCCCCC"/>
	<stop  offset="1" style="stop-color:#F7F7F7"/>
</linearGradient>
<path class="st81" d="M12.5,32.3h2.9c0.1,0,0.2,0.1,0.2,0.2v2.9c0,0.1-0.1,0.2-0.2,0.2h-2.9c-0.1,0-0.2-0.1-0.2-0.2v-2.9
	C12.3,32.4,12.4,32.3,12.5,32.3z"/>
<linearGradient id="SVGID_78_" gradientUnits="userSpaceOnUse" x1="8.82" y1="9.55" x2="8.82" y2="13.37" gradientTransform="matrix(1 0 0 -1 0 49.73)">
	<stop  offset="0" style="stop-color:#1A1A1A"/>
	<stop  offset="1" style="stop-color:#595959"/>
</linearGradient>
<path class="st82" d="M4,39.9v-3.3c0-0.1,0.1-0.3,0.3-0.3h9c0.1,0,0.3,0.1,0.3,0.3v3.3c0,0.1-0.1,0.3-0.3,0.3h-9
	C4.2,40.2,4,40.1,4,39.9z"/>
<linearGradient id="SVGID_79_" gradientUnits="userSpaceOnUse" x1="8.82" y1="9.79" x2="8.82" y2="13.13" gradientTransform="matrix(1 0 0 -1 0 49.73)">
	<stop  offset="0" style="stop-color:#CCCCCC"/>
	<stop  offset="1" style="stop-color:#F7F7F7"/>
</linearGradient>
<path class="st83" d="M4.4,36.6h8.8c0.1,0,0.2,0.1,0.2,0.2v3c0,0.1-0.1,0.2-0.2,0.2H4.4c-0.1,0-0.2-0.1-0.2-0.2v-3
	C4.3,36.7,4.4,36.6,4.4,36.6z"/>
<linearGradient id="SVGID_80_" gradientUnits="userSpaceOnUse" x1="55.25" y1="9.55" x2="55.25" y2="13.37" gradientTransform="matrix(1 0 0 -1 0 49.73)">
	<stop  offset="0" style="stop-color:#1A1A1A"/>
	<stop  offset="1" style="stop-color:#595959"/>
</linearGradient>
<path class="st84" d="M50.5,39.9v-3.3c0-0.1,0.1-0.3,0.3-0.3h9c0.1,0,0.3,0.1,0.3,0.3v3.3c0,0.1-0.1,0.3-0.3,0.3h-9
	C50.6,40.2,50.5,40.1,50.5,39.9z"/>
<linearGradient id="SVGID_81_" gradientUnits="userSpaceOnUse" x1="17.96" y1="5.25" x2="17.96" y2="9.03" gradientTransform="matrix(1 0 0 -1 0 49.73)">
	<stop  offset="0" style="stop-color:#1A1A1A"/>
	<stop  offset="1" style="stop-color:#595959"/>
</linearGradient>
<path class="st85" d="M16.5,40.7h2.9c0.2,0,0.4,0.2,0.4,0.4v2.9c0,0.2-0.2,0.4-0.4,0.4h-2.9c-0.2,0-0.4-0.2-0.4-0.4v-2.9
	C16.1,40.9,16.3,40.7,16.5,40.7z"/>
<linearGradient id="SVGID_82_" gradientUnits="userSpaceOnUse" x1="13.95" y1="5.25" x2="13.95" y2="9.03" gradientTransform="matrix(1 0 0 -1 0 49.73)">
	<stop  offset="0" style="stop-color:#1A1A1A"/>
	<stop  offset="1" style="stop-color:#595959"/>
</linearGradient>
<path class="st86" d="M12.5,40.7h2.9c0.2,0,0.4,0.2,0.4,0.4v2.9c0,0.2-0.2,0.4-0.4,0.4h-2.9c-0.2,0-0.4-0.2-0.4-0.4v-2.9
	C12.1,40.9,12.3,40.7,12.5,40.7z"/>
<linearGradient id="SVGID_83_" gradientUnits="userSpaceOnUse" x1="9.94" y1="5.25" x2="9.94" y2="9.03" gradientTransform="matrix(1 0 0 -1 0 49.73)">
	<stop  offset="0" style="stop-color:#1A1A1A"/>
	<stop  offset="1" style="stop-color:#595959"/>
</linearGradient>
<path class="st87" d="M8.5,40.7h2.9c0.2,0,0.4,0.2,0.4,0.4v2.9c0,0.2-0.2,0.4-0.4,0.4H8.5c-0.2,0-0.4-0.2-0.4-0.4v-2.9
	C8.1,40.9,8.2,40.7,8.5,40.7z"/>
<linearGradient id="SVGID_84_" gradientUnits="userSpaceOnUse" x1="5.93" y1="5.25" x2="5.93" y2="9.03" gradientTransform="matrix(1 0 0 -1 0 49.73)">
	<stop  offset="0" style="stop-color:#1A1A1A"/>
	<stop  offset="1" style="stop-color:#595959"/>
</linearGradient>
<path class="st88" d="M4.5,40.7h2.9c0.2,0,0.4,0.2,0.4,0.4v2.9c0,0.2-0.2,0.4-0.4,0.4H4.5c-0.2,0-0.4-0.2-0.4-0.4v-2.9
	C4,40.9,4.2,40.7,4.5,40.7z"/>
<linearGradient id="SVGID_85_" gradientUnits="userSpaceOnUse" x1="16.31" y1="7.14" x2="19.62" y2="7.14" gradientTransform="matrix(1 0 0 -1 0 49.73)">
	<stop  offset="0" style="stop-color:#CCCCCC"/>
	<stop  offset="1" style="stop-color:#F7F7F7"/>
</linearGradient>
<path class="st89" d="M16.5,40.9h2.9c0.1,0,0.2,0.1,0.2,0.2v2.9c0,0.1-0.1,0.2-0.2,0.2h-2.9c-0.1,0-0.2-0.1-0.2-0.2v-2.9
	C16.3,41,16.4,40.9,16.5,40.9z"/>
<linearGradient id="SVGID_86_" gradientUnits="userSpaceOnUse" x1="12.3" y1="7.14" x2="15.61" y2="7.14" gradientTransform="matrix(1 0 0 -1 0 49.73)">
	<stop  offset="0" style="stop-color:#CCCCCC"/>
	<stop  offset="1" style="stop-color:#F7F7F7"/>
</linearGradient>
<path class="st90" d="M12.5,40.9h2.9c0.1,0,0.2,0.1,0.2,0.2v2.9c0,0.1-0.1,0.2-0.2,0.2h-2.9c-0.1,0-0.2-0.1-0.2-0.2v-2.9
	C12.3,41,12.4,40.9,12.5,40.9z"/>
<linearGradient id="SVGID_87_" gradientUnits="userSpaceOnUse" x1="8.29" y1="7.14" x2="11.6" y2="7.14" gradientTransform="matrix(1 0 0 -1 0 49.73)">
	<stop  offset="0" style="stop-color:#CCCCCC"/>
	<stop  offset="1" style="stop-color:#F7F7F7"/>
</linearGradient>
<path class="st91" d="M8.5,40.9h2.9c0.1,0,0.2,0.1,0.2,0.2v2.9c0,0.1-0.1,0.2-0.2,0.2H8.5c-0.1,0-0.2-0.1-0.2-0.2v-2.9
	C8.3,41,8.4,40.9,8.5,40.9z"/>
<linearGradient id="SVGID_88_" gradientUnits="userSpaceOnUse" x1="4.28" y1="7.14" x2="7.59" y2="7.14" gradientTransform="matrix(1 0 0 -1 0 49.73)">
	<stop  offset="0" style="stop-color:#CCCCCC"/>
	<stop  offset="1" style="stop-color:#F7F7F7"/>
</linearGradient>
<path class="st92" d="M4.5,40.9h2.9c0.1,0,0.2,0.1,0.2,0.2v2.9c0,0.1-0.1,0.2-0.2,0.2H4.5c-0.1,0-0.2-0.1-0.2-0.2v-2.9
	C4.3,41,4.4,40.9,4.5,40.9z"/>
<linearGradient id="SVGID_89_" gradientUnits="userSpaceOnUse" x1="58.15" y1="5.25" x2="58.15" y2="9.03" gradientTransform="matrix(1 0 0 -1 0 49.73)">
	<stop  offset="0" style="stop-color:#1A1A1A"/>
	<stop  offset="1" style="stop-color:#595959"/>
</linearGradient>
<path class="st93" d="M56.7,40.7h2.9c0.2,0,0.4,0.2,0.4,0.4v2.9c0,0.2-0.2,0.4-0.4,0.4h-2.9c-0.2,0-0.4-0.2-0.4-0.4v-2.9
	C56.3,40.9,56.5,40.7,56.7,40.7z"/>
<linearGradient id="SVGID_90_" gradientUnits="userSpaceOnUse" x1="54.14" y1="5.25" x2="54.14" y2="9.03" gradientTransform="matrix(1 0 0 -1 0 49.73)">
	<stop  offset="0" style="stop-color:#1A1A1A"/>
	<stop  offset="1" style="stop-color:#595959"/>
</linearGradient>
<path class="st94" d="M52.7,40.7h2.9c0.2,0,0.4,0.2,0.4,0.4v2.9c0,0.2-0.2,0.4-0.4,0.4h-2.9c-0.2,0-0.4-0.2-0.4-0.4v-2.9
	C52.2,40.9,52.4,40.7,52.7,40.7z"/>
<linearGradient id="SVGID_91_" gradientUnits="userSpaceOnUse" x1="50.13" y1="5.25" x2="50.13" y2="9.03" gradientTransform="matrix(1 0 0 -1 0 49.73)">
	<stop  offset="0" style="stop-color:#1A1A1A"/>
	<stop  offset="1" style="stop-color:#595959"/>
</linearGradient>
<path class="st95" d="M48.7,40.7h2.9c0.2,0,0.4,0.2,0.4,0.4v2.9c0,0.2-0.2,0.4-0.4,0.4h-2.9c-0.2,0-0.4-0.2-0.4-0.4v-2.9
	C48.2,40.9,48.4,40.7,48.7,40.7z"/>
<linearGradient id="SVGID_92_" gradientUnits="userSpaceOnUse" x1="46.12" y1="5.25" x2="46.12" y2="9.03" gradientTransform="matrix(1 0 0 -1 0 49.73)">
	<stop  offset="0" style="stop-color:#1A1A1A"/>
	<stop  offset="1" style="stop-color:#595959"/>
</linearGradient>
<path class="st96" d="M44.7,40.7h2.9c0.2,0,0.4,0.2,0.4,0.4v2.9c0,0.2-0.2,0.4-0.4,0.4h-2.9c-0.2,0-0.4-0.2-0.4-0.4v-2.9
	C44.2,40.9,44.4,40.7,44.7,40.7z"/>
<linearGradient id="SVGID_93_" gradientUnits="userSpaceOnUse" x1="56.49" y1="7.14" x2="59.8" y2="7.14" gradientTransform="matrix(1 0 0 -1 0 49.73)">
	<stop  offset="0" style="stop-color:#CCCCCC"/>
	<stop  offset="1" style="stop-color:#F7F7F7"/>
</linearGradient>
<path class="st97" d="M56.7,40.9h2.9c0.1,0,0.2,0.1,0.2,0.2v2.9c0,0.1-0.1,0.2-0.2,0.2h-2.9c-0.1,0-0.2-0.1-0.2-0.2v-2.9
	C56.5,41,56.6,40.9,56.7,40.9z"/>
<linearGradient id="SVGID_94_" gradientUnits="userSpaceOnUse" x1="52.48" y1="7.14" x2="55.79" y2="7.14" gradientTransform="matrix(1 0 0 -1 0 49.73)">
	<stop  offset="0" style="stop-color:#CCCCCC"/>
	<stop  offset="1" style="stop-color:#F7F7F7"/>
</linearGradient>
<path class="st98" d="M52.7,40.9h2.9c0.1,0,0.2,0.1,0.2,0.2v2.9c0,0.1-0.1,0.2-0.2,0.2h-2.9c-0.1,0-0.2-0.1-0.2-0.2v-2.9
	C52.5,41,52.6,40.9,52.7,40.9z"/>
<linearGradient id="SVGID_95_" gradientUnits="userSpaceOnUse" x1="48.47" y1="7.14" x2="51.78" y2="7.14" gradientTransform="matrix(1 0 0 -1 0 49.73)">
	<stop  offset="0" style="stop-color:#CCCCCC"/>
	<stop  offset="1" style="stop-color:#F7F7F7"/>
</linearGradient>
<path class="st99" d="M48.7,40.9h2.9c0.1,0,0.2,0.1,0.2,0.2v2.9c0,0.1-0.1,0.2-0.2,0.2h-2.9c-0.1,0-0.2-0.1-0.2-0.2v-2.9
	C48.5,41,48.6,40.9,48.7,40.9z"/>
<linearGradient id="SVGID_96_" gradientUnits="userSpaceOnUse" x1="44.46" y1="7.14" x2="47.77" y2="7.14" gradientTransform="matrix(1 0 0 -1 0 49.73)">
	<stop  offset="0" style="stop-color:#CCCCCC"/>
	<stop  offset="1" style="stop-color:#F7F7F7"/>
</linearGradient>
<path class="st100" d="M44.6,40.9h2.9c0.1,0,0.2,0.1,0.2,0.2v2.9c0,0.1-0.1,0.2-0.2,0.2h-2.9c-0.1,0-0.2-0.1-0.2-0.2v-2.9
	C44.5,41,44.5,40.9,44.6,40.9z"/>
<linearGradient id="SVGID_97_" gradientUnits="userSpaceOnUse" x1="32.05" y1="5.25" x2="32.05" y2="9.07" gradientTransform="matrix(1 0 0 -1 0 49.73)">
	<stop  offset="0" style="stop-color:#1A1A1A"/>
	<stop  offset="1" style="stop-color:#595959"/>
</linearGradient>
<path class="st101" d="M20.3,44.2v-3.3c0-0.1,0.1-0.3,0.3-0.3h22.9c0.1,0,0.3,0.1,0.3,0.3v3.3c0,0.1-0.1,0.3-0.3,0.3H20.6
	C20.5,44.5,20.3,44.4,20.3,44.2z"/>
<linearGradient id="SVGID_98_" gradientUnits="userSpaceOnUse" x1="32.04" y1="5.48" x2="32.04" y2="8.83" gradientTransform="matrix(1 0 0 -1 0 49.73)">
	<stop  offset="0" style="stop-color:#CCCCCC"/>
	<stop  offset="1" style="stop-color:#F7F7F7"/>
</linearGradient>
<path class="st102" d="M20.7,40.9h22.6c0.1,0,0.2,0.1,0.2,0.2v3c0,0.1-0.1,0.2-0.2,0.2H20.7c-0.1,0-0.2-0.1-0.2-0.2v-3
	C20.6,41,20.6,40.9,20.7,40.9z"/>
<path class="st2" d="M18.5,40.9h-2c-0.1,0-0.2,0.1-0.2,0.2v1c0-0.1,0.1-0.2,0.2-0.2h2.9c0.1,0,0.2,0.1,0.2,0.2v-1
	c0-0.1-0.1-0.2-0.2-0.2H18.5L18.5,40.9z"/>
<path class="st2" d="M14.5,40.9h-2c-0.1,0-0.2,0.1-0.2,0.2v1c0-0.1,0.1-0.2,0.2-0.2h2.9c0.1,0,0.2,0.1,0.2,0.2v-1
	c0-0.1-0.1-0.2-0.2-0.2H14.5L14.5,40.9z"/>
<path class="st2" d="M8.3,41.1v1c0-0.1,0.1-0.2,0.2-0.2h2.9c0.1,0,0.2,0.1,0.2,0.2v-1c0-0.1-0.1-0.2-0.2-0.2H8.5
	C8.4,40.9,8.3,41,8.3,41.1z"/>
<path class="st2" d="M4.3,41.1v1c0-0.1,0.1-0.2,0.2-0.2h2.9c0.1,0,0.2,0.1,0.2,0.2v-1c0-0.1-0.1-0.2-0.2-0.2H4.5
	C4.4,40.9,4.3,41,4.3,41.1z"/>
<path class="st2" d="M59.6,41h-2.9c-0.1,0-0.2,0.1-0.2,0.2v1c0-0.1,0.1-0.2,0.2-0.2h2.9c0.1,0,0.2,0.1,0.2,0.2v-1
	C59.8,41,59.7,41,59.6,41z"/>
<path class="st2" d="M52.5,41.1v1c0-0.1,0.1-0.2,0.2-0.2h2.9c0.1,0,0.2,0.1,0.2,0.2v-1c0-0.1-0.1-0.2-0.2-0.2h-2.9
	C52.6,40.9,52.5,41,52.5,41.1z"/>
<path class="st2" d="M50.9,40.9h-2.2c-0.1,0-0.2,0.1-0.2,0.2v1c0-0.1,0.1-0.2,0.2-0.2h2.9c0.1,0,0.2,0.1,0.2,0.2v-1
	c0-0.1-0.1-0.2-0.2-0.2H50.9L50.9,40.9z"/>
<path class="st2" d="M46.6,40.9h-2c-0.1,0-0.2,0.1-0.2,0.2v1c0-0.1,0.1-0.2,0.2-0.2h2.9c0.1,0,0.2,0.1,0.2,0.2v-1
	c0-0.1-0.1-0.2-0.2-0.2H46.6L46.6,40.9z"/>
<path class="st2" d="M42.5,40.9h-0.9c0,0-0.1,0-0.1,0h-2.9c0,0-0.1,0-0.1,0h-0.9c0,0-0.1,0-0.1,0h-2.9c0,0-0.1,0-0.1,0h-0.9
	c0,0-0.1,0-0.1,0h-2.9c0,0-0.1,0-0.1,0h-0.9c0,0-0.1,0-0.1,0h-2.9c0,0-0.1,0-0.1,0h-0.9c0,0-0.1,0-0.1,0h-2.9c0,0-0.1,0-0.1,0h-0.9
	c0,0-0.1,0-0.1,0h-0.8c0,0-0.1,0.1-0.1,0.1v1c0-0.1,0.1-0.2,0.2-0.2h22.6c0.1,0,0.2,0.1,0.2,0.2v-1c0,0,0-0.1-0.1-0.1H42.5
	C42.6,40.9,42.5,40.9,42.5,40.9z"/>
<linearGradient id="SVGID_99_" gradientUnits="userSpaceOnUse" x1="55.26" y1="9.79" x2="55.26" y2="13.13" gradientTransform="matrix(1 0 0 -1 0 49.73)">
	<stop  offset="0" style="stop-color:#CCCCCC"/>
	<stop  offset="1" style="stop-color:#F7F7F7"/>
</linearGradient>
<path class="st103" d="M50.9,36.6h8.7c0.1,0,0.2,0.1,0.2,0.2v3c0,0.1-0.1,0.2-0.2,0.2h-8.7c-0.1,0-0.2-0.1-0.2-0.2v-3
	C50.7,36.7,50.8,36.6,50.9,36.6z"/>
<linearGradient id="SVGID_100_" gradientUnits="userSpaceOnUse" x1="48.08" y1="9.55" x2="48.08" y2="13.33" gradientTransform="matrix(1 0 0 -1 0 49.73)">
	<stop  offset="0" style="stop-color:#1A1A1A"/>
	<stop  offset="1" style="stop-color:#595959"/>
</linearGradient>
<path class="st104" d="M46.6,36.4h2.9c0.2,0,0.4,0.2,0.4,0.4v2.9c0,0.2-0.2,0.4-0.4,0.4h-2.9c-0.2,0-0.4-0.2-0.4-0.4v-2.9
	C46.2,36.6,46.4,36.4,46.6,36.4z"/>
<linearGradient id="SVGID_101_" gradientUnits="userSpaceOnUse" x1="44.07" y1="9.55" x2="44.07" y2="13.33" gradientTransform="matrix(1 0 0 -1 0 49.73)">
	<stop  offset="0" style="stop-color:#1A1A1A"/>
	<stop  offset="1" style="stop-color:#595959"/>
</linearGradient>
<path class="st105" d="M42.6,36.4h2.9c0.2,0,0.4,0.2,0.4,0.4v2.9c0,0.2-0.2,0.4-0.4,0.4h-2.9c-0.2,0-0.4-0.2-0.4-0.4v-2.9
	C42.2,36.6,42.4,36.4,42.6,36.4z"/>
<linearGradient id="SVGID_102_" gradientUnits="userSpaceOnUse" x1="40.06" y1="9.55" x2="40.06" y2="13.33" gradientTransform="matrix(1 0 0 -1 0 49.73)">
	<stop  offset="0" style="stop-color:#1A1A1A"/>
	<stop  offset="1" style="stop-color:#595959"/>
</linearGradient>
<path class="st106" d="M38.6,36.4h2.9c0.2,0,0.4,0.2,0.4,0.4v2.9c0,0.2-0.2,0.4-0.4,0.4h-2.9c-0.2,0-0.4-0.2-0.4-0.4v-2.9
	C38.2,36.6,38.4,36.4,38.6,36.4z"/>
<linearGradient id="SVGID_103_" gradientUnits="userSpaceOnUse" x1="36.05" y1="9.55" x2="36.05" y2="13.33" gradientTransform="matrix(1 0 0 -1 0 49.73)">
	<stop  offset="0" style="stop-color:#1A1A1A"/>
	<stop  offset="1" style="stop-color:#595959"/>
</linearGradient>
<path class="st107" d="M34.6,36.4h2.9c0.2,0,0.4,0.2,0.4,0.4v2.9c0,0.2-0.2,0.4-0.4,0.4h-2.9c-0.2,0-0.4-0.2-0.4-0.4v-2.9
	C34.2,36.6,34.4,36.4,34.6,36.4z"/>
<linearGradient id="SVGID_104_" gradientUnits="userSpaceOnUse" x1="32.04" y1="9.55" x2="32.04" y2="13.33" gradientTransform="matrix(1 0 0 -1 0 49.73)">
	<stop  offset="0" style="stop-color:#1A1A1A"/>
	<stop  offset="1" style="stop-color:#595959"/>
</linearGradient>
<path class="st108" d="M30.6,36.4h2.9c0.2,0,0.4,0.2,0.4,0.4v2.9c0,0.2-0.2,0.4-0.4,0.4h-2.9c-0.2,0-0.4-0.2-0.4-0.4v-2.9
	C30.1,36.6,30.3,36.4,30.6,36.4z"/>
<linearGradient id="SVGID_105_" gradientUnits="userSpaceOnUse" x1="28.03" y1="9.55" x2="28.03" y2="13.33" gradientTransform="matrix(1 0 0 -1 0 49.73)">
	<stop  offset="0" style="stop-color:#1A1A1A"/>
	<stop  offset="1" style="stop-color:#595959"/>
</linearGradient>
<path class="st109" d="M26.6,36.4h2.9c0.2,0,0.4,0.2,0.4,0.4v2.9c0,0.2-0.2,0.4-0.4,0.4h-2.9c-0.2,0-0.4-0.2-0.4-0.4v-2.9
	C26.1,36.6,26.3,36.4,26.6,36.4z"/>
<linearGradient id="SVGID_106_" gradientUnits="userSpaceOnUse" x1="24.02" y1="9.55" x2="24.02" y2="13.33" gradientTransform="matrix(1 0 0 -1 0 49.73)">
	<stop  offset="0" style="stop-color:#1A1A1A"/>
	<stop  offset="1" style="stop-color:#595959"/>
</linearGradient>
<path class="st110" d="M22.6,36.4h2.9c0.2,0,0.4,0.2,0.4,0.4v2.9c0,0.2-0.2,0.4-0.4,0.4h-2.9c-0.2,0-0.4-0.2-0.4-0.4v-2.9
	C22.1,36.6,22.3,36.4,22.6,36.4z"/>
<linearGradient id="SVGID_107_" gradientUnits="userSpaceOnUse" x1="20.01" y1="9.55" x2="20.01" y2="13.33" gradientTransform="matrix(1 0 0 -1 0 49.73)">
	<stop  offset="0" style="stop-color:#1A1A1A"/>
	<stop  offset="1" style="stop-color:#595959"/>
</linearGradient>
<path class="st111" d="M18.6,36.4h2.9c0.2,0,0.4,0.2,0.4,0.4v2.9c0,0.2-0.2,0.4-0.4,0.4h-2.9c-0.2,0-0.4-0.2-0.4-0.4v-2.9
	C18.1,36.6,18.3,36.4,18.6,36.4z"/>
<linearGradient id="SVGID_108_" gradientUnits="userSpaceOnUse" x1="16" y1="9.55" x2="16" y2="13.33" gradientTransform="matrix(1 0 0 -1 0 49.73)">
	<stop  offset="0" style="stop-color:#1A1A1A"/>
	<stop  offset="1" style="stop-color:#595959"/>
</linearGradient>
<path class="st112" d="M14.5,36.4h2.9c0.2,0,0.4,0.2,0.4,0.4v2.9c0,0.2-0.2,0.4-0.4,0.4h-2.9c-0.2,0-0.4-0.2-0.4-0.4v-2.9
	C14.1,36.6,14.3,36.4,14.5,36.4z"/>
<linearGradient id="SVGID_109_" gradientUnits="userSpaceOnUse" x1="46.43" y1="11.44" x2="49.73" y2="11.44" gradientTransform="matrix(1 0 0 -1 0 49.73)">
	<stop  offset="0" style="stop-color:#CCCCCC"/>
	<stop  offset="1" style="stop-color:#F7F7F7"/>
</linearGradient>
<path class="st113" d="M46.6,36.6h2.9c0.1,0,0.2,0.1,0.2,0.2v2.9c0,0.1-0.1,0.2-0.2,0.2h-2.9c-0.1,0-0.2-0.1-0.2-0.2v-2.9
	C46.4,36.7,46.5,36.6,46.6,36.6z"/>
<linearGradient id="SVGID_110_" gradientUnits="userSpaceOnUse" x1="42.42" y1="11.44" x2="45.72" y2="11.44" gradientTransform="matrix(1 0 0 -1 0 49.73)">
	<stop  offset="0" style="stop-color:#CCCCCC"/>
	<stop  offset="1" style="stop-color:#F7F7F7"/>
</linearGradient>
<path class="st114" d="M42.6,36.6h2.9c0.1,0,0.2,0.1,0.2,0.2v2.9c0,0.1-0.1,0.2-0.2,0.2h-2.9c-0.1,0-0.2-0.1-0.2-0.2v-2.9
	C42.4,36.7,42.5,36.6,42.6,36.6z"/>
<linearGradient id="SVGID_111_" gradientUnits="userSpaceOnUse" x1="38.41" y1="11.44" x2="41.71" y2="11.44" gradientTransform="matrix(1 0 0 -1 0 49.73)">
	<stop  offset="0" style="stop-color:#CCCCCC"/>
	<stop  offset="1" style="stop-color:#F7F7F7"/>
</linearGradient>
<path class="st115" d="M38.6,36.6h2.9c0.1,0,0.2,0.1,0.2,0.2v2.9c0,0.1-0.1,0.2-0.2,0.2h-2.9c-0.1,0-0.2-0.1-0.2-0.2v-2.9
	C38.4,36.7,38.5,36.6,38.6,36.6z"/>
<linearGradient id="SVGID_112_" gradientUnits="userSpaceOnUse" x1="34.4" y1="11.44" x2="37.7" y2="11.44" gradientTransform="matrix(1 0 0 -1 0 49.73)">
	<stop  offset="0" style="stop-color:#CCCCCC"/>
	<stop  offset="1" style="stop-color:#F7F7F7"/>
</linearGradient>
<path class="st116" d="M34.6,36.6h2.9c0.1,0,0.2,0.1,0.2,0.2v2.9c0,0.1-0.1,0.2-0.2,0.2h-2.9c-0.1,0-0.2-0.1-0.2-0.2v-2.9
	C34.4,36.7,34.5,36.6,34.6,36.6z"/>
<linearGradient id="SVGID_113_" gradientUnits="userSpaceOnUse" x1="30.39" y1="11.44" x2="33.69" y2="11.44" gradientTransform="matrix(1 0 0 -1 0 49.73)">
	<stop  offset="0" style="stop-color:#CCCCCC"/>
	<stop  offset="1" style="stop-color:#F7F7F7"/>
</linearGradient>
<path class="st117" d="M30.6,36.6h2.9c0.1,0,0.2,0.1,0.2,0.2v2.9c0,0.1-0.1,0.2-0.2,0.2h-2.9c-0.1,0-0.2-0.1-0.2-0.2v-2.9
	C30.4,36.7,30.5,36.6,30.6,36.6z"/>
<linearGradient id="SVGID_114_" gradientUnits="userSpaceOnUse" x1="26.38" y1="11.44" x2="29.68" y2="11.44" gradientTransform="matrix(1 0 0 -1 0 49.73)">
	<stop  offset="0" style="stop-color:#CCCCCC"/>
	<stop  offset="1" style="stop-color:#F7F7F7"/>
</linearGradient>
<path class="st118" d="M26.6,36.6h2.9c0.1,0,0.2,0.1,0.2,0.2v2.9c0,0.1-0.1,0.2-0.2,0.2h-2.9c-0.1,0-0.2-0.1-0.2-0.2v-2.9
	C26.4,36.7,26.5,36.6,26.6,36.6z"/>
<linearGradient id="SVGID_115_" gradientUnits="userSpaceOnUse" x1="22.37" y1="11.44" x2="25.67" y2="11.44" gradientTransform="matrix(1 0 0 -1 0 49.73)">
	<stop  offset="0" style="stop-color:#CCCCCC"/>
	<stop  offset="1" style="stop-color:#F7F7F7"/>
</linearGradient>
<path class="st119" d="M22.6,36.6h2.9c0.1,0,0.2,0.1,0.2,0.2v2.9c0,0.1-0.1,0.2-0.2,0.2h-2.9c-0.1,0-0.2-0.1-0.2-0.2v-2.9
	C22.4,36.7,22.5,36.6,22.6,36.6z"/>
<linearGradient id="SVGID_116_" gradientUnits="userSpaceOnUse" x1="18.36" y1="11.44" x2="21.66" y2="11.44" gradientTransform="matrix(1 0 0 -1 0 49.73)">
	<stop  offset="0" style="stop-color:#CCCCCC"/>
	<stop  offset="1" style="stop-color:#F7F7F7"/>
</linearGradient>
<path class="st120" d="M18.6,36.6h2.9c0.1,0,0.2,0.1,0.2,0.2v2.9c0,0.1-0.1,0.2-0.2,0.2h-2.9c-0.1,0-0.2-0.1-0.2-0.2v-2.9
	C18.4,36.7,18.4,36.6,18.6,36.6z"/>
<linearGradient id="SVGID_117_" gradientUnits="userSpaceOnUse" x1="14.35" y1="11.44" x2="17.65" y2="11.44" gradientTransform="matrix(1 0 0 -1 0 49.73)">
	<stop  offset="0" style="stop-color:#CCCCCC"/>
	<stop  offset="1" style="stop-color:#F7F7F7"/>
</linearGradient>
<path class="st121" d="M14.5,36.6h2.9c0.1,0,0.2,0.1,0.2,0.2v2.9c0,0.1-0.1,0.2-0.2,0.2h-2.9c-0.1,0-0.2-0.1-0.2-0.2v-2.9
	C14.4,36.7,14.4,36.6,14.5,36.6z"/>
<path class="st2" d="M4.4,37.6h8.8c0.1,0,0.2,0.1,0.2,0.2v-1c0,0,0-0.1-0.1-0.1h-0.8c0,0-0.1,0-0.1,0h-1c0,0-0.1,0-0.1,0h-7
	c0,0-0.1,0.1-0.1,0.1v1C4.3,37.7,4.3,37.6,4.4,37.6C4.4,37.6,4.4,37.6,4.4,37.6z"/>
<path class="st2" d="M50.8,36.6c0,0-0.1,0.1-0.1,0.1v1c0-0.1,0.1-0.2,0.2-0.2l0,0h8.7c0.1,0,0.2,0.1,0.2,0.2l0,0v-1
	c0-0.1-0.1-0.2-0.2-0.2c0,0,0,0-0.1,0h-6.7c0,0-0.1,0-0.1,0h-1.1c0,0-0.1,0-0.1,0L50.8,36.6z"/>
<path class="st2" d="M46.6,36.6c-0.1,0-0.2,0.1-0.2,0.2v1c0-0.1,0.1-0.2,0.2-0.2h2.9c0.1,0,0.2,0.1,0.2,0.2v-1
	c0-0.1-0.1-0.2-0.2-0.2H46.6z"/>
<path class="st2" d="M42.6,36.6c-0.1,0-0.2,0.1-0.2,0.2v1c0-0.1,0.1-0.2,0.2-0.2h2.9c0.1,0,0.2,0.1,0.2,0.2v-1
	c0-0.1-0.1-0.2-0.2-0.2H42.6z"/>
<path class="st2" d="M38.6,36.6c-0.1,0-0.2,0.1-0.2,0.2v1c0-0.1,0.1-0.2,0.2-0.2h2.9c0.1,0,0.2,0.1,0.2,0.2v-1
	c0-0.1-0.1-0.2-0.2-0.2H38.6z"/>
<path class="st2" d="M34.6,36.6c-0.1,0-0.2,0.1-0.2,0.2v1c0-0.1,0.1-0.2,0.2-0.2h2.9c0.1,0,0.2,0.1,0.2,0.2v-1
	c0-0.1-0.1-0.2-0.2-0.2H34.6z"/>
<path class="st2" d="M30.6,36.6c-0.1,0-0.2,0.1-0.2,0.2v1c0-0.1,0.1-0.2,0.2-0.2h2.9c0.1,0,0.2,0.1,0.2,0.2v-1
	c0-0.1-0.1-0.2-0.2-0.2H30.6z"/>
<path class="st2" d="M26.6,36.6c-0.1,0-0.2,0.1-0.2,0.2v1c0-0.1,0.1-0.2,0.2-0.2h2.9c0.1,0,0.2,0.1,0.2,0.2v-1
	c0-0.1-0.1-0.2-0.2-0.2H26.6z"/>
<path class="st2" d="M22.6,36.6c-0.1,0-0.2,0.1-0.2,0.2v1c0-0.1,0.1-0.2,0.2-0.2h2.9c0.1,0,0.2,0.1,0.2,0.2v-1
	c0-0.1-0.1-0.2-0.2-0.2H22.6z"/>
<path class="st2" d="M18.5,36.6c-0.1,0-0.2,0.1-0.2,0.2v1c0-0.1,0.1-0.2,0.2-0.2h2.9c0.1,0,0.2,0.1,0.2,0.2v-1
	c0-0.1-0.1-0.2-0.2-0.2H18.5z"/>
<path class="st2" d="M14.5,36.6c-0.1,0-0.2,0.1-0.2,0.2v1c0-0.1,0.1-0.2,0.2-0.2h2.9c0.1,0,0.2,0.1,0.2,0.2v-1
	c0-0.1-0.1-0.2-0.2-0.2H14.5z"/>
<linearGradient id="SVGID_118_" gradientUnits="userSpaceOnUse" x1="6.905" y1="18.14" x2="6.905" y2="21.96" gradientTransform="matrix(1 0 0 -1 0 49.73)">
	<stop  offset="0" style="stop-color:#1A1A1A"/>
	<stop  offset="1" style="stop-color:#595959"/>
</linearGradient>
<path class="st122" d="M4,31.3V28c0-0.1,0.1-0.3,0.3-0.3h5.2c0.1,0,0.3,0.1,0.3,0.3v3.3c0,0.1-0.1,0.3-0.3,0.3H4.3
	C4.2,31.6,4,31.5,4,31.3z"/>
<linearGradient id="SVGID_119_" gradientUnits="userSpaceOnUse" x1="6.91" y1="18.38" x2="6.91" y2="21.72" gradientTransform="matrix(1 0 0 -1 0 49.73)">
	<stop  offset="0" style="stop-color:#CCCCCC"/>
	<stop  offset="1" style="stop-color:#F7F7F7"/>
</linearGradient>
<path class="st123" d="M4.4,28h5c0.1,0,0.1,0.1,0.1,0.1v3.1c0,0.1-0.1,0.1-0.1,0.1h-5c-0.1,0-0.2-0.1-0.2-0.1v-3.1
	C4.3,28.1,4.3,28,4.4,28z"/>
<linearGradient id="SVGID_120_" gradientUnits="userSpaceOnUse" x1="52.09" y1="18.16" x2="52.09" y2="21.94" gradientTransform="matrix(1 0 0 -1 0 49.73)">
	<stop  offset="0" style="stop-color:#1A1A1A"/>
	<stop  offset="1" style="stop-color:#595959"/>
</linearGradient>
<path class="st124" d="M50.6,27.8h2.9c0.2,0,0.4,0.2,0.4,0.4v2.9c0,0.2-0.2,0.4-0.4,0.4h-2.9c-0.2,0-0.4-0.2-0.4-0.4v-2.9
	C50.2,28,50.4,27.8,50.6,27.8z"/>
<linearGradient id="SVGID_121_" gradientUnits="userSpaceOnUse" x1="48.08" y1="18.16" x2="48.08" y2="21.94" gradientTransform="matrix(1 0 0 -1 0 49.73)">
	<stop  offset="0" style="stop-color:#1A1A1A"/>
	<stop  offset="1" style="stop-color:#595959"/>
</linearGradient>
<path class="st125" d="M46.6,27.8h2.9c0.2,0,0.4,0.2,0.4,0.4v2.9c0,0.2-0.2,0.4-0.4,0.4h-2.9c-0.2,0-0.4-0.2-0.4-0.4v-2.9
	C46.2,28,46.4,27.8,46.6,27.8z"/>
<linearGradient id="SVGID_122_" gradientUnits="userSpaceOnUse" x1="44.07" y1="18.16" x2="44.07" y2="21.94" gradientTransform="matrix(1 0 0 -1 0 49.73)">
	<stop  offset="0" style="stop-color:#1A1A1A"/>
	<stop  offset="1" style="stop-color:#595959"/>
</linearGradient>
<path class="st126" d="M42.6,27.8h2.9c0.2,0,0.4,0.2,0.4,0.4v2.9c0,0.2-0.2,0.4-0.4,0.4h-2.9c-0.2,0-0.4-0.2-0.4-0.4v-2.9
	C42.2,28,42.4,27.8,42.6,27.8z"/>
<linearGradient id="SVGID_123_" gradientUnits="userSpaceOnUse" x1="40.06" y1="18.16" x2="40.06" y2="21.94" gradientTransform="matrix(1 0 0 -1 0 49.73)">
	<stop  offset="0" style="stop-color:#1A1A1A"/>
	<stop  offset="1" style="stop-color:#595959"/>
</linearGradient>
<path class="st127" d="M38.6,27.8h2.9c0.2,0,0.4,0.2,0.4,0.4v2.9c0,0.2-0.2,0.4-0.4,0.4h-2.9c-0.2,0-0.4-0.2-0.4-0.4v-2.9
	C38.2,28,38.4,27.8,38.6,27.8z"/>
<linearGradient id="SVGID_124_" gradientUnits="userSpaceOnUse" x1="36.05" y1="18.16" x2="36.05" y2="21.94" gradientTransform="matrix(1 0 0 -1 0 49.73)">
	<stop  offset="0" style="stop-color:#1A1A1A"/>
	<stop  offset="1" style="stop-color:#595959"/>
</linearGradient>
<path class="st128" d="M34.6,27.8h2.9c0.2,0,0.4,0.2,0.4,0.4v2.9c0,0.2-0.2,0.4-0.4,0.4h-2.9c-0.2,0-0.4-0.2-0.4-0.4v-2.9
	C34.2,28,34.4,27.8,34.6,27.8z"/>
<linearGradient id="SVGID_125_" gradientUnits="userSpaceOnUse" x1="32.04" y1="18.16" x2="32.04" y2="21.94" gradientTransform="matrix(1 0 0 -1 0 49.73)">
	<stop  offset="0" style="stop-color:#1A1A1A"/>
	<stop  offset="1" style="stop-color:#595959"/>
</linearGradient>
<path class="st129" d="M30.6,27.8h2.9c0.2,0,0.4,0.2,0.4,0.4v2.9c0,0.2-0.2,0.4-0.4,0.4h-2.9c-0.2,0-0.4-0.2-0.4-0.4v-2.9
	C30.1,28,30.3,27.8,30.6,27.8z"/>
<linearGradient id="SVGID_126_" gradientUnits="userSpaceOnUse" x1="28.03" y1="18.16" x2="28.03" y2="21.94" gradientTransform="matrix(1 0 0 -1 0 49.73)">
	<stop  offset="0" style="stop-color:#1A1A1A"/>
	<stop  offset="1" style="stop-color:#595959"/>
</linearGradient>
<path class="st130" d="M26.6,27.8h2.9c0.2,0,0.4,0.2,0.4,0.4v2.9c0,0.2-0.2,0.4-0.4,0.4h-2.9c-0.2,0-0.4-0.2-0.4-0.4v-2.9
	C26.1,28,26.3,27.8,26.6,27.8z"/>
<linearGradient id="SVGID_127_" gradientUnits="userSpaceOnUse" x1="24.02" y1="18.16" x2="24.02" y2="21.94" gradientTransform="matrix(1 0 0 -1 0 49.73)">
	<stop  offset="0" style="stop-color:#1A1A1A"/>
	<stop  offset="1" style="stop-color:#595959"/>
</linearGradient>
<path class="st131" d="M22.6,27.8h2.9c0.2,0,0.4,0.2,0.4,0.4v2.9c0,0.2-0.2,0.4-0.4,0.4h-2.9c-0.2,0-0.4-0.2-0.4-0.4v-2.9
	C22.1,28,22.3,27.8,22.6,27.8z"/>
<linearGradient id="SVGID_128_" gradientUnits="userSpaceOnUse" x1="20.01" y1="18.16" x2="20.01" y2="21.94" gradientTransform="matrix(1 0 0 -1 0 49.73)">
	<stop  offset="0" style="stop-color:#1A1A1A"/>
	<stop  offset="1" style="stop-color:#595959"/>
</linearGradient>
<path class="st132" d="M18.6,27.8h2.9c0.2,0,0.4,0.2,0.4,0.4v2.9c0,0.2-0.2,0.4-0.4,0.4h-2.9c-0.2,0-0.4-0.2-0.4-0.4v-2.9
	C18.1,28,18.3,27.8,18.6,27.8z"/>
<linearGradient id="SVGID_129_" gradientUnits="userSpaceOnUse" x1="16" y1="18.16" x2="16" y2="21.94" gradientTransform="matrix(1 0 0 -1 0 49.73)">
	<stop  offset="0" style="stop-color:#1A1A1A"/>
	<stop  offset="1" style="stop-color:#595959"/>
</linearGradient>
<path class="st133" d="M14.5,27.8h2.9c0.2,0,0.4,0.2,0.4,0.4v2.9c0,0.2-0.2,0.4-0.4,0.4h-2.9c-0.2,0-0.4-0.2-0.4-0.4v-2.9
	C14.1,28,14.3,27.8,14.5,27.8z"/>
<linearGradient id="SVGID_130_" gradientUnits="userSpaceOnUse" x1="11.99" y1="18.16" x2="11.99" y2="21.94" gradientTransform="matrix(1 0 0 -1 0 49.73)">
	<stop  offset="0" style="stop-color:#1A1A1A"/>
	<stop  offset="1" style="stop-color:#595959"/>
</linearGradient>
<path class="st134" d="M10.5,27.8h2.9c0.2,0,0.4,0.2,0.4,0.4v2.9c0,0.2-0.2,0.4-0.4,0.4h-2.9c-0.2,0-0.4-0.2-0.4-0.4v-2.9
	C10.1,28,10.3,27.8,10.5,27.8z"/>
<linearGradient id="SVGID_131_" gradientUnits="userSpaceOnUse" x1="50.44" y1="20.05" x2="53.74" y2="20.05" gradientTransform="matrix(1 0 0 -1 0 49.73)">
	<stop  offset="0" style="stop-color:#CCCCCC"/>
	<stop  offset="1" style="stop-color:#F7F7F7"/>
</linearGradient>
<path class="st135" d="M50.6,28h2.9c0.1,0,0.2,0.1,0.2,0.2v2.9c0,0.1-0.1,0.2-0.2,0.2h-2.9c-0.1,0-0.2-0.1-0.2-0.2v-2.9
	C50.4,28.1,50.5,28,50.6,28z"/>
<linearGradient id="SVGID_132_" gradientUnits="userSpaceOnUse" x1="46.43" y1="20.05" x2="49.73" y2="20.05" gradientTransform="matrix(1 0 0 -1 0 49.73)">
	<stop  offset="0" style="stop-color:#CCCCCC"/>
	<stop  offset="1" style="stop-color:#F7F7F7"/>
</linearGradient>
<path class="st136" d="M46.6,28h2.9c0.1,0,0.2,0.1,0.2,0.2v2.9c0,0.1-0.1,0.2-0.2,0.2h-2.9c-0.1,0-0.2-0.1-0.2-0.2v-2.9
	C46.4,28.1,46.5,28,46.6,28z"/>
<linearGradient id="SVGID_133_" gradientUnits="userSpaceOnUse" x1="42.42" y1="20.05" x2="45.72" y2="20.05" gradientTransform="matrix(1 0 0 -1 0 49.73)">
	<stop  offset="0" style="stop-color:#CCCCCC"/>
	<stop  offset="1" style="stop-color:#F7F7F7"/>
</linearGradient>
<path class="st137" d="M42.6,28h2.9c0.1,0,0.2,0.1,0.2,0.2v2.9c0,0.1-0.1,0.2-0.2,0.2h-2.9c-0.1,0-0.2-0.1-0.2-0.2v-2.9
	C42.4,28.1,42.5,28,42.6,28z"/>
<linearGradient id="SVGID_134_" gradientUnits="userSpaceOnUse" x1="38.41" y1="20.05" x2="41.71" y2="20.05" gradientTransform="matrix(1 0 0 -1 0 49.73)">
	<stop  offset="0" style="stop-color:#CCCCCC"/>
	<stop  offset="1" style="stop-color:#F7F7F7"/>
</linearGradient>
<path class="st138" d="M38.6,28h2.9c0.1,0,0.2,0.1,0.2,0.2v2.9c0,0.1-0.1,0.2-0.2,0.2h-2.9c-0.1,0-0.2-0.1-0.2-0.2v-2.9
	C38.4,28.1,38.5,28,38.6,28z"/>
<linearGradient id="SVGID_135_" gradientUnits="userSpaceOnUse" x1="34.4" y1="20.05" x2="37.7" y2="20.05" gradientTransform="matrix(1 0 0 -1 0 49.73)">
	<stop  offset="0" style="stop-color:#CCCCCC"/>
	<stop  offset="1" style="stop-color:#F7F7F7"/>
</linearGradient>
<path class="st139" d="M34.6,28h2.9c0.1,0,0.2,0.1,0.2,0.2v2.9c0,0.1-0.1,0.2-0.2,0.2h-2.9c-0.1,0-0.2-0.1-0.2-0.2v-2.9
	C34.4,28.1,34.5,28,34.6,28z"/>
<linearGradient id="SVGID_136_" gradientUnits="userSpaceOnUse" x1="30.39" y1="20.05" x2="33.69" y2="20.05" gradientTransform="matrix(1 0 0 -1 0 49.73)">
	<stop  offset="0" style="stop-color:#CCCCCC"/>
	<stop  offset="1" style="stop-color:#F7F7F7"/>
</linearGradient>
<path class="st140" d="M30.6,28h2.9c0.1,0,0.2,0.1,0.2,0.2v2.9c0,0.1-0.1,0.2-0.2,0.2h-2.9c-0.1,0-0.2-0.1-0.2-0.2v-2.9
	C30.4,28.1,30.5,28,30.6,28z"/>
<linearGradient id="SVGID_137_" gradientUnits="userSpaceOnUse" x1="26.38" y1="20.05" x2="29.68" y2="20.05" gradientTransform="matrix(1 0 0 -1 0 49.73)">
	<stop  offset="0" style="stop-color:#CCCCCC"/>
	<stop  offset="1" style="stop-color:#F7F7F7"/>
</linearGradient>
<path class="st141" d="M26.6,28h2.9c0.1,0,0.2,0.1,0.2,0.2v2.9c0,0.1-0.1,0.2-0.2,0.2h-2.9c-0.1,0-0.2-0.1-0.2-0.2v-2.9
	C26.4,28.1,26.5,28,26.6,28z"/>
<linearGradient id="SVGID_138_" gradientUnits="userSpaceOnUse" x1="22.37" y1="20.05" x2="25.67" y2="20.05" gradientTransform="matrix(1 0 0 -1 0 49.73)">
	<stop  offset="0" style="stop-color:#CCCCCC"/>
	<stop  offset="1" style="stop-color:#F7F7F7"/>
</linearGradient>
<path class="st142" d="M22.6,28h2.9c0.1,0,0.2,0.1,0.2,0.2v2.9c0,0.1-0.1,0.2-0.2,0.2h-2.9c-0.1,0-0.2-0.1-0.2-0.2v-2.9
	C22.4,28.1,22.5,28,22.6,28z"/>
<linearGradient id="SVGID_139_" gradientUnits="userSpaceOnUse" x1="18.36" y1="20.05" x2="21.66" y2="20.05" gradientTransform="matrix(1 0 0 -1 0 49.73)">
	<stop  offset="0" style="stop-color:#CCCCCC"/>
	<stop  offset="1" style="stop-color:#F7F7F7"/>
</linearGradient>
<path class="st143" d="M18.6,28h2.9c0.1,0,0.2,0.1,0.2,0.2v2.9c0,0.1-0.1,0.2-0.2,0.2h-2.9c-0.1,0-0.2-0.1-0.2-0.2v-2.9
	C18.4,28.1,18.4,28,18.6,28z"/>
<linearGradient id="SVGID_140_" gradientUnits="userSpaceOnUse" x1="14.35" y1="20.05" x2="17.65" y2="20.05" gradientTransform="matrix(1 0 0 -1 0 49.73)">
	<stop  offset="0" style="stop-color:#CCCCCC"/>
	<stop  offset="1" style="stop-color:#F7F7F7"/>
</linearGradient>
<path class="st144" d="M14.5,28h2.9c0.1,0,0.2,0.1,0.2,0.2v2.9c0,0.1-0.1,0.2-0.2,0.2h-2.9c-0.1,0-0.2-0.1-0.2-0.2v-2.9
	C14.4,28.1,14.4,28,14.5,28z"/>
<linearGradient id="SVGID_141_" gradientUnits="userSpaceOnUse" x1="10.34" y1="20.05" x2="13.64" y2="20.05" gradientTransform="matrix(1 0 0 -1 0 49.73)">
	<stop  offset="0" style="stop-color:#CCCCCC"/>
	<stop  offset="1" style="stop-color:#F7F7F7"/>
</linearGradient>
<path class="st145" d="M10.5,28h2.9c0.1,0,0.2,0.1,0.2,0.2v2.9c0,0.1-0.1,0.2-0.2,0.2h-2.9c-0.1,0-0.2-0.1-0.2-0.2v-2.9
	C10.3,28.1,10.4,28,10.5,28z"/>
<path class="st2" d="M4.4,29h4.9c0.1,0,0.1,0.1,0.1,0.1v-1c0-0.1,0-0.1-0.1-0.1h-1c0,0-0.1,0-0.1,0H7.5c0,0-0.1,0-0.1,0H4.5
	c0,0-0.1,0-0.1,0c-0.1,0-0.2,0.1-0.2,0.1v1C4.3,29.1,4.3,29,4.4,29C4.4,29,4.4,29,4.4,29z"/>
<path class="st2" d="M50.6,28c-0.1,0-0.2,0.1-0.2,0.2v1c0-0.1,0.1-0.2,0.2-0.2h2.9c0.1,0,0.2,0.1,0.2,0.2v-1c0-0.1-0.1-0.2-0.2-0.2
	h-1l0,0h-1l0,0H50.6z"/>
<path class="st2" d="M46.6,28c-0.1,0-0.2,0.1-0.2,0.2v1c0-0.1,0.1-0.2,0.2-0.2h2.9c0.1,0,0.2,0.1,0.2,0.2v-1c0-0.1-0.1-0.2-0.2-0.2
	h-1l0,0h-1l0,0H46.6z"/>
<path class="st2" d="M42.6,28c-0.1,0-0.2,0.1-0.2,0.2v1c0-0.1,0.1-0.2,0.2-0.2h2.9c0.1,0,0.2,0.1,0.2,0.2v-1c0-0.1-0.1-0.2-0.2-0.2
	h-1l0,0h-1l0,0H42.6z"/>
<path class="st2" d="M38.6,28c-0.1,0-0.2,0.1-0.2,0.2v1c0-0.1,0.1-0.2,0.2-0.2h2.9c0.1,0,0.2,0.1,0.2,0.2v-1c0-0.1-0.1-0.2-0.2-0.2
	h-1l0,0h-1l0,0L38.6,28z"/>
<path class="st2" d="M34.5,28c-0.1,0-0.2,0.1-0.2,0.2v1c0-0.1,0.1-0.2,0.2-0.2h2.9c0.1,0,0.2,0.1,0.2,0.2v-1c0-0.1-0.1-0.2-0.2-0.2
	h-1l0,0h-1l0,0H34.5z"/>
<path class="st2" d="M30.5,28c-0.1,0-0.2,0.1-0.1,0.2v1c0-0.1,0.1-0.2,0.2-0.2c0,0,0,0,0,0h2.9c0.1,0,0.2,0.1,0.2,0.2v-1
	c0-0.1-0.1-0.2-0.2-0.2h-1l0,0h-1l0,0H30.5z"/>
<path class="st2" d="M26.5,28c-0.1,0-0.2,0.1-0.1,0.2v1c0-0.1,0.1-0.2,0.2-0.2c0,0,0,0,0,0h2.9c0.1,0,0.2,0.1,0.2,0.2c0,0,0,0,0,0
	v-1c0-0.1-0.1-0.2-0.1-0.2h-1l0,0h-1l0,0H26.5z"/>
<path class="st2" d="M22.5,28c-0.1,0-0.2,0.1-0.1,0.2v1c0-0.1,0.1-0.2,0.2-0.2c0,0,0,0,0,0h2.9c0.1,0,0.2,0.1,0.2,0.2c0,0,0,0,0,0
	v-1c0-0.1-0.1-0.2-0.1-0.2h-1l0,0h-1l0,0H22.5z"/>
<path class="st2" d="M18.5,28c-0.1,0-0.2,0.1-0.1,0.2v1c0-0.1,0.1-0.2,0.2-0.2c0,0,0,0,0,0h2.9c0.1,0,0.2,0.1,0.2,0.2c0,0,0,0,0,0
	v-1c0-0.1-0.1-0.2-0.1-0.2h-1l0,0h-1l0,0H18.5z"/>
<path class="st2" d="M14.5,28c-0.1,0-0.2,0.1-0.1,0.2v1c0-0.1,0.1-0.2,0.2-0.2l0,0h2.9c0.1,0,0.2,0.1,0.2,0.2c0,0,0,0,0,0v-1
	c0-0.1-0.1-0.2-0.1-0.2h-1l0,0h-1l0,0H14.5z"/>
<path class="st2" d="M10.5,28c-0.1,0-0.2,0.1-0.1,0.2v1c0-0.1,0.1-0.2,0.2-0.2l0,0h2.9c0.1,0,0.2,0.1,0.2,0.2l0,0v-1
	c0-0.1-0.1-0.2-0.1-0.2h-1l0,0h-1l0,0H10.5z"/>
<linearGradient id="SVGID_142_" gradientUnits="userSpaceOnUse" x1="7.875" y1="13.85" x2="7.875" y2="17.67" gradientTransform="matrix(1 0 0 -1 0 49.73)">
	<stop  offset="0" style="stop-color:#1A1A1A"/>
	<stop  offset="1" style="stop-color:#595959"/>
</linearGradient>
<path class="st146" d="M4,35.6v-3.3c0-0.1,0.1-0.3,0.3-0.3h7.1c0.1,0,0.3,0.1,0.3,0.3v3.3c0,0.1-0.1,0.3-0.3,0.3H4.3
	C4.2,35.9,4,35.8,4,35.6z"/>
<linearGradient id="SVGID_143_" gradientUnits="userSpaceOnUse" x1="7.865" y1="14.09" x2="7.865" y2="17.43" gradientTransform="matrix(1 0 0 -1 0 49.73)">
	<stop  offset="0" style="stop-color:#CCCCCC"/>
	<stop  offset="1" style="stop-color:#F7F7F7"/>
</linearGradient>
<path class="st147" d="M4.4,32.3h7c0.1,0,0.1,0,0.1,0.1v3.1c0,0.1,0,0.1-0.1,0.1h-7c-0.1,0-0.1,0-0.1-0.1v-3.1
	C4.3,32.3,4.3,32.3,4.4,32.3z"/>
<linearGradient id="SVGID_144_" gradientUnits="userSpaceOnUse" x1="56.215" y1="13.85" x2="56.215" y2="21.97" gradientTransform="matrix(1 0 0 -1 0 49.73)">
	<stop  offset="0" style="stop-color:#1A1A1A"/>
	<stop  offset="1" style="stop-color:#595959"/>
</linearGradient>
<path class="st148" d="M52.9,35.9c-0.3,0-0.5-0.2-0.5-0.5v-2.9c0-0.3,0.2-0.5,0.5-0.5h1.9v-3.8c0-0.3,0.2-0.5,0.5-0.5h4.3
	c0.3,0,0.5,0.2,0.5,0.5v7.2c0,0.3-0.2,0.5-0.5,0.5L52.9,35.9z"/>
<linearGradient id="SVGID_145_" gradientUnits="userSpaceOnUse" x1="56.215" y1="14.09" x2="56.215" y2="21.73" gradientTransform="matrix(1 0 0 -1 0 49.73)">
	<stop  offset="0" style="stop-color:#CCCCCC"/>
	<stop  offset="1" style="stop-color:#F7F7F7"/>
</linearGradient>
<path class="st149" d="M55,28.2v3.8c0,0.1-0.1,0.2-0.2,0.2h0h-1.9c-0.1,0-0.2,0.1-0.2,0.2v0v2.9c0,0.1,0.1,0.2,0.2,0.2h0h6.7
	c0.1,0,0.2-0.1,0.2-0.2v0v-7.2c0-0.1-0.1-0.2-0.2-0.2l0,0h-4.3C55.1,28,55,28.1,55,28.2C55,28.2,55,28.2,55,28.2z"/>
<path class="st2" d="M4.4,33.3h7c0.1,0,0.1,0,0.1,0.1l0,0v-1c0,0,0-0.1,0-0.1h-0.9c0,0,0,0-0.1,0h-1c0,0-0.1,0-0.1,0h-5
	c0,0-0.1,0-0.1,0c0,0-0.1,0-0.1,0.1v1C4.3,33.4,4.3,33.4,4.4,33.3C4.3,33.3,4.4,33.3,4.4,33.3z"/>
<path class="st2" d="M52.6,32.5v1c0-0.1,0.1-0.2,0.2-0.2h0h1.9c0.1,0,0.2-0.1,0.2-0.2v0v-1c0,0.1-0.1,0.2-0.2,0.2h0h-1.2
	c0,0,0,0-0.1,0h-0.8C52.7,32.3,52.6,32.4,52.6,32.5z"/>
<path class="st2" d="M55.2,28c-0.1,0-0.1,0.1-0.1,0.2v1c0-0.1,0.1-0.2,0.2-0.2l0,0h4.3c0.1,0,0.2,0.1,0.2,0.2v0v-1
	c0-0.1-0.1-0.2-0.2-0.2l0,0h-3c0,0-0.1,0-0.1,0h-0.9c0,0-0.1,0-0.1,0L55.2,28z"/>
<path class="st2" d="M48.6,33.3h2.9c0.1,0,0.2,0.1,0.2,0.2v-1c0-0.1-0.1-0.2-0.2-0.2h-2.9c-0.1,0-0.2,0.1-0.2,0.2v1
	C48.4,33.4,48.5,33.3,48.6,33.3z"/>
<path class="st2" d="M44.6,33.3h2.9c0.1,0,0.2,0.1,0.2,0.2v-1c0-0.1-0.1-0.2-0.2-0.2h-2.9c-0.1,0-0.2,0.1-0.2,0.2v1
	C44.4,33.4,44.5,33.3,44.6,33.3z"/>
<path class="st2" d="M40.6,33.3h2.9c0.1,0,0.2,0.1,0.2,0.2v-1c0-0.1-0.1-0.2-0.2-0.2h-2.9c-0.1,0-0.2,0.1-0.2,0.2v1
	C40.4,33.4,40.5,33.3,40.6,33.3z"/>
<path class="st2" d="M36.6,33.3h2.9c0.1,0,0.2,0.1,0.2,0.2v-1c0-0.1-0.1-0.2-0.2-0.2h-2.9c-0.1,0-0.2,0.1-0.2,0.2v1
	C36.4,33.4,36.5,33.3,36.6,33.3z"/>
<path class="st2" d="M32.6,33.3h2.9c0.1,0,0.2,0.1,0.2,0.2v-1c0-0.1-0.1-0.2-0.2-0.2h-2.9c-0.1,0-0.2,0.1-0.2,0.2v1
	C32.4,33.4,32.5,33.3,32.6,33.3z"/>
<path class="st2" d="M28.6,33.3h2.9c0.1,0,0.2,0.1,0.2,0.2v-1c0-0.1-0.1-0.2-0.2-0.2h-2.9c-0.1,0-0.2,0.1-0.2,0.2v1
	C28.4,33.4,28.5,33.3,28.6,33.3z"/>
<path class="st2" d="M24.6,33.3h2.9c0.1,0,0.2,0.1,0.2,0.2v-1c0-0.1-0.1-0.2-0.2-0.2h-2.9c-0.1,0-0.2,0.1-0.2,0.2v1
	C24.4,33.4,24.5,33.3,24.6,33.3z"/>
<path class="st2" d="M20.5,33.3h2.9c0.1,0,0.2,0.1,0.2,0.2v-1c0-0.1-0.1-0.2-0.2-0.2h-2.9c-0.1,0-0.2,0.1-0.2,0.2v1
	C20.4,33.4,20.4,33.3,20.5,33.3z"/>
<path class="st2" d="M16.5,33.3h2.9c0.1,0,0.2,0.1,0.2,0.2v-1c0-0.1-0.1-0.2-0.2-0.2h-2.9c-0.1,0-0.2,0.1-0.2,0.2v1
	C16.4,33.4,16.4,33.3,16.5,33.3z"/>
<path class="st2" d="M12.5,32.3c-0.1,0-0.2,0.1-0.2,0.2v1c0-0.1,0.1-0.2,0.2-0.2h2.9c0.1,0,0.2,0.1,0.2,0.2v-1
	c0-0.1-0.1-0.2-0.2-0.2H12.5z"/>
</svg>
