<?xml version="1.0" encoding="utf-8"?>
<!-- Generator: Adobe Illustrator 21.0.0, SVG Export Plug-In . SVG Version: 6.00 Build 0)  -->
<svg version="1.1" id="katman_1" xmlns="http://www.w3.org/2000/svg" xmlns:xlink="http://www.w3.org/1999/xlink" x="0px" y="0px"
	 viewBox="0 0 21.5 22" style="enable-background:new 0 0 21.5 22;" xml:space="preserve">
<style type="text/css">
	.st0{opacity:0.7;fill:#333333;enable-background:new    ;}
	.st1{fill:#ED1C24;}
	.st2{fill:url(#SVGID_1_);}
	.st3{fill:#038478;}
	.st4{fill:url(#SVGID_2_);}
	.st5{fill:#F7931E;}
	.st6{fill:url(#SVGID_3_);}
	.st7{fill:#006837;}
	.st8{fill:url(#SVGID_4_);}
	.st9{fill:#1B1464;}
	.st10{fill:url(#SVGID_5_);}
	.st11{fill:#8E040E;}
	.st12{fill:url(#SVGID_6_);}
	.st13{fill:url(#SVGID_7_);}
	.st14{fill:url(#SVGID_8_);}
	.st15{opacity:0.1;fill:#FFFFFF;enable-background:new    ;}
	.st16{opacity:0.1;fill:#010101;enable-background:new    ;}
</style>
<title>applets-screensshooter_4</title>
<path class="st0" d="M7.1,21.5c-0.5,0-0.8-0.4-0.8-0.8v-0.3c0-0.5,0.4-0.8,0.8-0.8h12.4v-8.8c0-0.5,0.4-0.8,0.8-0.8h0.3
	c0.5,0,0.8,0.4,0.8,0.8v9.9c0,0.5-0.4,0.8-0.8,0.8H7.1z"/>
<path class="st0" d="M0.8,11.6c-0.5,0-0.8-0.4-0.8-0.8c0,0,0,0,0,0V0.8C0,0.4,0.4,0,0.8,0h13.5c0.5,0,0.8,0.4,0.8,0.8v0.3
	c0,0.5-0.4,0.8-0.8,0.8H2v8.7c0,0.5-0.4,0.8-0.8,0.8L0.8,11.6z"/>
<path class="st1" d="M9.4,4.3L9.4,4.3c2-0.4,4.1,0.1,5.6,1.4l0.1,0.1L8.9,8.6L9.4,4.3z"/>
<linearGradient id="SVGID_1_" gradientUnits="userSpaceOnUse" x1="11.97" y1="13.97" x2="11.97" y2="18.35" gradientTransform="matrix(1 0 0 -1 0 21.73)">
	<stop  offset="0" style="stop-color:#D36329"/>
	<stop  offset="0.5" style="stop-color:#F17522"/>
	<stop  offset="0.68" style="stop-color:#F27C27"/>
	<stop  offset="0.93" style="stop-color:#F68F35"/>
	<stop  offset="1" style="stop-color:#F7953A"/>
</linearGradient>
<path class="st2" d="M9.4,4.4L9,8.5l5.9-2.7C13.4,4.5,11.4,4,9.4,4.4z"/>
<path class="st3" d="M4.4,8.7L4.4,8.7C5,6.9,6.3,5.5,8,4.7l0.5-0.2h0.1L8,11.3L4.4,8.7z"/>
<linearGradient id="SVGID_2_" gradientUnits="userSpaceOnUse" x1="6.56" y1="11.41" x2="6.56" y2="17.85" gradientTransform="matrix(1 0 0 -1 0 21.73)">
	<stop  offset="0" style="stop-color:#00A99D"/>
	<stop  offset="0.67" style="stop-color:#00CCCC"/>
</linearGradient>
<path class="st4" d="M8.6,4.6L8,4.8C6.4,5.6,5.1,7,4.6,8.7L8,11.1L8.6,4.6z"/>
<path class="st5" d="M5.8,15.1c-0.5-0.5-0.8-1.1-1.1-1.7c-0.4-0.9-0.6-1.8-0.6-2.7c0-0.4,0-0.8,0.1-1.2V9.4l5.6,4L5.8,15.1L5.8,15.1
	z"/>
<linearGradient id="SVGID_3_" gradientUnits="userSpaceOnUse" x1="6.965" y1="5.96" x2="6.965" y2="12.08" gradientTransform="matrix(1 0 0 -1 0 21.73)">
	<stop  offset="0" style="stop-color:#DD922E"/>
	<stop  offset="6.000000e-02" style="stop-color:#F9AE42"/>
	<stop  offset="0.42" style="stop-color:#F8DB6E"/>
	<stop  offset="1" style="stop-color:#FDDEB1"/>
</linearGradient>
<path class="st6" d="M4.3,9.5c-0.1,0.4-0.1,0.8-0.1,1.2l0,0c0,0.9,0.2,1.8,0.6,2.7c0.3,0.6,0.7,1.2,1.1,1.7l3.8-1.7L4.3,9.5z"/>
<path class="st7" d="M13.5,10.1l3.5,2.5v0.1c-0.5,1.8-1.8,3.3-3.6,4.1c-0.2,0.1-0.4,0.2-0.6,0.2h-0.1L13.5,10.1z"/>
<linearGradient id="SVGID_4_" gradientUnits="userSpaceOnUse" x1="14.946" y1="4.8499" x2="14.616" y2="17.3099" gradientTransform="matrix(1 0 0 -1 0 21.73)">
	<stop  offset="0" style="stop-color:#57B731"/>
	<stop  offset="0.42" style="stop-color:#82B51C"/>
	<stop  offset="0.47" style="stop-color:#7FB41D"/>
	<stop  offset="0.51" style="stop-color:#74B021"/>
	<stop  offset="0.55" style="stop-color:#62A928"/>
	<stop  offset="0.56" style="stop-color:#5EA72A"/>
	<stop  offset="0.61" style="stop-color:#5CAC2C"/>
	<stop  offset="0.65" style="stop-color:#57B731"/>
	<stop  offset="0.82" style="stop-color:#82B51C"/>
	<stop  offset="0.88" style="stop-color:#7FB41D"/>
	<stop  offset="0.94" style="stop-color:#74B021"/>
	<stop  offset="0.99" style="stop-color:#62A928"/>
	<stop  offset="1" style="stop-color:#5EA72A"/>
</linearGradient>
<path class="st8" d="M12.8,16.9c0.2-0.1,0.4-0.1,0.6-0.2c1.7-0.8,3-2.2,3.5-4l-3.4-2.4L12.8,16.9z"/>
<path class="st9" d="M10.7,17.3c-1.6,0-3.1-0.6-4.3-1.6l-0.1-0.1l6.2-2.8l-0.5,4.3H12C11.6,17.3,11.1,17.3,10.7,17.3L10.7,17.3z"/>
<linearGradient id="SVGID_5_" gradientUnits="userSpaceOnUse" x1="9.49" y1="3.24" x2="9.49" y2="9.77" gradientTransform="matrix(1 0 0 -1 0 21.73)">
	<stop  offset="0" style="stop-color:#2D5778"/>
	<stop  offset="7.000000e-02" style="stop-color:#2B5E82"/>
	<stop  offset="0.34" style="stop-color:#2477A5"/>
	<stop  offset="0.59" style="stop-color:#1E88BF"/>
	<stop  offset="0.82" style="stop-color:#1B93CF"/>
	<stop  offset="1" style="stop-color:#1A97D4"/>
</linearGradient>
<path class="st10" d="M12,17.1l0.5-4.1l-5.9,2.7C8,17,10.1,17.5,12,17.1z"/>
<path class="st11" d="M11.6,8.1l4-1.8l0,0c0.5,0.5,0.8,1.1,1.1,1.7c0.5,1.2,0.7,2.5,0.5,3.8V12L11.6,8.1z"/>
<linearGradient id="SVGID_6_" gradientUnits="userSpaceOnUse" x1="11.8" y1="12.635" x2="17.24" y2="12.635" gradientTransform="matrix(1 0 0 -1 0 21.73)">
	<stop  offset="0.25" style="stop-color:#CC2A31"/>
	<stop  offset="0.49" style="stop-color:#C92930"/>
	<stop  offset="0.67" style="stop-color:#C0272F"/>
	<stop  offset="0.82" style="stop-color:#B0242C"/>
	<stop  offset="0.96" style="stop-color:#9A1F28"/>
	<stop  offset="0.99" style="stop-color:#931D27"/>
</linearGradient>
<path class="st12" d="M16.7,8c-0.3-0.6-0.6-1.1-1.1-1.6l-3.8,1.7l5.3,3.7C17.4,10.5,17.2,9.2,16.7,8z"/>
<linearGradient id="SVGID_7_" gradientUnits="userSpaceOnUse" x1="13.87" y1="0.44" x2="13.87" y2="11.66" gradientTransform="matrix(1 0 0 -1 0 21.73)">
	<stop  offset="0" style="stop-color:#CCCCCC"/>
	<stop  offset="1" style="stop-color:#F7F7F7"/>
</linearGradient>
<path class="st13" d="M20.6,10.1h-0.3c-0.4,0-0.7,0.3-0.7,0.7v8.9H7.1c-0.4,0-0.7,0.3-0.7,0.7v0.3c0,0.4,0.3,0.7,0.7,0.7h13.5
	c0.4,0,0.7-0.3,0.7-0.7v-9.9C21.3,10.4,21,10.1,20.6,10.1z"/>
<linearGradient id="SVGID_8_" gradientUnits="userSpaceOnUse" x1="7.585" y1="10.34" x2="7.585" y2="21.56" gradientTransform="matrix(1 0 0 -1 0 21.73)">
	<stop  offset="0" style="stop-color:#CCCCCC"/>
	<stop  offset="1" style="stop-color:#F7F7F7"/>
</linearGradient>
<path class="st14" d="M0.8,11.4h0.3c0.4,0,0.7-0.3,0.7-0.7V1.8h12.5c0.4,0,0.6-0.3,0.6-0.7V0.8c0-0.4-0.3-0.7-0.7-0.7H0.8
	c-0.4,0-0.7,0.3-0.7,0.7v9.9C0.2,11.1,0.5,11.4,0.8,11.4z"/>
<path class="st15" d="M14.4,6.1l0.6-0.3C13.4,4.5,11.4,4,9.4,4.4L9,8.5h0.1l0.4-3.4C11.1,4.8,12.9,5.1,14.4,6.1z"/>
<path class="st16" d="M9.1,8.5L9,9.2l5.9-2.7c-0.2-0.2-0.4-0.3-0.6-0.4L9.1,8.5z"/>
<path class="st15" d="M8,5.5l0.5-0.2l0.1-0.7L8,4.8C6.4,5.6,5.1,7,4.6,8.7l0.2,0.1C5.4,7.4,6.5,6.2,8,5.5z"/>
<path class="st16" d="M8,11.1L4.8,8.9C4.7,9,4.6,9.2,4.6,9.4L8,11.8l0.6-6.6H8.6L8,11.1z"/>
<path class="st15" d="M9.1,13.6l0.6-0.3L4.3,9.5c-0.1,0.4-0.1,0.8-0.1,1.2l0,0c0,0.1,0,0.2,0,0.3c0-0.3,0-0.6,0.1-0.9L9.1,13.6z"/>
<path class="st16" d="M5.9,15.1c-0.4-0.5-0.8-1.1-1.1-1.7c-0.3-0.7-0.5-1.5-0.6-2.3c0,0.1,0,0.2,0,0.4l0,0c0,0.9,0.2,1.8,0.6,2.7
	c0.3,0.6,0.7,1.2,1.1,1.7l3.8-1.7l-0.6-0.4L5.9,15.1z"/>
<path class="st15" d="M16.8,13.2c0.1-0.2,0.1-0.4,0.2-0.6l-3.4-2.3l-0.7,6.6h0.1l0.6-5.9L16.8,13.2z"/>
<path class="st16" d="M13.4,16.6l-0.5,0.2l-0.1,0.7c0.2-0.1,0.4-0.1,0.6-0.2c1.7-0.8,3-2.2,3.5-4l-0.2-0.1
	C16.1,14.7,14.9,16,13.4,16.6z"/>
<path class="st15" d="M12.5,13l-5.9,2.7c0.2,0.2,0.4,0.3,0.6,0.4l5.3-2.4L12.5,13z"/>
<path class="st16" d="M12,17.1c-1.7,0.3-3.5,0-4.9-1l-0.6,0.3C8,17.7,10,18.2,12,17.8l0.4-4.1h-0.1L12,17.1z"/>
<path class="st15" d="M16.7,8.7c0.3,0.7,0.5,1.5,0.6,2.3c0.1-1-0.1-2.1-0.6-3c-0.3-0.6-0.6-1.1-1.1-1.6l-3.8,1.7l0.6,0.4l3.2-1.4
	C16,7.6,16.4,8.1,16.7,8.7z"/>
<path class="st16" d="M17.2,11.8l-4.7-3.3l-0.6,0.3l5.3,3.7c0.1-0.5,0.1-1,0.1-1.5C17.2,11.3,17.2,11.5,17.2,11.8z"/>
<path class="st15" d="M7.1,20.4h12.5v-0.7H7.1c-0.4,0-0.7,0.3-0.7,0.7v0.3c0,0.1,0,0.1,0,0.2C6.5,20.5,6.8,20.3,7.1,20.4z"/>
<path class="st15" d="M20.6,10.1h-0.3c-0.4,0-0.7,0.3-0.7,0.7v0.7c0-0.4,0.3-0.7,0.7-0.7h0.3c0.4,0,0.7,0.3,0.7,0.7v-0.7
	C21.3,10.4,21,10.1,20.6,10.1z"/>
<path class="st16" d="M20.6,21.3H7.1c-0.3,0-0.5-0.2-0.6-0.5c0,0.1,0,0.1,0,0.2v0.3c0,0.3,0.3,0.6,0.6,0.6h13.5
	c0.4,0,0.7-0.3,0.7-0.7v-0.7C21.3,21,21,21.3,20.6,21.3z"/>
<path class="st15" d="M15,0.8c0-0.4-0.3-0.7-0.7-0.7H0.8c-0.4,0-0.7,0.3-0.7,0.7v0.7c0-0.4,0.3-0.7,0.7-0.7h13.5
	c0.3,0,0.5,0.2,0.6,0.5c0-0.1,0-0.1,0-0.2L15,0.8z"/>
<path class="st16" d="M1.2,11.4H0.8c-0.4,0-0.7-0.3-0.7-0.7v0.7c0,0.4,0.3,0.7,0.7,0.7h0.3c0.4,0,0.7-0.3,0.7-0.7v-0.7
	C1.8,11.1,1.5,11.4,1.2,11.4z"/>
<path class="st16" d="M14.4,1.8H1.8v0.7h12.5c0.4,0,0.6-0.3,0.6-0.7V1.5c0-0.1,0-0.1,0-0.2C14.9,1.6,14.7,1.8,14.4,1.8z"/>
</svg>
