<?xml version="1.0" encoding="utf-8"?>
<!-- Generator: Adobe Illustrator 21.0.0, SVG Export Plug-In . SVG Version: 6.00 Build 0)  -->
<svg version="1.1" id="katman_1" xmlns="http://www.w3.org/2000/svg" xmlns:xlink="http://www.w3.org/1999/xlink" x="0px" y="0px"
	 viewBox="0 0 48 35.9" style="enable-background:new 0 0 48 35.9;" xml:space="preserve">
<style type="text/css">
	.st0{opacity:0.3;enable-background:new    ;}
	.st1{fill:url(#SVGID_1_);}
	.st2{fill:url(#SVGID_2_);}
	.st3{opacity:0.2;}
	.st4{opacity:0.1;enable-background:new    ;}
	.st5{opacity:0.1;fill:#FFFFFF;enable-background:new    ;}
	.st6{fill:#F2F2F2;}
</style>
<title>gnome-window-manager_1</title>
<path class="st0" d="M48,1.2C48,0.5,47.5,0,46.8,0H1.2C0.5,0,0,0.5,0,1.2c0,0,0,0,0,0v33.7h47.7V5.1H48V1.2z"/>
<linearGradient id="SVGID_1_" gradientUnits="userSpaceOnUse" x1="23.865" y1="1.86" x2="23.865" y2="32.45" gradientTransform="matrix(1 0 0 -1 0 35.73)">
	<stop  offset="0" style="stop-color:#D7D7D6"/>
	<stop  offset="6.000000e-02" style="stop-color:#DEDDDC"/>
	<stop  offset="0.22" style="stop-color:#EAE9E8"/>
	<stop  offset="0.44" style="stop-color:#F1EFEE"/>
	<stop  offset="1" style="stop-color:#F3F1F0"/>
</linearGradient>
<rect x="0.4" y="3.3" class="st1" width="47" height="31.1"/>
<linearGradient id="SVGID_2_" gradientUnits="userSpaceOnUse" x1="24" y1="-13.11" x2="24" y2="34.99" gradientTransform="matrix(1 0 0 -1 0 35.73)">
	<stop  offset="5.000000e-02" style="stop-color:#1A1A1A"/>
	<stop  offset="0.39" style="stop-color:#1D1D1D"/>
	<stop  offset="0.66" style="stop-color:#272727"/>
	<stop  offset="0.91" style="stop-color:#383838"/>
	<stop  offset="1" style="stop-color:#404040"/>
</linearGradient>
<path class="st2" d="M47.6,4.7V1.2c0-0.4-0.4-0.8-0.8-0.8l0,0H1.2c-0.4,0-0.8,0.4-0.8,0.8l0,0v3.6H47.6z"/>
<g class="st3">
	<path d="M43,3.9l0.8-1.1l-0.8-1h0.8l0.4,0.5l0.4-0.5h0.7l-0.8,1l0.9,1.1h-0.8l-0.5-0.6l-0.5,0.6L43,3.9z"/>
</g>
<g class="st3">
	<path d="M40.4,3.9V3.1h-0.8V2.6h0.8V1.8h0.6v0.8h0.8v0.5h-0.8v0.8L40.4,3.9z"/>
</g>
<rect x="0.4" y="34.4" class="st4" width="47" height="1.5"/>
<path class="st5" d="M46.8,0.4H1.2c-0.4,0-0.8,0.4-0.8,0.8c0,0,0,0,0,0v1.5c0-0.4,0.4-0.8,0.8-0.8h45.7c0.4,0,0.8,0.4,0.8,0.8
	c0,0,0,0,0,0V1.2C47.6,0.7,47.3,0.4,46.8,0.4L46.8,0.4z"/>
<rect x="0.4" y="4.7" class="st4" width="47.3" height="1.5"/>
<path class="st6" d="M43,3.7l0.8-1.1l-0.8-1h0.8l0.4,0.5l0.4-0.5h0.7l-0.8,1l0.9,1.1h-0.8l-0.5-0.6l-0.5,0.6L43,3.7z"/>
<path class="st6" d="M40.4,3.7V2.9h-0.8V2.4h0.8V1.6h0.6v0.8h0.8v0.5h-0.8v0.8L40.4,3.7z"/>
</svg>
