<?xml version="1.0" encoding="utf-8"?>
<!-- Generator: Adobe Illustrator 21.0.0, SVG Export Plug-In . SVG Version: 6.00 Build 0)  -->
<svg version="1.1" id="katman_1" xmlns="http://www.w3.org/2000/svg" xmlns:xlink="http://www.w3.org/1999/xlink" x="0px" y="0px"
	 viewBox="0 0 46.6 48" style="enable-background:new 0 0 46.6 48;" xml:space="preserve">
<style type="text/css">
	.st0{fill:#333333;}
	.st1{fill:url(#SVGID_1_);}
	.st2{opacity:0.2;fill:#FFFFFF;enable-background:new    ;}
	.st3{opacity:0.2;enable-background:new    ;}
	.st4{opacity:0.5;enable-background:new    ;}
	.st5{fill:url(#SVGID_2_);}
	.st6{fill:url(#SVGID_3_);}
	.st7{opacity:0.65;enable-background:new    ;}
</style>
<title>avatar-default_1</title>
<path class="st0" d="M23.3,46.6C10.4,46.6,0,36.2,0,23.3S10.4,0,23.3,0s23.3,10.4,23.3,23.3l0,0C46.6,36.2,36.2,46.6,23.3,46.6z"/>
<linearGradient id="SVGID_1_" gradientUnits="userSpaceOnUse" x1="23.32" y1="1.82" x2="23.32" y2="48.19" gradientTransform="matrix(1 0 0 -1 0 47.73)">
	<stop  offset="0" style="stop-color:#DD922E"/>
	<stop  offset="6.000000e-02" style="stop-color:#F9AE42"/>
	<stop  offset="0.42" style="stop-color:#F8DB6E"/>
	<stop  offset="1" style="stop-color:#FDDEB1"/>
</linearGradient>
<circle class="st1" cx="23.3" cy="23.3" r="23.1"/>
<path class="st2" d="M23.2,1.7c12.7,0,23.1,10.3,23.1,23c0-0.5,0-0.9,0-1.4C46.4,10.5,36,0.2,23.2,0.2C10.4,0.2,0.1,10.5,0.1,23.3
	c0,0,0,0.1,0,0.1C0.8,11.2,11,1.7,23.2,1.7z"/>
<path class="st3" d="M23.3,46.5c-12.7,0-23.1-10.3-23.1-23c0,0.5,0,0.9,0,1.4C0.2,37.6,10.5,48,23.3,48c12.8,0,23.1-10.4,23.1-23.1
	c0,0,0-0.1,0-0.1C45.7,37,35.5,46.5,23.3,46.5z"/>
<path class="st4" d="M22.9,22.3c-5,0-9-4-9-9s4-9,9-9s9,4,9,9S27.9,22.3,22.9,22.3L22.9,22.3z"/>
<radialGradient id="SVGID_2_" cx="22.89" cy="34.44" r="11.75" gradientTransform="matrix(1 0 0 -1 0 47.73)" gradientUnits="userSpaceOnUse">
	<stop  offset="0" style="stop-color:#E7E6E6"/>
	<stop  offset="0.26" style="stop-color:#E3E3E3"/>
	<stop  offset="0.49" style="stop-color:#D9D8D8"/>
	<stop  offset="0.72" style="stop-color:#C6C6C6"/>
	<stop  offset="0.93" style="stop-color:#ADAEAE"/>
	<stop  offset="1" style="stop-color:#A3A4A4"/>
</radialGradient>
<circle class="st5" cx="22.9" cy="13.3" r="8.7"/>
<path class="st4" d="M23.3,46.7c-7.7,0-14.9-3.8-19.3-10.1L4,36.5v-0.1c3.4-10.4,14.5-16.1,25-12.8c6.4,2.1,11.3,7.2,13,13.6v0.1
	l-0.1,0.1C37.5,43.3,30.6,46.7,23.3,46.7z"/>
<radialGradient id="SVGID_3_" cx="24.1" cy="19.01" r="19.83" gradientTransform="matrix(1 0 0 -1 0 47.73)" gradientUnits="userSpaceOnUse">
	<stop  offset="0" style="stop-color:#E7E6E6"/>
	<stop  offset="0.26" style="stop-color:#E3E3E3"/>
	<stop  offset="0.49" style="stop-color:#D9D8D8"/>
	<stop  offset="0.72" style="stop-color:#C6C6C6"/>
	<stop  offset="0.93" style="stop-color:#ADAEAE"/>
	<stop  offset="1" style="stop-color:#A3A4A4"/>
</radialGradient>
<path class="st6" d="M22.9,22.9L22.9,22.9c-8.5,0-16,5.5-18.6,13.5c7.2,10.5,21.6,13.2,32.2,6c2-1.4,3.8-3.1,5.3-5.1
	C39.4,28.8,31.7,22.9,22.9,22.9z"/>
<ellipse transform="matrix(0.4465 -0.8948 0.8948 0.4465 -24.2429 43.4131)" class="st7" cx="23" cy="41.3" rx="2.3" ry="2.3"/>
<ellipse transform="matrix(0.1551 -0.9879 0.9879 0.1551 -15.0273 51.8658)" class="st7" cx="22.8" cy="34.7" rx="2.7" ry="1.4"/>
<ellipse transform="matrix(0.4465 -0.8948 0.8948 0.4465 -24.2231 38.1444)" class="st7" cx="18.7" cy="38.7" rx="1.4" ry="1.6"/>
</svg>
