<?xml version="1.0" encoding="utf-8"?>
<!-- Generator: Adobe Illustrator 21.0.0, SVG Export Plug-In . SVG Version: 6.00 Build 0)  -->
<svg version="1.1" id="katman_1" xmlns="http://www.w3.org/2000/svg" xmlns:xlink="http://www.w3.org/1999/xlink" x="0px" y="0px"
	 viewBox="0 0 62.2 64" style="enable-background:new 0 0 62.2 64;" xml:space="preserve">
<style type="text/css">
	.st0{fill:#333333;}
	.st1{fill:url(#SVGID_1_);}
	.st2{opacity:0.2;fill:#FFFFFF;enable-background:new    ;}
	.st3{opacity:0.2;enable-background:new    ;}
	.st4{opacity:0.5;enable-background:new    ;}
	.st5{fill:url(#SVGID_2_);}
	.st6{fill:url(#SVGID_3_);}
	.st7{opacity:0.65;enable-background:new    ;}
</style>
<title>avatar-default</title>
<path class="st0" d="M31.1,62.2C13.9,62.2,0,48.3,0,31.1S13.9,0,31.1,0s31.1,13.9,31.1,31.1l0,0C62.2,48.3,48.3,62.2,31.1,62.2z"/>
<linearGradient id="SVGID_1_" gradientUnits="userSpaceOnUse" x1="31.09" y1="2.51" x2="31.09" y2="64.34" gradientTransform="matrix(1 0 0 -1 0 63.73)">
	<stop  offset="0" style="stop-color:#DD922E"/>
	<stop  offset="6.000000e-02" style="stop-color:#F9AE42"/>
	<stop  offset="0.42" style="stop-color:#F8DB6E"/>
	<stop  offset="1" style="stop-color:#FDDEB1"/>
</linearGradient>
<circle class="st1" cx="31.1" cy="31.1" r="30.9"/>
<path class="st2" d="M31,2.3C48,2.3,61.7,16,61.8,33c0-0.6,0.1-1.2,0.1-1.9c0-17-13.8-30.8-30.9-30.8C14,0.3,0.2,14.1,0.2,31.1
	c0,0.1,0,0.1,0,0.2C1.2,15,14.7,2.3,31,2.3z"/>
<path class="st3" d="M31,61.9c-16.9,0-30.7-13.7-30.8-30.7c0,0.6-0.1,1.2-0.1,1.9C0.1,50.2,13.9,64,31,64s30.9-13.8,30.9-30.8
	c0,0,0,0,0,0c0-0.1,0-0.1,0-0.2C60.9,49.3,47.3,62,31,61.9z"/>
<path class="st4" d="M30.5,29.7c-6.6,0-12-5.4-12-12s5.4-12,12-12s12,5.4,12,12S37.1,29.7,30.5,29.7z"/>
<radialGradient id="SVGID_2_" cx="30.52" cy="46" r="15.67" gradientTransform="matrix(1 0 0 -1 0 63.73)" gradientUnits="userSpaceOnUse">
	<stop  offset="0" style="stop-color:#E7E6E6"/>
	<stop  offset="0.26" style="stop-color:#E3E3E3"/>
	<stop  offset="0.49" style="stop-color:#D9D8D8"/>
	<stop  offset="0.72" style="stop-color:#C6C6C6"/>
	<stop  offset="0.93" style="stop-color:#ADAEAE"/>
	<stop  offset="1" style="stop-color:#A3A4A4"/>
</radialGradient>
<circle class="st5" cx="30.5" cy="17.7" r="11.6"/>
<path class="st4" d="M31.1,62.3c-10.3,0-19.9-5.1-25.7-13.5l-0.1-0.1v-0.2c4.5-13.9,19.4-21.6,33.3-17.1C47.1,34.1,53.6,41,56,49.6
	v0.2l-0.1,0.1C50,57.7,40.8,62.3,31.1,62.3z"/>
<radialGradient id="SVGID_3_" cx="32.13" cy="25.44" r="26.44" gradientTransform="matrix(1 0 0 -1 0 63.73)" gradientUnits="userSpaceOnUse">
	<stop  offset="0" style="stop-color:#E7E6E6"/>
	<stop  offset="0.26" style="stop-color:#E3E3E3"/>
	<stop  offset="0.49" style="stop-color:#D9D8D8"/>
	<stop  offset="0.72" style="stop-color:#C6C6C6"/>
	<stop  offset="0.93" style="stop-color:#ADAEAE"/>
	<stop  offset="1" style="stop-color:#A3A4A4"/>
</radialGradient>
<path class="st6" d="M30.5,30.5L30.5,30.5c-11.3,0-21.3,7.3-24.8,18c9.7,14,28.9,17.6,42.9,7.9c2.7-1.9,5.1-4.2,7.1-6.8
	C52.5,38.4,42.2,30.5,30.5,30.5z"/>
<ellipse transform="matrix(0.4465 -0.8948 0.8948 0.4465 -32.339 57.8829)" class="st7" cx="30.6" cy="55.1" rx="3" ry="3"/>
<ellipse transform="matrix(0.1595 -0.9872 0.9872 0.1595 -20.082 69.3099)" class="st7" cx="30.7" cy="46.4" rx="3.6" ry="1.8"/>
<ellipse transform="matrix(0.4465 -0.8948 0.8948 0.4465 -32.3049 50.8634)" class="st7" cx="25" cy="51.5" rx="1.8" ry="2.1"/>
</svg>
