<?xml version="1.0" encoding="utf-8"?>
<!-- Generator: Adobe Illustrator 21.0.0, SVG Export Plug-In . SVG Version: 6.00 Build 0)  -->
<svg version="1.1" id="katman_1" xmlns="http://www.w3.org/2000/svg" xmlns:xlink="http://www.w3.org/1999/xlink" x="0px" y="0px"
	 viewBox="0 0 48 41.5" style="enable-background:new 0 0 48 41.5;" xml:space="preserve">
<style type="text/css">
	.st0{opacity:0.2;enable-background:new    ;}
	.st1{fill:#793D1A;}
	.st2{fill:url(#SVGID_1_);}
	.st3{fill:url(#SVGID_2_);}
	.st4{fill:url(#SVGID_3_);}
	.st5{opacity:0.1;enable-background:new    ;}
	.st6{opacity:0.1;fill:#FFFFFF;enable-background:new    ;}
	.st7{opacity:0.7;fill:#793D1A;enable-background:new    ;}
</style>
<title>folder-picture_1</title>
<polygon class="st0" points="43.9,41.5 48,35.2 47,35.2 43.9,40 "/>
<path class="st1" d="M47.6,4.4c0-0.6-0.5-1.2-1.2-1.2H28.9V1.2c0-0.6-0.5-1.2-1.2-1.2c0,0,0,0,0,0H14.9c-0.6,0-1.2,0.5-1.2,1.2v2.1
	h-3.1c-0.6,0-1.2,0.5-1.2,1.2c0,0,0,0,0,0v4L8.3,7.9c-1.2-0.6-2.4-1-3.7-1.2C3.7,6.7,2,8.2,1.5,8.9C0.9,9.6,0.4,10.4,0,11.3
	c-0.3,0.9,1.1,3.5,1.7,4.4L2.6,17l-2.2,3.6c-0.1,0.2-0.2,0.4-0.2,0.6v8.4c0,0.3,0.1,0.6,0.3,0.8l4.3,4.5l2.3,4.9
	c0.2,0.4,0.6,0.6,1,0.7l35.4-0.1H44l3.4-5.2l0.2-0.3L47.6,4.4z"/>
<linearGradient id="SVGID_1_" gradientUnits="userSpaceOnUse" x1="28.56" y1="6.8" x2="28.56" y2="43.63" gradientTransform="matrix(1 0 0 -1 0 41.73)">
	<stop  offset="0" style="stop-color:#793D1A;stop-opacity:0.8"/>
	<stop  offset="1" style="stop-color:#C96E28"/>
</linearGradient>
<path class="st2" d="M28.6,3.4V1.2c0-0.4-0.4-0.8-0.8-0.8l0,0H14.9c-0.4,0-0.8,0.4-0.8,0.8v2.3c0,0.1-0.1,0.2-0.2,0.2h-3.3
	c-0.4,0-0.8,0.4-0.8,0.8l0,0v30.4h37.4V4.4c0-0.4-0.4-0.8-0.8-0.8l0,0H28.8C28.6,3.6,28.6,3.6,28.6,3.4C28.6,3.4,28.6,3.4,28.6,3.4z
	"/>
<linearGradient id="SVGID_2_" gradientUnits="userSpaceOnUse" x1="49.2788" y1="0.8887" x2="43.6988" y2="6.0187" gradientTransform="matrix(1 0 0 -1 0 41.73)">
	<stop  offset="0" style="stop-color:#C96E28"/>
	<stop  offset="1" style="stop-color:#793D1A;stop-opacity:0.8"/>
</linearGradient>
<polygon class="st3" points="43.9,40 47.3,34.9 42,34.9 "/>
<linearGradient id="SVGID_3_" gradientUnits="userSpaceOnUse" x1="22.1379" y1="2.01" x2="22.1379" y2="34.77" gradientTransform="matrix(1 0 0 -1 0 41.73)">
	<stop  offset="0" style="stop-color:#DD922E"/>
	<stop  offset="6.000000e-02" style="stop-color:#F9AE42"/>
	<stop  offset="0.42" style="stop-color:#F8DB6E"/>
	<stop  offset="1" style="stop-color:#FDDEB1"/>
</linearGradient>
<path class="st4" d="M43.1,6.4H14.6c-0.9,1-1.8,2.1-2.6,3.2c-0.2,0.1-0.3,0.1-0.5,0.1L9.1,8.6L8.1,8.2C7,7.6,5.9,7.2,4.6,7
	C4,7,2.3,8.4,1.8,9.1c-0.6,0.7-1,1.5-1.4,2.3c-0.2,0.6,0.9,2.9,1.7,4.1L3,17l-2.3,3.8c-0.1,0.1-0.1,0.3-0.1,0.4v8.4
	c0,0.2,0.1,0.4,0.2,0.5l4.3,4.5c0,0,0.1,0.1,0.1,0.1l2.3,4.9c0.1,0.3,0.4,0.5,0.7,0.5L43.9,40V7.2C43.9,6.7,43.6,6.4,43.1,6.4
	C43.1,6.4,43.1,6.4,43.1,6.4z"/>
<path class="st5" d="M44.3,5.1H15.8c-0.4,0.4-0.8,0.8-1.2,1.2h28.5c0.4,0,0.8,0.4,0.8,0.8c0,0,0,0,0,0V40l1.2-1.9V5.9
	C45.1,5.5,44.8,5.1,44.3,5.1C44.4,5.1,44.4,5.1,44.3,5.1z"/>
<path class="st6" d="M14.9,1.8h12.8c0.4,0,0.8,0.4,0.8,0.8c0,0,0,0,0,0V1.2c0-0.4-0.4-0.8-0.8-0.8l0,0H14.9c-0.4,0-0.8,0.4-0.8,0.8
	v1.5C14.2,2.2,14.5,1.8,14.9,1.8C14.9,1.8,14.9,1.8,14.9,1.8z"/>
<path class="st6" d="M10.6,5.1H14c0.1,0,0.2-0.1,0.2-0.2V3.4c0,0.1-0.1,0.2-0.2,0.2h-3.4c-0.4,0-0.8,0.4-0.8,0.8l0,0v1.5
	C9.9,5.5,10.2,5.1,10.6,5.1z"/>
<path class="st6" d="M46.5,3.6H28.8c-0.1,0-0.2-0.1-0.2-0.2c0,0,0,0,0,0v1.5c0,0.1,0.1,0.2,0.2,0.2l0,0h17.7c0.4,0,0.8,0.4,0.8,0.8
	c0,0,0,0,0,0V4.4C47.3,4,46.9,3.6,46.5,3.6L46.5,3.6z"/>
<path class="st6" d="M43.1,6.4H14.6c-0.9,1-1.8,2.1-2.6,3.2c-0.2,0.1-0.3,0.1-0.5,0.1L9.1,8.6L8.1,8.2C7,7.6,5.9,7.2,4.6,7
	C4,7,2.3,8.4,1.8,9.1c-0.6,0.7-1,1.5-1.4,2.3c0,0.4,0,0.7,0.2,1.1c0.3-0.7,0.7-1.3,1.2-1.9c0.6-0.7,2.2-2.1,2.9-2
	C5.9,8.8,7,9.1,8.1,9.7l0.9,0.4l2.4,1.1c0.2,0,0.3-0.1,0.5-0.1c0.8-1.1,1.7-2.2,2.6-3.2h28.5c0.4,0,0.8,0.4,0.8,0.8v0V7.2
	C43.9,6.7,43.5,6.4,43.1,6.4L43.1,6.4z"/>
<path class="st0" d="M7.6,39.6l-2.4-4.9c0,0,0-0.1-0.1-0.1l-4.3-4.5c-0.1-0.1-0.2-0.3-0.2-0.5V31c0,0.2,0.1,0.4,0.2,0.5l4.3,4.5
	c0,0,0.1,0.1,0.1,0.1l2.3,4.9c0.1,0.3,0.4,0.5,0.7,0.5l35.6-0.1V40L8.3,40.1C8,40.1,7.7,39.9,7.6,39.6z"/>
<path class="st7" d="M18.5,22.4c2.1,0,3.8-1.7,3.8-3.8c0,0,0,0,0,0c0-2.1-1.7-3.8-3.7-3.8c0,0,0,0,0,0c-2.1,0-3.8,1.7-3.8,3.7
	c0,0,0,0,0,0C14.7,20.6,16.3,22.3,18.5,22.4C18.4,22.4,18.4,22.4,18.5,22.4z"/>
<path class="st7" d="M35.4,24l-4.1,2l0,0c0,0-0.1,0-0.2,0l0,0c-0.1-0.1-0.2-0.1-0.2-0.2l0,0l0,0l0,0c0,0,0,0,0-0.1
	c0-0.1,0-0.1,0.1-0.2h0.1c0,0,0.1,0,0.1,0l0,0c0,0,0-0.1,0-0.1l0,0c0,0,0-0.1,0-0.1l0,0l0,0c0,0,0-0.1-0.1-0.1l0,0L31,25h-0.1
	c0,0,0,0-0.1,0.1c-0.1,0-0.1,0-0.2,0c-0.1,0-0.1,0.1-0.2,0.1l0,0l0,0h-0.1c0,0-0.1,0.1-0.1,0.1h0l-0.2,0.1l0,0c-0.1,0-0.2,0-0.3,0.1
	l-0.2,0.1c-0.1,0.1-0.2,0.1-0.3,0.2c-0.1,0.1-0.1,0.2-0.2,0.4c0,0.1,0,0.2-0.1,0.3l0,0C29,26.6,28.9,26.8,29,27
	c0,0.1,0.1,0.1,0.1,0.2l-2.4,1.2L26.3,29h-0.4l-0.3,0.1h-1.3c-1,0.5-2,1-3,1.5l0,0l0,0l-2.6-2.1H19h0.2L19,28.4l-0.3,0.1h-0.1
	l-0.2-0.2l0-0.3l0-0.5l-0.3,0.2l-0.2,0.3l-2.1-1.7l0,0l-2.5,2.1l0,0l-1-0.2l0,0l-2,0.6v7.8H39V25.7L35.4,24z M30.6,26.3
	C30.6,26.2,30.6,26.2,30.6,26.3c0-0.1,0-0.2,0-0.3c0,0,0-0.1,0-0.1l0,0c0,0,0.1,0.1,0.2,0.1h0.1l0.2,0.1L30.6,26.3L30.6,26.3
	C30.6,26.2,30.5,26.2,30.6,26.3C30.5,26.2,30.5,26.2,30.6,26.3L30.6,26.3z M30,26.4c0-0.1,0-0.1,0.1-0.2l0.2-0.1
	c0,0.1,0,0.1,0.1,0.2l0,0l0,0c0,0,0,0.1,0.1,0.1l-0.2,0.1c0,0,0,0,0,0c0,0,0-0.1-0.1-0.1l0,0C30.1,26.4,30,26.4,30,26.4L30,26.4
	L30,26.4C30,26.4,30,26.4,30,26.4L30,26.4z M29.6,26.9L29.6,26.9c-0.1,0-0.1-0.1-0.1-0.1l0,0h-0.1l0,0l0,0l0,0
	c0.1-0.1,0.2-0.2,0.2-0.4l0,0l0,0l0,0l0,0c0,0,0,0.1,0.1,0.1l0,0h0.2H30l-0.4,0.2L29.6,26.9z"/>
<polygon class="st7" points="23.8,26.7 24.1,26.8 24.3,27.2 23.8,27.5 24.7,27.4 25.1,27 25.5,27 25.7,26.9 25.4,26.8 25.1,26.9 
	24.9,27 24.7,26.7 24.7,26.4 24,25.9 24,26.1 24.2,26.5 24.2,26.6 23.8,26.5 "/>
<polygon class="st7" points="21.9,29 21.9,28.7 21.8,28.7 21.6,28.8 21.4,28.8 21.2,28.9 21.2,29.1 21.2,29.1 20.6,29.3 21.3,29.3 
	21.3,29.5 21.3,29.7 21.4,29.9 21.5,29.6 21.6,29.4 21.7,29.4 21.8,29.3 21.8,29.2 22.1,29.1 22.4,29.1 22.7,29.1 22.4,28.9 
	22.1,29 "/>
</svg>
