<?xml version="1.0" encoding="utf-8"?>
<!-- Generator: Adobe Illustrator 21.0.0, SVG Export Plug-In . SVG Version: 6.00 Build 0)  -->
<svg version="1.1" id="katman_1" xmlns="http://www.w3.org/2000/svg" xmlns:xlink="http://www.w3.org/1999/xlink" x="0px" y="0px"
	 viewBox="0 0 22 17.5" style="enable-background:new 0 0 22 17.5;" xml:space="preserve">
<style type="text/css">
	.st0{fill:#2F3134;}
</style>
<title>application-menu_4</title>
<path class="st0" d="M0.3,14.4h21.3c0.2,0,0.3,0.2,0.3,0.3v2.4c0,0.2-0.2,0.3-0.3,0.3H0.3c-0.2,0-0.3-0.2-0.3-0.3v-2.4
	C0,14.6,0.2,14.4,0.3,14.4z"/>
<path class="st0" d="M0.3,7.2h21.3c0.2,0,0.3,0.2,0.3,0.3V10c0,0.2-0.2,0.3-0.3,0.3H0.3C0.2,10.3,0,10.2,0,10V7.6
	C0,7.4,0.2,7.2,0.3,7.2z"/>
<path class="st0" d="M0.3,0h21.3C21.8,0,22,0.2,22,0.3v2.4c0,0.2-0.2,0.3-0.3,0.3H0.3C0.2,3.1,0,2.9,0,2.8V0.3C0,0.2,0.2,0,0.3,0z"
	/>
</svg>
