<?xml version="1.0" encoding="utf-8"?>
<!-- Generator: Adobe Illustrator 21.0.0, SVG Export Plug-In . SVG Version: 6.00 Build 0)  -->
<svg version="1.1" id="katman_1" xmlns="http://www.w3.org/2000/svg" xmlns:xlink="http://www.w3.org/1999/xlink" x="0px" y="0px"
	 viewBox="0 0 22 19.8" style="enable-background:new 0 0 22 19.8;" xml:space="preserve">
<style type="text/css">
	.st0{fill:#66040C;}
	.st1{opacity:0.2;enable-background:new    ;}
	.st2{fill:url(#SVGID_1_);}
	.st3{fill:url(#SVGID_2_);}
	.st4{fill:url(#SVGID_3_);}
	.st5{fill:url(#SVGID_4_);}
	.st6{fill:url(#SVGID_5_);}
	.st7{opacity:0.1;fill:#FFFFFF;enable-background:new    ;}
</style>
<title>Varlık 26</title>
<path class="st0" d="M2.3,19.2v-4.6l-2.3,3l1-6.4l2.4-2.7V4.9c0-0.3,0.2-0.5,0.5-0.5h1.8c0.3,0,0.5,0.2,0.5,0.5v0.4L11,0l10,11.2
	l1,6.4l-2.4-3v4.6L2.3,19.2z"/>
<rect x="2.5" y="19.1" class="st1" width="17" height="0.7"/>
<linearGradient id="SVGID_1_" gradientUnits="userSpaceOnUse" x1="10.995" y1="2.22" x2="10.995" y2="18.05" gradientTransform="matrix(1 0 0 -1 0 21.28)">
	<stop  offset="0" style="stop-color:#A3A4A4"/>
	<stop  offset="0.12" style="stop-color:#BBBBBB"/>
	<stop  offset="0.27" style="stop-color:#CFCECE"/>
	<stop  offset="0.43" style="stop-color:#DDDCDC"/>
	<stop  offset="0.64" style="stop-color:#E5E4E4"/>
	<stop  offset="1" style="stop-color:#E7E6E6"/>
</linearGradient>
<polygon class="st2" points="11,3.2 2.5,13.6 2.5,19.1 19.5,19.1 19.5,13.6 "/>
<polygon class="st1" points="11,3.2 0.4,16.8 0.3,17.7 11,3.9 21.7,17.7 21.6,16.8 "/>
<linearGradient id="SVGID_2_" gradientUnits="userSpaceOnUse" x1="4.81" y1="12.75" x2="4.81" y2="16.83" gradientTransform="matrix(1 0 0 -1 0 21.28)">
	<stop  offset="1.000000e-02" style="stop-color:#931D27"/>
	<stop  offset="0.75" style="stop-color:#CC2A31"/>
</linearGradient>
<path class="st3" d="M4.5,4.6h0.6c0.5,0,0.9,0.4,0.9,0.9v3.1l0,0H3.6l0,0V5.5C3.6,5,4,4.6,4.5,4.6C4.5,4.6,4.5,4.6,4.5,4.6z"/>
<linearGradient id="SVGID_3_" gradientUnits="userSpaceOnUse" x1="11" y1="6.79" x2="11" y2="20.21" gradientTransform="matrix(1 0 0 -1 0 21.28)">
	<stop  offset="1.000000e-02" style="stop-color:#931D27"/>
	<stop  offset="0.75" style="stop-color:#CC2A31"/>
</linearGradient>
<polygon class="st4" points="21.7,17 20.9,11.3 11,0.3 1.1,11.3 0.3,17 11,3.2 "/>
<linearGradient id="SVGID_4_" gradientUnits="userSpaceOnUse" x1="11" y1="2.16" x2="11" y2="9.82" gradientTransform="matrix(1 0 0 -1 0 21.28)">
	<stop  offset="0" style="stop-color:#793D1A"/>
	<stop  offset="0.41" style="stop-color:#A05521"/>
	<stop  offset="0.79" style="stop-color:#BE6726"/>
	<stop  offset="1" style="stop-color:#C96E28"/>
</linearGradient>
<path class="st5" d="M13.5,19.1V14c0-1.4-1.1-2.5-2.5-2.5l0,0l0,0c-1.4,0-2.5,1.1-2.5,2.5l0,0v5.1L13.5,19.1z"/>
<linearGradient id="SVGID_5_" gradientUnits="userSpaceOnUse" x1="11.005" y1="2.28" x2="11.005" y2="9.495" gradientTransform="matrix(1 0 0 -1 0 21.28)">
	<stop  offset="0" style="stop-color:#C96E28;stop-opacity:0.6"/>
	<stop  offset="1" style="stop-color:#793D1A;stop-opacity:0.8"/>
</linearGradient>
<path class="st6" d="M13.2,19H8.8v-5c0-1.2,1-2.2,2.2-2.2s2.2,1,2.2,2.2l0,0L13.2,19z M9,18.7h4V14c0-1.1-0.9-2-2-2s-2,0.9-2,2V18.7
	z"/>
<path class="st7" d="M5.7,4.6H3.9c-0.2,0-0.3,0.1-0.3,0.3v0.7c0-0.2,0.1-0.3,0.3-0.3h1.8c0.2,0,0.3,0.1,0.3,0.3V4.9
	C6.1,4.7,5.9,4.6,5.7,4.6z"/>
<polygon class="st7" points="11,1 20.9,11.9 21.6,16.8 21.7,17 20.9,11.3 11,0.3 1.1,11.3 0.3,17 0.4,16.8 1.1,11.9 "/>
</svg>
