<?xml version="1.0" encoding="utf-8"?>
<!-- Generator: Adobe Illustrator 21.0.0, SVG Export Plug-In . SVG Version: 6.00 Build 0)  -->
<svg version="1.1" id="katman_1" xmlns="http://www.w3.org/2000/svg" xmlns:xlink="http://www.w3.org/1999/xlink" x="0px" y="0px"
	 viewBox="0 0 48 39.2" style="enable-background:new 0 0 48 39.2;" xml:space="preserve">
<style type="text/css">
	.st0{opacity:0.7;fill:#080828;enable-background:new    ;}
	.st1{fill:url(#SVGID_1_);}
	.st2{fill:url(#SVGID_2_);}
	.st3{fill:url(#SVGID_3_);}
	.st4{fill:url(#SVGID_4_);}
	.st5{fill:url(#SVGID_5_);}
	.st6{fill:url(#SVGID_6_);}
	.st7{opacity:0.1;fill:#FFFFFF;enable-background:new    ;}
	.st8{fill:url(#SVGID_7_);}
	.st9{fill:url(#SVGID_8_);}
	.st10{opacity:0.1;enable-background:new    ;}
	.st11{fill:url(#SVGID_9_);}
</style>
<title>mail-unread_1</title>
<path class="st0" d="M47.8,26.3C47.6,21,47.4,16.1,47.6,10c0-0.7-0.5-1.3-1.2-1.3c0,0,0,0-0.1,0c-0.7,0-1.3,0.5-1.3,1.2c0,0,0,0,0,0
	c-0.2,6.2,0,11.1,0.1,16.4c0.1,1.9,0.1,3.8,0.2,5.9h-1.8L41.7,36h-1.1l1.8-3.9h-2.9L37.8,36h-1.1l1.8-3.8h-2.8L33.8,36h-1.1l1.8-3.8
	h-2.8L29.9,36h-1.1l1.8-3.8h-2.8L25.9,36h-1.1l1.8-3.9h-2.9L21.9,36h-1.1l1.8-3.9h-2.8l-1.8,4h-1.1l1.9-4h-2.8l-1.9,4h-1.1l1.9-4
	h-2.8l-1.9,4H8.9l1.9-4H7.9l-1.9,4H4.9l1.8-4H3.9L2.6,35V2.7c1.5,0.1,3.2,0.2,5.2,0.2c1.3,0,2.6,0,3.9,0s2.6,0,3.9,0H16h9.1
	c5.1,0,9.6,0,13.9-0.1h1.2c1.3,0,2.7,0,4-0.1l-0.4,0.8c-0.2,0.4-0.4,0.7-0.6,1.1c-1.2,2.2-2.7,4.7-4.3,7.2L38.2,13
	c-1.6,2.7-4.7,7.6-7.4,10c-0.7,0.6-1.6,1.2-2.4,1.7l-0.2,0.1c-1.2,0.7-2.6,1-4,1c-0.7,0-1.3-0.1-2-0.3c-0.6-0.2-1.3-0.4-1.8-0.8
	c-0.6-0.3-1.1-0.7-1.6-1.2c-0.5-0.5-0.9-1-1.2-1.5c-0.3-0.6-0.6-1.2-0.8-1.8c-0.4-1.3-0.4-2.7,0-4c0.2-0.6,0.4-1.2,0.8-1.8
	c0.3-0.6,0.7-1.1,1.2-1.5c0.5-0.5,1-0.9,1.6-1.2c0.6-0.3,1.2-0.6,1.8-0.8c0.7-0.2,1.3-0.3,2-0.3c1,0,2,0.2,2.9,0.6
	c0.8,0.4,1.6,0.9,2.2,1.6c0.6,0.7,1,1.5,1.3,2.4c0.3,0.9,0.4,1.9,0.3,2.9c0,0.4-0.1,0.8-0.3,1.1c-0.2,0.3-0.4,0.6-0.7,0.9
	c-0.3,0.2-0.6,0.4-1,0.6l-0.3,0.1v-1.6c0-0.4,0-0.8,0-1.1c0-0.3-0.1-0.6-0.1-0.8c0-0.2-0.1-0.4-0.2-0.7c-0.1-0.2-0.2-0.4-0.2-0.6
	c-0.2-0.4-0.5-0.8-0.8-1.2c-0.3-0.3-0.7-0.6-1.1-0.9c-0.8-0.5-1.7-0.7-2.7-0.7c-1.4,0-2.7,0.5-3.7,1.5c-1,1-1.5,2.4-1.5,3.8
	c0,0.4,0,0.9,0.1,1.3c0.3,1.3,1.1,2.4,2.1,3.1c0.2,0.1,0.4,0.3,0.6,0.4c0.2,0.1,0.5,0.2,0.7,0.3c0.5,0.1,1,0.2,1.5,0.2
	c0.2,0,0.4,0,0.7,0c0.2,0,0.5-0.1,0.7-0.1c0.2-0.1,0.5-0.1,0.7-0.2v0.3H28c0.2,0,0.4,0,0.5-0.1l0.5-0.2l0.4-0.1l0.2,0
	c0.5-0.2,1-0.4,1.4-0.7c0.5-0.3,0.9-0.7,1.2-1.1c0.4-0.4,0.7-0.9,0.9-1.4c0.3-0.6,0.4-1.1,0.5-1.8c0.3-1.8,0.1-3.6-0.7-5.2
	c-0.4-0.8-0.9-1.5-1.5-2.1c-0.6-0.6-1.3-1.2-2-1.6c-0.8-0.4-1.6-0.8-2.4-1C26.1,8.1,25.2,8,24.3,8c-0.9,0-1.9,0.1-2.8,0.4
	c-0.9,0.2-1.7,0.6-2.5,1c-1.5,0.9-2.8,2.1-3.8,3.6c-0.5,0.8-0.8,1.6-1.1,2.4c-0.5,1.8-0.5,3.7,0,5.5c0.2,0.9,0.6,1.7,1.1,2.5
	c0.9,1.5,2.2,2.8,3.8,3.6c1.6,0.9,3.4,1.4,5.3,1.4c0.7,0,1.4-0.1,2.2-0.2c0.7-0.1,1.4-0.4,2-0.6c2.2-1.1,4.1-2.5,5.7-4.4
	c2.2-2.7,4.2-5.6,6.1-8.6l0.5-0.8c1.7-2.7,3.3-5.5,4.6-7.6c0.2-0.4,0.5-0.8,0.7-1.3c0.5-1,1.1-2,1.8-3C48,1.6,48,1.1,47.8,0.7
	C47.6,0.3,47.1,0,46.6,0l0,0c-3.5,0.2-7,0.2-10,0.2H23.1c-5.9,0-11.1,0-15.8-0.1H4.8c-1.1,0-2.3,0-3.4-0.2H1.2C1,0,0.7,0.1,0.5,0.3
	C0.2,0.6,0,0.9,0,1.3v36c0,0.7,0.6,1.3,1.3,1.3c2.8,0.1,5.9,0.1,9.3,0.1c3.9,0,7.8,0,11.6-0.1h0.1c3.8,0,7.7-0.1,11.6-0.1
	c4.9,0,8.9,0.1,12.8,0.2l0,0c0.3,0,0.6-0.1,0.9-0.4c0.3-0.2,0.4-0.6,0.4-0.9C48,33.4,47.9,29.8,47.8,26.3z M25.6,19.9l-0.2,0.1
	c-0.3,0.2-0.6,0.4-0.9,0.5c-0.3,0.1-0.6,0.1-0.9,0.1c-0.6,0-1.1-0.2-1.5-0.6c-0.4-0.5-0.6-1.1-0.6-1.7c0-0.6,0.2-1.2,0.6-1.6
	c0.8-0.8,2.1-0.8,2.9,0c0,0,0,0,0,0c0.4,0.5,0.6,1.1,0.6,1.7L25.6,19.9z M44.5,36.1l0.8-1.8c0,0.6,0,1.2,0,1.8L44.5,36.1z"/>
<linearGradient id="SVGID_1_" gradientUnits="userSpaceOnUse" x1="6.16" y1="5.075" x2="10.12" y2="5.075" gradientTransform="matrix(1 0 0 -1 0 39.73)">
	<stop  offset="0.25" style="stop-color:#CC2A31"/>
	<stop  offset="0.49" style="stop-color:#C92930"/>
	<stop  offset="0.67" style="stop-color:#C0272F"/>
	<stop  offset="0.82" style="stop-color:#B0242C"/>
	<stop  offset="0.96" style="stop-color:#9A1F28"/>
	<stop  offset="0.99" style="stop-color:#931D27"/>
</linearGradient>
<polygon class="st1" points="8.1,36.8 6.2,36.8 8.1,32.5 10.1,32.5 "/>
<linearGradient id="SVGID_2_" gradientUnits="userSpaceOnUse" x1="14.08" y1="5.075" x2="18.04" y2="5.075" gradientTransform="matrix(1 0 0 -1 0 39.73)">
	<stop  offset="0.25" style="stop-color:#CC2A31"/>
	<stop  offset="0.49" style="stop-color:#C92930"/>
	<stop  offset="0.67" style="stop-color:#C0272F"/>
	<stop  offset="0.82" style="stop-color:#B0242C"/>
	<stop  offset="0.96" style="stop-color:#9A1F28"/>
	<stop  offset="0.99" style="stop-color:#931D27"/>
</linearGradient>
<polygon class="st2" points="16.1,36.8 14.1,36.8 16.1,32.5 18,32.5 "/>
<linearGradient id="SVGID_3_" gradientUnits="userSpaceOnUse" x1="22.01" y1="5.075" x2="25.97" y2="5.075" gradientTransform="matrix(1 0 0 -1 0 39.73)">
	<stop  offset="0.25" style="stop-color:#CC2A31"/>
	<stop  offset="0.49" style="stop-color:#C92930"/>
	<stop  offset="0.67" style="stop-color:#C0272F"/>
	<stop  offset="0.82" style="stop-color:#B0242C"/>
	<stop  offset="0.96" style="stop-color:#9A1F28"/>
	<stop  offset="0.99" style="stop-color:#931D27"/>
</linearGradient>
<polygon class="st3" points="24,36.8 22,36.8 24,32.5 26,32.5 "/>
<linearGradient id="SVGID_4_" gradientUnits="userSpaceOnUse" x1="29.93" y1="5.075" x2="33.89" y2="5.075" gradientTransform="matrix(1 0 0 -1 0 39.73)">
	<stop  offset="0.25" style="stop-color:#CC2A31"/>
	<stop  offset="0.49" style="stop-color:#C92930"/>
	<stop  offset="0.67" style="stop-color:#C0272F"/>
	<stop  offset="0.82" style="stop-color:#B0242C"/>
	<stop  offset="0.96" style="stop-color:#9A1F28"/>
	<stop  offset="0.99" style="stop-color:#931D27"/>
</linearGradient>
<polygon class="st4" points="31.9,36.8 29.9,36.8 31.9,32.5 33.9,32.5 "/>
<linearGradient id="SVGID_5_" gradientUnits="userSpaceOnUse" x1="37.86" y1="5.075" x2="41.82" y2="5.075" gradientTransform="matrix(1 0 0 -1 0 39.73)">
	<stop  offset="0.25" style="stop-color:#CC2A31"/>
	<stop  offset="0.49" style="stop-color:#C92930"/>
	<stop  offset="0.67" style="stop-color:#C0272F"/>
	<stop  offset="0.82" style="stop-color:#B0242C"/>
	<stop  offset="0.96" style="stop-color:#9A1F28"/>
	<stop  offset="0.99" style="stop-color:#931D27"/>
</linearGradient>
<polygon class="st5" points="39.8,36.8 37.9,36.8 39.8,32.5 41.8,32.5 "/>
<linearGradient id="SVGID_6_" gradientUnits="userSpaceOnUse" x1="23.9903" y1="1.36" x2="23.9903" y2="39.34" gradientTransform="matrix(1 0 0 -1 0 39.73)">
	<stop  offset="0" style="stop-color:#2D5778"/>
	<stop  offset="1" style="stop-color:#1A97D4"/>
</linearGradient>
<path class="st6" d="M47.4,26.3C47.2,21.1,47,16.1,47.2,10c0-0.5-0.3-0.9-0.8-0.9c0,0,0,0-0.1,0c-0.5-0.1-0.9,0.3-1,0.8
	c0,0,0,0.1,0,0.1c-0.2,6.1,0,11.1,0.1,16.3c0.1,2,0.1,4.1,0.2,6.3h-1.9L42,36.4c-2,0-4-0.1-5.9-0.1l1.8-3.8h-2l-1.8,3.8
	c-2,0-4,0-6,0l1.8-3.8H28l-1.8,3.9h-3.9h-2.1l1.8-3.8h-2l-1.8,4h-6l1.9-4h-2l-1.9,4c-2,0-4,0-5.9,0l1.8-4h-2l-1.7,3.9H2.2V2.3
	c3.2,0.2,6.4,0.3,9.6,0.2c1.4,0,2.9,0,4.3,0c9.1,0,16.4,0,23,0h1.2c1.5,0,3.1,0,4.7-0.1c-0.3,0.5-0.5,0.9-0.8,1.4s-0.4,0.7-0.6,1.1
	C42.3,7,40.8,9.5,39.2,12l-0.7,1.1c-1.6,2.7-4.7,7.7-7.4,10.1c-0.8,0.7-1.6,1.2-2.5,1.7l-0.2,0.1c-1.3,0.7-2.7,1.1-4.2,1.1
	c-0.7,0-1.4-0.1-2.1-0.3c-0.7-0.2-1.3-0.5-1.9-0.8c-0.6-0.3-1.1-0.8-1.6-1.2c-0.5-0.5-0.9-1-1.3-1.6c-0.4-0.6-0.6-1.2-0.8-1.9
	c-0.4-1.4-0.4-2.8,0-4.2c0.2-0.7,0.5-1.3,0.8-1.9c0.4-0.6,0.8-1.1,1.3-1.6c0.5-0.5,1-0.9,1.6-1.2c0.6-0.3,1.3-0.6,1.9-0.8
	c0.7-0.2,1.4-0.3,2.1-0.3c1,0,2.1,0.2,3,0.6c0.9,0.4,1.7,1,2.3,1.7c0.6,0.7,1.1,1.6,1.4,2.5c0.3,1,0.4,2,0.3,3.1
	c0,0.5-0.2,0.9-0.4,1.3c-0.2,0.4-0.5,0.7-0.8,1c-0.3,0.3-0.7,0.5-1.1,0.6c-0.3,0.1-0.5,0.2-0.8,0.2v-2.3c0-0.4,0-0.8,0-1.1
	c0-0.3,0-0.5-0.1-0.8c0-0.2-0.1-0.4-0.2-0.6c-0.1-0.2-0.1-0.4-0.2-0.6c-0.2-0.4-0.4-0.8-0.7-1.1c-0.3-0.3-0.6-0.6-1-0.8
	c-0.7-0.4-1.6-0.7-2.5-0.7c-1.3,0-2.5,0.5-3.3,1.4c-0.9,0.9-1.4,2.2-1.3,3.5c0,0.4,0,0.8,0.1,1.2c0.3,1.2,1,2.2,2,2.9
	c0.2,0.1,0.4,0.2,0.6,0.3c0.2,0.1,0.4,0.2,0.6,0.2c0.6,0.2,1.3,0.2,2,0.2c0.2,0,0.4-0.1,0.6-0.1c0.4-0.1,0.8-0.3,1.2-0.5v0.5h2
	c0.2,0,0.3,0,0.5,0L29,23l0.4-0.1l0.2,0c0.5-0.1,0.9-0.4,1.3-0.6c0.4-0.3,0.8-0.6,1.1-1c0.3-0.4,0.6-0.9,0.9-1.4
	c0.2-0.5,0.4-1.1,0.5-1.6c0.3-1.7,0.1-3.4-0.7-5c-0.4-0.7-0.8-1.4-1.4-2c-0.6-0.6-1.2-1.1-1.9-1.6c-0.7-0.4-1.5-0.8-2.3-1
	c-2.6-0.7-5.4-0.3-7.7,1c-1.5,0.8-2.7,2.1-3.6,3.5c-0.4,0.7-0.8,1.5-1,2.3c-0.5,1.7-0.5,3.5,0,5.2c0.2,0.8,0.6,1.6,1,2.4
	c0.9,1.5,2.1,2.7,3.6,3.5c2.8,1.6,6.1,1.8,9.1,0.5c2.1-1,3.9-2.5,5.5-4.2c2.2-2.7,4.2-5.6,6-8.6l0.5-0.8c1.7-2.7,3.3-5.4,4.6-7.5
	c0.2-0.4,0.5-0.8,0.7-1.3c0.5-1,1.2-2,1.8-3c0.2-0.3,0.2-0.6,0-0.9c-0.2-0.3-0.5-0.5-0.8-0.5c-4.3,0.3-8.7,0.3-13,0.2h-4
	c-6.1,0-14.2,0-22.4-0.1H5.6c-1.4,0-2.9-0.1-4.3-0.2c-0.2,0-0.5,0-0.6,0.2C0.5,0.8,0.4,1,0.4,1.3v36c0,0.5,0.4,0.9,0.9,0.9
	c7,0.2,14.1,0.1,21,0c8-0.1,16.3-0.2,24.4,0.1l0,0c0.2,0,0.4-0.1,0.6-0.2c0.2-0.2,0.3-0.4,0.3-0.7C47.6,33.4,47.5,29.8,47.4,26.3z
	 M26,20.1l-0.4,0.3c-0.3,0.2-0.6,0.4-1,0.5c-0.3,0.1-0.7,0.2-1,0.2c-0.7,0-1.3-0.2-1.8-0.7c-0.5-0.5-0.8-1.3-0.7-2
	c0-0.7,0.2-1.4,0.7-1.9c0.9-1,2.5-1,3.5,0c0,0,0,0,0,0c0.5,0.6,0.7,1.3,0.7,2L26,20.1z M43.9,36.5l1.8-3.9c0,1.3,0,2.6,0.1,3.9
	L43.9,36.5z"/>
<polygon class="st7" points="8.1,32.5 6.2,36.8 6.5,36.8 8.1,33.3 9.8,33.3 10.1,32.5 "/>
<polygon class="st7" points="16.1,32.5 14.1,36.8 14.4,36.8 16.1,33.3 17.7,33.3 18,32.5 "/>
<polygon class="st7" points="24,32.5 22,36.8 22.4,36.8 24,33.3 25.6,33.3 26,32.5 "/>
<polygon class="st7" points="31.9,32.5 29.9,36.8 30.3,36.8 31.9,33.3 33.5,33.3 33.9,32.5 "/>
<polygon class="st7" points="41.5,33.3 41.8,32.5 39.8,32.5 37.9,36.8 38.2,36.8 39.8,33.3 "/>
<path class="st7" d="M21.9,21.2c0.5,0.5,1.1,0.8,1.8,0.7c0.3,0,0.7-0.1,1-0.2c0.4-0.1,0.7-0.3,1-0.5l0.3-0.3v-0.8l-0.4,0.3
	c-0.3,0.2-0.6,0.4-1,0.5c-0.3,0.1-0.7,0.2-1,0.2c-0.7,0-1.3-0.2-1.8-0.7c-0.4-0.4-0.6-1-0.7-1.6c0,0.1,0,0.3,0,0.4
	C21.1,19.9,21.4,20.6,21.9,21.2z"/>
<path class="st7" d="M43.9,37.3l1.9,0.1c0-0.3,0-0.5,0-0.8h-1.5L43.9,37.3z"/>
<path class="st7" d="M4.2,32.5l-1.8,3.9H2.2v0.8h0.2l1.8-3.9h1.6l0.4-0.8H4.2z"/>
<path class="st7" d="M12.1,32.5l-1.9,4c-1.9,0-3.7,0-5.6,0l-0.4,0.8c2,0,4,0,5.9,0l1.9-4h1.6l0.4-0.8H12.1z"/>
<path class="st7" d="M15.6,14c0.9-1.5,2.1-2.7,3.6-3.5c2.3-1.3,5.1-1.7,7.7-1c0.8,0.2,1.6,0.6,2.3,1c0.7,0.4,1.4,0.9,1.9,1.5
	c0.6,0.6,1,1.3,1.4,2c0.4,0.7,0.6,1.5,0.7,2.4c0,0.2,0.1,0.5,0.1,0.8c0-0.5,0-1-0.1-1.5c-0.1-0.8-0.4-1.6-0.7-2.4
	c-0.4-0.7-0.8-1.4-1.4-2c-0.6-0.6-1.2-1.1-1.9-1.6c-0.7-0.4-1.5-0.8-2.3-1c-2.6-0.7-5.4-0.3-7.7,1c-1.5,0.8-2.7,2.1-3.6,3.5
	c-0.4,0.7-0.8,1.5-1,2.3c-0.2,0.9-0.4,1.7-0.4,2.6c0,0.1,0,0.3,0,0.4c0-0.8,0.1-1.5,0.4-2.2C14.8,15.5,15.1,14.7,15.6,14z"/>
<path class="st7" d="M23.6,14.4c0.9,0,1.7,0.2,2.5,0.7c0.4,0.2,0.7,0.5,1,0.8c0.3,0.3,0.5,0.7,0.7,1.1c0.1,0.2,0.2,0.4,0.2,0.6
	c0.1,0.2,0.1,0.4,0.2,0.6c0,0.3,0.1,0.5,0.1,0.8c0,0.3,0,0.6,0,1.1v-0.8c0-0.4,0-0.8,0-1.1c0-0.3,0-0.5-0.1-0.8
	c0-0.2-0.1-0.4-0.2-0.6c-0.1-0.2-0.1-0.4-0.2-0.6c-0.2-0.4-0.5-0.8-0.8-1.1c-0.3-0.3-0.6-0.6-1-0.8c-0.7-0.4-1.6-0.7-2.5-0.7
	c-1.3,0-2.5,0.5-3.3,1.4c-0.9,0.9-1.4,2.2-1.3,3.5c0,0.2,0,0.3,0,0.5c0-1.2,0.5-2.3,1.3-3.2C21.1,14.8,22.3,14.3,23.6,14.4z"/>
<path class="st7" d="M43.6,4.7c-1.2,2.2-2.7,4.7-4.3,7.2l-0.7,1.1c-1.6,2.7-4.7,7.7-7.4,10.1c-0.8,0.7-1.6,1.2-2.5,1.7L28.4,25
	c-1.3,0.7-2.7,1.1-4.2,1.1c-0.7,0-1.4-0.1-2.1-0.3c-0.7-0.2-1.3-0.5-1.9-0.8c-0.6-0.3-1.1-0.8-1.6-1.2c-0.5-0.5-0.9-1-1.3-1.6
	c-0.4-0.6-0.6-1.2-0.8-1.9c-0.2-0.6-0.2-1.1-0.3-1.7c0,0.1,0,0.3,0,0.4c0,0.7,0.1,1.4,0.3,2.1c0.2,0.7,0.4,1.3,0.8,2
	c0.4,0.6,0.8,1.1,1.3,1.6c0.5,0.5,1,0.9,1.6,1.2c0.6,0.3,1.3,0.6,1.9,0.8c0.7,0.2,1.4,0.3,2.1,0.3c1.5,0,2.9-0.3,4.2-1.1l0.2-0.1
	c0.9-0.5,1.7-1.1,2.5-1.7c2.7-2.4,5.8-7.4,7.4-10.1l0.7-1.1c1.6-2.5,3.1-5,4.3-7.2c0.2-0.3,0.4-0.7,0.6-1.1s0.5-0.9,0.8-1.4h-0.4
	l-0.3,0.6C44,4,43.8,4.4,43.6,4.7z"/>
<path class="st7" d="M30.9,19.5c-0.2,0.4-0.5,0.7-0.8,1c-0.3,0.3-0.7,0.5-1.1,0.6c-0.3,0.1-0.5,0.2-0.8,0.2v0.8
	c0.3-0.1,0.6-0.1,0.8-0.2c0.4-0.2,0.7-0.4,1.1-0.6c0.3-0.3,0.6-0.6,0.8-1c0.2-0.4,0.3-0.8,0.4-1.3c0-0.4,0-0.8,0-1.1
	c0,0.1,0,0.2,0,0.3C31.3,18.6,31.2,19.1,30.9,19.5z"/>
<path class="st7" d="M1.3,1.2c1.4,0.1,2.9,0.2,4.3,0.1h1.6c8.2,0.1,16.3,0.1,22.4,0.1h4c4.3,0,8.7,0,13-0.2c0.4,0,0.7,0.2,0.8,0.5
	l0,0c0.1-0.2,0.1-0.6,0-0.8c-0.2-0.3-0.5-0.5-0.8-0.5c-4.3,0.3-8.7,0.3-13,0.2h-4c-6.1,0-14.2,0-22.4-0.1H5.6c-1.4,0-2.9,0-4.3-0.1
	c-0.2,0-0.5,0-0.6,0.2C0.5,0.8,0.4,1,0.4,1.3v0.8c0-0.3,0.1-0.5,0.3-0.7C0.9,1.2,1.1,1.2,1.3,1.2z"/>
<path class="st7" d="M28,32.5l-1.8,3.9h-3.9h-1.7l-0.4,0.8h2.1h3.9l1.8-3.9h1.6l0.4-0.8L28,32.5z"/>
<path class="st7" d="M35.9,32.5l-1.8,3.8h-5.6l-0.4,0.8c2,0,4,0,6,0l1.8-3.8h1.6l0.4-0.8L35.9,32.5z"/>
<path class="st7" d="M46.4,9.1c-0.5-0.1-0.9,0.3-1,0.8c0,0,0,0.1,0,0.1c-0.1,2.4-0.1,4.6-0.1,6.6c0-1.9,0-3.8,0.1-5.9
	c0-0.5,0.4-0.9,0.9-0.9c0,0,0.1,0,0.1,0c0.4,0,0.8,0.3,0.8,0.8c0-0.2,0-0.4,0-0.7C47.2,9.5,46.9,9.1,46.4,9.1
	C46.4,9.1,46.4,9.1,46.4,9.1z"/>
<path class="st7" d="M42,36.4c-1.8,0-3.7-0.1-5.5-0.1l-0.4,0.8c2,0,4,0,5.9,0.1l1.8-3.9h1.6l0.3-0.7v-0.1h-2L42,36.4z"/>
<linearGradient id="SVGID_7_" gradientUnits="userSpaceOnUse" x1="47.37" y1="2.22" x2="47.37" y2="23.13" gradientTransform="matrix(1 0 0 -1 0 39.73)">
	<stop  offset="0" style="stop-color:#2D5778"/>
	<stop  offset="1" style="stop-color:#1A97D4"/>
</linearGradient>
<path class="st8" d="M47.4,26.3c-0.1-3.2-0.2-6.4-0.2-9.7c0,3.6,0.1,7,0.2,10.5c0.1,3.3,0.2,6.6,0.2,10.4l0,0
	C47.6,33.4,47.5,29.8,47.4,26.3z"/>
<path class="st7" d="M20,32.5l-1.8,4h-5.6l-0.4,0.8h6l1.8-4h1.6l0.4-0.8L20,32.5z"/>
<linearGradient id="SVGID_8_" gradientUnits="userSpaceOnUse" x1="45.51" y1="7.21" x2="45.51" y2="23.16" gradientTransform="matrix(1 0 0 -1 0 39.73)">
	<stop  offset="0" style="stop-color:#2D5778"/>
	<stop  offset="1" style="stop-color:#1A97D4"/>
</linearGradient>
<path class="st9" d="M45.5,27c0.1,1.8,0.1,3.6,0.2,5.5l0,0c0-2.2-0.1-4.3-0.2-6.3c-0.1-3.2-0.2-6.3-0.2-9.6
	C45.3,20.2,45.4,23.6,45.5,27z"/>
<path class="st10" d="M32.8,19.9c-0.2,0.5-0.5,0.9-0.9,1.4c-0.3,0.4-0.7,0.7-1.1,1c-0.4,0.3-0.8,0.5-1.3,0.6l-0.2,0L28.9,23
	l-0.5,0.1c-0.2,0-0.3,0-0.5,0h-2v-0.5c-0.4,0.2-0.8,0.4-1.2,0.5c-0.2,0-0.4,0.1-0.6,0.1c-0.7,0.1-1.4,0-2-0.2
	c-0.2-0.1-0.4-0.2-0.6-0.2c-0.2-0.1-0.4-0.2-0.6-0.3c-1-0.7-1.7-1.7-2-2.9c-0.1-0.2-0.1-0.5-0.1-0.7c0,0.1,0,0.2,0,0.3
	c0,0.4,0.1,0.8,0.1,1.2c0.3,1.2,1,2.2,2,2.9c0.2,0.1,0.4,0.2,0.6,0.3c0.2,0.1,0.4,0.2,0.6,0.2c0.6,0.2,1.3,0.2,2,0.2
	c0.2,0,0.4-0.1,0.6-0.1c0.4-0.1,0.8-0.3,1.2-0.5v0.5h2c0.2,0,0.3,0,0.5,0l0.5-0.1l0.4-0.1l0.2,0c0.4-0.2,0.9-0.4,1.2-0.7
	c0.4-0.3,0.8-0.6,1.1-1c0.3-0.4,0.6-0.9,0.9-1.4c0.2-0.5,0.4-1.1,0.5-1.6c0.1-0.6,0.1-1.2,0.1-1.9c0,0.4-0.1,0.7-0.1,1.1
	C33.2,18.8,33,19.4,32.8,19.9z"/>
<linearGradient id="SVGID_9_" gradientUnits="userSpaceOnUse" x1="47.1791" y1="23.14" x2="47.1791" y2="29.11" gradientTransform="matrix(1 0 0 -1 0 39.73)">
	<stop  offset="0" style="stop-color:#2D5778"/>
	<stop  offset="1" style="stop-color:#1A97D4"/>
</linearGradient>
<path class="st11" d="M47.2,10.6c-0.1,2.1-0.1,4.1-0.1,6c0-1.9,0-3.8,0.1-5.9C47.2,10.7,47.2,10.7,47.2,10.6z"/>
<path class="st10" d="M45.6,4.8c-0.2,0.4-0.5,0.8-0.7,1.3c-1.2,2.1-2.8,4.8-4.6,7.5l-0.5,0.8c-1.8,3-3.8,5.9-6,8.6
	c-1.5,1.8-3.4,3.2-5.5,4.3c-2.9,1.3-6.3,1.1-9.1-0.5c-1.5-0.8-2.7-2.1-3.6-3.5c-0.4-0.7-0.8-1.5-1-2.4c-0.2-0.7-0.3-1.5-0.4-2.2
	c0,0.1,0,0.3,0,0.4c0,0.9,0.1,1.8,0.4,2.6c0.2,0.8,0.6,1.6,1,2.4c0.9,1.5,2.1,2.7,3.6,3.5c2.8,1.6,6.1,1.8,9.1,0.5
	c2.1-1,4-2.5,5.5-4.3c2.2-2.7,4.2-5.6,6-8.6l0.5-0.8c1.7-2.7,3.3-5.4,4.6-7.5c0.2-0.4,0.5-0.8,0.7-1.3c0.5-1,1.2-2,1.8-3
	c0.2-0.3,0.2-0.6,0.1-0.9c0,0,0,0.1-0.1,0.1C46.7,2.8,46.1,3.8,45.6,4.8z"/>
<path class="st10" d="M17.3,15c0.4-0.6,0.8-1.1,1.3-1.6c0.5-0.5,1-0.9,1.6-1.2c0.6-0.3,1.3-0.6,1.9-0.8c0.7-0.2,1.4-0.3,2.1-0.3
	c1,0,2.1,0.2,3,0.6c0.9,0.4,1.7,1,2.3,1.7c0.6,0.7,1.1,1.6,1.4,2.5c0.2,0.6,0.3,1.3,0.3,1.9c0.1-0.9,0-1.9-0.3-2.7
	c-0.3-0.9-0.8-1.8-1.4-2.5c-0.6-0.7-1.4-1.3-2.3-1.7c-0.9-0.4-2-0.6-3-0.6c-0.7,0-1.4,0.1-2.1,0.3c-0.7,0.2-1.3,0.5-1.9,0.8
	c-0.6,0.3-1.1,0.8-1.6,1.2c-0.5,0.5-0.9,1-1.3,1.6c-0.4,0.6-0.6,1.2-0.8,1.9c-0.2,0.7-0.3,1.4-0.3,2.1c0,0.1,0,0.3,0,0.4
	c0-0.6,0.1-1.2,0.3-1.7C16.7,16.2,16.9,15.6,17.3,15z"/>
<path class="st10" d="M40.2,2.4h-1.2c-6.7,0.1-14,0.1-23,0c-1.4,0-2.9,0-4.3,0C8.6,2.5,5.4,2.4,2.2,2.2V3c3.2,0.2,6.4,0.3,9.6,0.2
	c1.4,0,2.9,0,4.3,0c9.1,0,16.4,0,23,0h1.2c1.4,0,2.8,0,4.2-0.1c0.2-0.3,0.3-0.5,0.5-0.8C43.4,2.3,41.8,2.4,40.2,2.4z"/>
<path class="st10" d="M47.3,38.1c-0.2,0.2-0.4,0.2-0.6,0.2l0,0c-8.1-0.3-16.4-0.2-24.4-0.1c-6.9,0.1-14,0.2-21,0
	c-0.5,0-0.9-0.4-0.9-0.9v0.8c0,0.5,0.4,0.9,0.9,0.9c7,0.2,14.1,0.1,21,0c8-0.1,16.3-0.2,24.4,0.1l0,0c0.2,0,0.4-0.1,0.6-0.2
	c0.2-0.2,0.3-0.4,0.3-0.7c0-0.3,0-0.5,0-0.8C47.6,37.7,47.5,38,47.3,38.1z"/>
<path class="st10" d="M23.6,16.6c0.7,0,1.3,0.2,1.7,0.7c0.5,0.6,0.7,1.3,0.7,2v-0.8c0-0.7-0.2-1.4-0.7-2c-0.9-1-2.5-1-3.5,0
	c0,0,0,0,0,0c-0.5,0.5-0.7,1.2-0.7,1.9c0,0.1,0,0.3,0,0.4c0-0.6,0.3-1.1,0.7-1.5C22.3,16.8,22.9,16.5,23.6,16.6z"/>
</svg>
