<?xml version="1.0" encoding="utf-8"?>
<!-- Generator: Adobe Illustrator 21.0.0, SVG Export Plug-In . SVG Version: 6.00 Build 0)  -->
<svg version="1.1" id="katman_1" xmlns="http://www.w3.org/2000/svg" xmlns:xlink="http://www.w3.org/1999/xlink" x="0px" y="0px"
	 viewBox="0 0 12.3 16" style="enable-background:new 0 0 12.3 16;" xml:space="preserve">
<style type="text/css">
	.st0{opacity:0.7;fill:#333333;enable-background:new    ;}
	.st1{opacity:0.1;fill:#010101;enable-background:new    ;}
	.st2{fill:url(#SVGID_1_);}
	.st3{fill:url(#SVGID_2_);}
	.st4{fill:url(#SVGID_3_);}
	.st5{opacity:0.1;fill:#FFFFFF;enable-background:new    ;}
	.st6{fill:url(#SVGID_4_);}
	.st7{fill:url(#SVGID_5_);}
	.st8{fill:url(#SVGID_6_);}
	.st9{fill:url(#SVGID_7_);}
	.st10{fill:url(#SVGID_8_);}
</style>
<title>preferences-desktop-pripherals_5</title>
<path class="st0" d="M5.4,15.6c-1.1-0.1-2.1-0.5-2.8-1.2c-0.5-0.5-0.7-1.1-0.7-1.8c0-0.4-0.1-0.7-0.2-1.1c-0.1-0.4-0.3-0.9-0.6-1.2
	C0.9,9.8,0.7,9.4,0.5,8.9C0.3,8.1,0.2,7.2,0.3,6.4c0.2-0.8,0.5-1.5,1.1-2.1c0.4-0.4,0.9-0.7,1.4-0.8c0-0.1,0-0.3,0-0.4
	C2.7,2.3,2.8,1.6,3,1c0.3-0.5,0.7-0.8,1.3-0.8C4.8,0.1,5.4,0,5.9,0c0.6,0,1.2,0.1,1.8,0.3C11,2,12.3,3.9,12.3,7
	c0,3.2-1.6,6.1-4.3,7.7l-0.3,0.2C7,15.4,6.2,15.7,5.4,15.6z"/>
<path class="st0" d="M2.2,8.9L2,8.9C0.8,8.7,0,7.7,0,6.5c0-0.9,0.6-1.7,1.4-2c0.2-0.1,0.5-0.1,0.7-0.1c0.2,0,0.5,0.1,0.7,0.2
	C3.2,5,3.2,5.8,3.2,6.5v0.1c0,0.6,0,1.2-0.2,1.7C2.9,8.7,2.6,8.9,2.2,8.9z"/>
<path class="st1" d="M7.9,14.6c-0.7,0.6-1.6,0.9-2.5,0.9c-1-0.1-2-0.5-2.8-1.2c-0.9-0.9-0.5-1.7-0.8-2.8C1.6,10.6,1,9.9,0.6,8.9
	C0.5,8.4,0.4,7.8,0.4,7.3c0,0.7,0.1,1.4,0.3,2.1C1,10.4,1.6,11,1.9,12c0.3,1.1-0.1,1.9,0.8,2.8c0.8,0.7,1.7,1.1,2.8,1.2
	c0.9,0,1.8-0.3,2.5-0.9c2.7-1.6,4.3-4.5,4.3-7.6c0-0.1,0-0.2,0-0.2C12.1,10.2,10.5,13,7.9,14.6z"/>
<radialGradient id="SVGID_1_" cx="26.2709" cy="-3.0109" r="7.78" gradientTransform="matrix(0.88 0 0 -0.88 -16.87 5.1424)" gradientUnits="userSpaceOnUse">
	<stop  offset="0" style="stop-color:#F7F7F7"/>
	<stop  offset="0.3" style="stop-color:#F3F3F3"/>
	<stop  offset="0.61" style="stop-color:#E7E7E7"/>
	<stop  offset="0.92" style="stop-color:#D3D3D3"/>
	<stop  offset="1" style="stop-color:#CCCCCC"/>
</radialGradient>
<path class="st2" d="M12.2,7c0,3.1-1.6,6-4.3,7.6c-0.7,0.6-1.6,0.9-2.5,0.9c-1-0.1-2-0.5-2.8-1.2c-0.9-0.9-0.5-1.7-0.8-2.8
	C1.6,10.6,1,9.9,0.6,8.9C0.4,8.1,0.3,7.2,0.4,6.4c0.2-0.8,0.5-1.4,1-2c0.4-0.4,0.9-0.7,1.4-0.8C2.8,2.7,2.9,1.8,3.2,1
	c0.2-0.4,0.7-0.7,1.1-0.7C5.4,0,6.6,0.1,7.7,0.5C11,2.1,12.2,4,12.2,7z"/>
<path class="st0" d="M5,7.1c-0.7,0-1.4-0.6-1.4-1.3c0,0,0,0,0-0.1V0.4h0.1c0.2-0.1,0.4-0.2,0.6-0.2C4.8,0.1,5.4,0,5.9,0
	c0.6,0,1.2,0.1,1.8,0.3C8.4,0.7,9,1,9.6,1.4l0,0v3.3c0,1.3-1,2.4-2.3,2.4H5z"/>
<linearGradient id="SVGID_2_" gradientUnits="userSpaceOnUse" x1="3.73" y1="12.1969" x2="9.48" y2="12.1969" gradientTransform="matrix(1 0 0 -1 0 15.73)">
	<stop  offset="0" style="stop-color:#CCCCCC"/>
	<stop  offset="1" style="stop-color:#F7F7F7"/>
</linearGradient>
<path class="st3" d="M7.7,0.5C6.6,0.1,5.4,0,4.3,0.3c-0.2,0-0.4,0.1-0.6,0.2v5.2c0,0.7,0.5,1.2,1.2,1.2c0,0,0,0,0.1,0h2.2
	c1.2,0,2.3-1,2.3-2.3l0,0V1.5C8.9,1.1,8.3,0.8,7.7,0.5z"/>
<path class="st0" d="M2.2,8.8L2,8.8C0.9,8.6,0.1,7.6,0.1,6.5c0-0.9,0.5-1.6,1.4-1.9c0.2-0.1,0.4-0.1,0.6-0.1c0.2,0,0.4,0,0.6,0.2
	C3.1,5,3.1,5.9,3.1,6.5v0.1c0,0.6,0,1.2-0.2,1.7C2.8,8.6,2.6,8.8,2.2,8.8z"/>
<path class="st0" d="M6.6,4.1c-0.3,0-0.5-0.2-0.5-0.5v0V2.2c0-0.3,0.3-0.5,0.6-0.5c0.2,0,0.4,0.2,0.5,0.5v1.4
	C7.1,3.9,6.9,4.1,6.6,4.1z"/>
<linearGradient id="SVGID_3_" gradientUnits="userSpaceOnUse" x1="6.2" y1="12.805" x2="7.01" y2="12.805" gradientTransform="matrix(1 0 0 -1 0 15.73)">
	<stop  offset="0" style="stop-color:#DD922E"/>
	<stop  offset="0.71" style="stop-color:#F9AE42"/>
	<stop  offset="1" style="stop-color:#F8DB6E"/>
</linearGradient>
<path class="st4" d="M6.6,1.8L6.6,1.8C6.8,1.8,7,2,7,2.2v1.4C7,3.8,6.8,4,6.6,4h0C6.4,4,6.2,3.8,6.2,3.6V2.2C6.2,2,6.4,1.8,6.6,1.8z
	"/>
<path class="st0" d="M6.6,7.4c-0.3,0-0.5-0.2-0.5-0.5v0V5c0-0.3,0.2-0.5,0.5-0.5S7.1,4.7,7.1,5v1.9C7.1,7.2,6.9,7.4,6.6,7.4z"/>
<path class="st5" d="M1.5,4.8C1.8,4.4,2.3,4.1,2.9,4c0-0.2,0-0.3,0-0.5C2.3,3.6,1.8,3.9,1.5,4.3c-0.5,0.6-0.9,1.2-1,2
	c0,0.3,0,0.6,0,0.9c0-0.1,0-0.3,0-0.4C0.6,6.1,0.9,5.4,1.5,4.8z"/>
<linearGradient id="SVGID_4_" gradientUnits="userSpaceOnUse" x1="2.9" y1="12.53" x2="2.91" y2="12.53" gradientTransform="matrix(1 0 0 -1 0 15.73)">
	<stop  offset="0" style="stop-color:#CCCCCC"/>
	<stop  offset="1" style="stop-color:#F7F7F7"/>
</linearGradient>
<path class="st6" d="M2.9,2.9c0,0.2,0,0.5,0,0.7l0,0C2.9,3.3,2.9,3.1,2.9,2.9z"/>
<linearGradient id="SVGID_5_" gradientUnits="userSpaceOnUse" x1="6.2" y1="9.755" x2="7.01" y2="9.755" gradientTransform="matrix(1 0 0 -1 0 15.73)">
	<stop  offset="0" style="stop-color:#CCCCCC"/>
	<stop  offset="1" style="stop-color:#F7F7F7"/>
</linearGradient>
<path class="st7" d="M6.6,4.6L6.6,4.6C6.8,4.6,7,4.8,7,5v1.9c0,0.2-0.2,0.4-0.4,0.4h0c-0.2,0-0.4-0.2-0.4-0.4V5
	C6.2,4.8,6.4,4.6,6.6,4.6z"/>
<linearGradient id="SVGID_6_" gradientUnits="userSpaceOnUse" x1="6.35" y1="10.38" x2="6.85" y2="10.38" gradientTransform="matrix(1 0 0 -1 0 15.73)">
	<stop  offset="0" style="stop-color:#DD922E"/>
	<stop  offset="0.71" style="stop-color:#F9AE42"/>
	<stop  offset="1" style="stop-color:#F8DB6E"/>
</linearGradient>
<path class="st8" d="M6.6,4.8L6.6,4.8c0.1,0,0.2,0.1,0.2,0.2v0.6c0,0.1-0.1,0.2-0.2,0.2l0,0c-0.1,0-0.2-0.1-0.2-0.2V5.1
	C6.3,4.9,6.5,4.8,6.6,4.8z"/>
<linearGradient id="SVGID_7_" gradientUnits="userSpaceOnUse" x1="6.35" y1="9.13" x2="6.85" y2="9.13" gradientTransform="matrix(1 0 0 -1 0 15.73)">
	<stop  offset="0" style="stop-color:#DD922E"/>
	<stop  offset="0.71" style="stop-color:#F9AE42"/>
	<stop  offset="1" style="stop-color:#F8DB6E"/>
</linearGradient>
<path class="st9" d="M6.6,6.1L6.6,6.1c0.1,0,0.2,0.1,0.2,0.2v0.6c0,0.1-0.1,0.2-0.2,0.2l0,0C6.5,7.1,6.3,7,6.3,6.9V6.3
	C6.3,6.2,6.5,6.1,6.6,6.1z"/>
<path class="st5" d="M4.3,0.8c1.1-0.3,2.3-0.2,3.4,0.2c3.2,1.6,4.4,3.4,4.5,6.3c0-0.1,0-0.2,0-0.2c0-3-1.2-4.9-4.5-6.5
	C6.6,0.1,5.4,0,4.3,0.3C3.8,0.3,3.4,0.6,3.2,1C2.9,1.6,2.8,2.2,2.9,2.9c0-0.5,0.1-0.9,0.3-1.3C3.4,1.1,3.8,0.8,4.3,0.8z"/>
<radialGradient id="SVGID_8_" cx="21.0009" cy="27.6281" r="1.96" gradientTransform="matrix(0.88 0 0 -1.49 -16.87 47.7977)" gradientUnits="userSpaceOnUse">
	<stop  offset="0" style="stop-color:#F7F7F7"/>
	<stop  offset="0.3" style="stop-color:#F3F3F3"/>
	<stop  offset="0.61" style="stop-color:#E7E7E7"/>
	<stop  offset="0.92" style="stop-color:#D3D3D3"/>
	<stop  offset="1" style="stop-color:#CCCCCC"/>
</radialGradient>
<path class="st10" d="M3,6.5c0,0.6,0,1.1-0.2,1.7C2.7,8.6,2.4,8.7,2,8.6c0,0,0,0,0,0C1,8.5,0.3,7.6,0.2,6.5c0-0.8,0.5-1.5,1.3-1.8
	c0.4-0.2,0.8-0.2,1.1,0C3,5.1,3,6,3,6.5z"/>
<path class="st5" d="M1.5,5.2c0.4-0.2,0.8-0.2,1.1,0c0.3,0.5,0.4,1,0.3,1.5c0-0.1,0-0.2,0-0.2C3,6,3,5.1,2.7,4.8
	c-0.4-0.2-0.8-0.2-1.1,0C0.8,5,0.2,5.7,0.2,6.5c0,0.1,0,0.2,0,0.2C0.3,6,0.8,5.4,1.5,5.2z"/>
</svg>
