<?xml version="1.0" encoding="utf-8"?>
<!-- Generator: Adobe Illustrator 21.0.0, SVG Export Plug-In . SVG Version: 6.00 Build 0)  -->
<svg version="1.1" id="katman_1" xmlns="http://www.w3.org/2000/svg" xmlns:xlink="http://www.w3.org/1999/xlink" x="0px" y="0px"
	 viewBox="0 0 15.6 16" style="enable-background:new 0 0 15.6 16;" xml:space="preserve">
<style type="text/css">
	.st0{fill:#333333;}
	.st1{fill:url(#SVGID_1_);}
	.st2{opacity:0.2;fill:#FFFFFF;enable-background:new    ;}
	.st3{opacity:0.2;enable-background:new    ;}
	.st4{opacity:0.5;enable-background:new    ;}
	.st5{fill:url(#SVGID_2_);}
	.st6{fill:url(#SVGID_3_);}
	.st7{opacity:0.65;enable-background:new    ;}
</style>
<title>avatar-default_5</title>
<circle class="st0" cx="7.8" cy="7.8" r="7.8"/>
<linearGradient id="SVGID_1_" gradientUnits="userSpaceOnUse" x1="7.77" y1="0.43" x2="7.77" y2="15.88" gradientTransform="matrix(1 0 0 -1 0 15.73)">
	<stop  offset="0" style="stop-color:#DD922E"/>
	<stop  offset="6.000000e-02" style="stop-color:#F9AE42"/>
	<stop  offset="0.42" style="stop-color:#F8DB6E"/>
	<stop  offset="1" style="stop-color:#FDDEB1"/>
</linearGradient>
<circle class="st1" cx="7.8" cy="7.8" r="7.7"/>
<path class="st2" d="M7.8,0.6c4.2,0,7.7,3.4,7.7,7.7c0-0.1,0-0.3,0-0.5C15.5,3.5,12,0,7.7,0S0,3.5,0,7.8l0,0
	C0.3,3.7,3.7,0.5,7.8,0.6z"/>
<path class="st3" d="M7.8,15.5C3.5,15.5,0,12.1,0,7.8c0,0,0,0,0,0C0,8,0,8.1,0,8.3C0,12.6,3.5,16,7.7,16s7.7-3.5,7.7-7.7l0,0
	C15.2,12.3,11.8,15.5,7.8,15.5z"/>
<circle class="st4" cx="7.6" cy="4.4" r="3"/>
<radialGradient id="SVGID_2_" cx="7.63" cy="11.3" r="3.92" gradientTransform="matrix(1 0 0 -1 0 15.73)" gradientUnits="userSpaceOnUse">
	<stop  offset="0" style="stop-color:#E7E6E6"/>
	<stop  offset="0.26" style="stop-color:#E3E3E3"/>
	<stop  offset="0.49" style="stop-color:#D9D8D8"/>
	<stop  offset="0.72" style="stop-color:#C6C6C6"/>
	<stop  offset="0.93" style="stop-color:#ADAEAE"/>
	<stop  offset="1" style="stop-color:#A3A4A4"/>
</radialGradient>
<circle class="st5" cx="7.6" cy="4.4" r="2.9"/>
<path class="st4" d="M7.8,15.6c-2.6,0-5-1.3-6.4-3.4l0,0l0,0c1.1-3.5,4.8-5.4,8.3-4.3c2.1,0.7,3.7,2.4,4.3,4.5l0,0l0,0
	C12.5,14.4,10.2,15.6,7.8,15.6z"/>
<radialGradient id="SVGID_3_" cx="8.03" cy="6.16" r="6.61" gradientTransform="matrix(1 0 0 -1 0 15.73)" gradientUnits="userSpaceOnUse">
	<stop  offset="0" style="stop-color:#E7E6E6"/>
	<stop  offset="0.26" style="stop-color:#E3E3E3"/>
	<stop  offset="0.49" style="stop-color:#D9D8D8"/>
	<stop  offset="0.72" style="stop-color:#C6C6C6"/>
	<stop  offset="0.93" style="stop-color:#ADAEAE"/>
	<stop  offset="1" style="stop-color:#A3A4A4"/>
</radialGradient>
<path class="st6" d="M7.6,7.6L7.6,7.6c-2.8,0-5.3,1.8-6.2,4.5c2.4,3.5,7.2,4.4,10.7,2c0.7-0.5,1.3-1,1.8-1.7
	C13.1,9.6,10.6,7.6,7.6,7.6z"/>
<ellipse transform="matrix(0.4465 -0.8948 0.8948 0.4465 -8.0756 14.4737)" class="st7" cx="7.7" cy="13.8" rx="0.8" ry="0.8"/>
<ellipse transform="matrix(0.1551 -0.9879 0.9879 0.1551 -5.0156 17.2876)" class="st7" cx="7.6" cy="11.6" rx="0.9" ry="0.4"/>
<ellipse transform="matrix(0.4465 -0.8948 0.8948 0.4465 -8.0729 12.7135)" class="st7" cx="6.2" cy="12.9" rx="0.4" ry="0.5"/>
</svg>
