<?xml version="1.0" encoding="utf-8"?>
<!-- Generator: Adobe Illustrator 21.0.0, SVG Export Plug-In . SVG Version: 6.00 Build 0)  -->
<svg version="1.1" id="katman_1" xmlns="http://www.w3.org/2000/svg" xmlns:xlink="http://www.w3.org/1999/xlink" x="0px" y="0px"
	 viewBox="0 0 15.5 16" style="enable-background:new 0 0 15.5 16;" xml:space="preserve">
<style type="text/css">
	.st0{fill:url(#SVGID_1_);}
	.st1{opacity:0.1;fill:#FFFFFF;enable-background:new    ;}
	.st2{opacity:0.2;enable-background:new    ;}
	.st3{fill:#FFFFFF;}
</style>
<title>system-shutdown_5</title>
<radialGradient id="SVGID_1_" cx="75.122" cy="190.8227" r="10.9101" gradientTransform="matrix(0.82 0 0 0.82 -53.85 -148.7246)" gradientUnits="userSpaceOnUse">
	<stop  offset="0.25" style="stop-color:#CC2A31"/>
	<stop  offset="0.5" style="stop-color:#C92930"/>
	<stop  offset="0.67" style="stop-color:#C0272F"/>
	<stop  offset="0.82" style="stop-color:#B0242C"/>
	<stop  offset="0.96" style="stop-color:#9A1F28"/>
	<stop  offset="1" style="stop-color:#931D27"/>
</radialGradient>
<path class="st0" d="M7.8,0L7.8,0c4.3,0,7.8,3.5,7.8,7.8l0,0c0,4.3-3.5,7.8-7.8,7.8l0,0C3.5,15.5,0,12,0,7.7l0,0C0,3.5,3.5,0,7.8,0z
	"/>
<path class="st1" d="M15.5,7.7C15.5,3.5,12,0,7.8,0l0,0C3.5,0,0,3.5,0,7.7l0,0C0,7.8,0,7.9,0,8c0.1-4.2,3.6-7.5,7.8-7.5l0,0
	c4.2,0,7.6,3.3,7.8,7.5C15.5,7.9,15.5,7.8,15.5,7.7z"/>
<path class="st2" d="M7.8,15.5L7.8,15.5C3.6,15.5,0.1,12.2,0,8c0,0.1,0,0.2,0,0.2l0,0C0,12.5,3.5,16,7.8,16l0,0
	c4.3,0,7.8-3.5,7.8-7.8l0,0c0-0.1,0-0.2,0-0.2C15.4,12.2,11.9,15.5,7.8,15.5z"/>
<path class="st2" d="M7.8,9.6C6.8,9.6,6,8.9,5.9,8c-0.2,1,0.6,2,1.6,2.1c1,0.2,2-0.6,2.1-1.6c0-0.2,0-0.4,0-0.5
	C9.5,8.9,8.7,9.6,7.8,9.6z"/>
<path class="st1" d="M8.1,1.8H7.3C7.2,1.8,7.1,1.9,7.1,2v0.5c0-0.1,0.1-0.2,0.2-0.2h0.8c0.1,0,0.2,0.1,0.2,0.2V2
	C8.4,1.9,8.3,1.8,8.1,1.8z"/>
<path class="st2" d="M8.1,6.7H7.3c-0.1,0-0.2-0.1-0.2-0.2V7c0,0.1,0.1,0.2,0.2,0.2h0.8c0.1,0,0.2-0.1,0.2-0.2V6.4
	C8.4,6.6,8.3,6.7,8.1,6.7C8.2,6.7,8.2,6.7,8.1,6.7z"/>
<path class="st1" d="M6.6,3.1V2.6C4.2,3.1,2.5,5.2,2.5,7.7c0,0.1,0,0.2,0,0.2C2.6,5.6,4.3,3.6,6.6,3.1z"/>
<path class="st1" d="M7.8,11.6C5.7,11.6,4,10,3.9,7.9c0,0.1,0,0.2,0,0.3C4,10.4,5.9,12,8,11.9c2-0.1,3.6-1.7,3.7-3.7
	c0-0.1,0-0.2,0-0.3C11.6,10,9.8,11.6,7.8,11.6z"/>
<path class="st1" d="M8.9,2.6v0.5c2.3,0.5,4,2.5,4.1,4.8c0-0.1,0-0.2,0-0.2C13,5.2,11.3,3.1,8.9,2.6z"/>
<path class="st2" d="M8.9,3.9v0.5c1.6,0.5,2.7,1.9,2.8,3.5c0-0.1,0-0.2,0-0.2C11.7,6,10.6,4.4,8.9,3.9z"/>
<path class="st2" d="M6.6,4.4V3.9C5,4.4,3.8,6,3.8,7.7c0,0.1,0,0.2,0,0.2C3.9,6.3,5,4.9,6.6,4.4z"/>
<path class="st2" d="M7.8,12.9c-2.8,0-5.1-2.2-5.2-5c0,0.1,0,0.2,0,0.3c0,2.9,2.4,5.2,5.2,5.2c2.9,0,5.2-2.4,5.2-5.2l0,0
	c0-0.1,0-0.2,0-0.3C12.9,10.7,10.6,12.9,7.8,12.9z"/>
<path class="st3" d="M6.6,6.2C5.8,6.9,5.6,8,6.3,8.9s1.8,1,2.6,0.4c0.8-0.6,1-1.8,0.4-2.6C9.2,6.4,9,6.3,8.9,6.2v0.2
	c0,0.4-0.3,0.7-0.7,0.7H7.3c-0.4,0-0.7-0.3-0.7-0.7L6.6,6.2z"/>
<path class="st3" d="M7.3,1.8h0.8c0.1,0,0.2,0.1,0.2,0.2v4.4c0,0.1-0.1,0.2-0.2,0.2H7.3c-0.1,0-0.2-0.1-0.2-0.2V2
	C7.1,1.9,7.2,1.8,7.3,1.8z"/>
<path class="st3" d="M8.9,2.6V4c2.1,0.6,3.3,2.8,2.6,4.9s-2.8,3.3-4.9,2.6S3.4,8.6,4,6.6C4.4,5.3,5.4,4.4,6.6,4V2.6
	C3.8,3.2,2,6,2.6,8.8s3.4,4.6,6.3,4s4.6-3.4,4-6.3C12.4,4.6,10.9,3,8.9,2.6z"/>
</svg>
