<?xml version="1.0" encoding="utf-8"?>
<!-- Generator: Adobe Illustrator 22.0.1, SVG Export Plug-In . SVG Version: 6.00 Build 0)  -->
<svg version="1.1" id="katman_1" xmlns="http://www.w3.org/2000/svg" xmlns:xlink="http://www.w3.org/1999/xlink" x="0px" y="0px"
	 viewBox="0 0 18.5 24" style="enable-background:new 0 0 18.5 24;" xml:space="preserve">
<style type="text/css">
	.st0{opacity:0.2;enable-background:new    ;}
	.st1{fill:url(#SVGID_1_);}
	.st2{opacity:0.1;enable-background:new    ;}
	.st3{fill:#F5F5F5;}
	.st4{opacity:0.1;fill:#FFFFFF;enable-background:new    ;}
	.st5{opacity:0.5;enable-background:new    ;}
</style>
<title>libreoffice-impress_5</title>
<path class="st0" d="M0,21.9v0.8C0,23.4,0.6,24,1.2,24c0,0,0,0,0,0h16c0.7,0,1.3-0.6,1.3-1.3l0,0v-0.8c0,0.7-0.6,1.3-1.3,1.3l0,0
	h-16C0.6,23.2,0,22.6,0,21.9C0,21.9,0,21.9,0,21.9z"/>
<linearGradient id="SVGID_1_" gradientUnits="userSpaceOnUse" x1="9.265" y1="0.3097" x2="9.265" y2="23.8898" gradientTransform="matrix(1 0 0 -1 0 23.8898)">
	<stop  offset="0" style="stop-color:#C73323"/>
	<stop  offset="0.21" style="stop-color:#D13E26"/>
	<stop  offset="0.68" style="stop-color:#E3522A"/>
	<stop  offset="1" style="stop-color:#EA592C"/>
</linearGradient>
<path class="st1" d="M18.5,22.3V1.3C18.5,0.6,18,0,17.3,0c0,0,0,0,0,0h-16C0.6,0,0,0.6,0,1.3c0,0,0,0,0,0v21.1
	c0,0.7,0.6,1.3,1.3,1.3c0,0,0,0,0,0h16C18,23.6,18.5,23,18.5,22.3C18.5,22.3,18.5,22.3,18.5,22.3z"/>
<path class="st2" d="M1.7,2.1v20.2h15.2V9.2L9.8,2.1H1.7z M12.1,2.1l4.7,4.7V2.1H12.1z"/>
<polygon class="st3" points="1.7,1.7 1.7,21.9 16.8,21.9 16.8,8.8 9.8,1.7 "/>
<polygon class="st3" points="12.1,1.7 16.8,6.4 16.8,1.7 "/>
<path class="st4" d="M1.3,0C0.6,0,0,0.6,0,1.3v0.4C0,1,0.6,0.4,1.3,0.4h16c0.7,0,1.3,0.6,1.3,1.3c0,0,0,0,0,0V1.3
	C18.5,0.6,18,0,17.3,0c0,0,0,0,0,0H1.3z"/>
<path class="st5" d="M5.9,12.1c-1.2,0-2.3,1-2.3,2.3s1,2.2,2.3,2.2s2.3-1,2.3-2.2l0,0H5.9V12.1z"/>
<rect x="9.3" y="12.6" class="st5" width="5.6" height="0.8"/>
<rect x="9.3" y="15.2" class="st5" width="5.6" height="0.8"/>
<rect x="4.2" y="17.7" class="st5" width="8.4" height="0.8"/>
<path class="st2" d="M5.9,12.4c-1.2,0-2.3,1-2.3,2.3s1,2.2,2.3,2.2s2.3-1,2.3-2.2l0,0H5.9V12.4z"/>
<rect x="9.3" y="13" class="st2" width="5.6" height="0.8"/>
<rect x="9.3" y="15.5" class="st2" width="5.6" height="0.8"/>
<rect x="4.2" y="18.1" class="st2" width="8.4" height="0.8"/>
</svg>
