<?xml version="1.0" encoding="utf-8"?>
<!-- Generator: Adobe Illustrator 21.0.0, SVG Export Plug-In . SVG Version: 6.00 Build 0)  -->
<svg version="1.1" id="katman_1" xmlns="http://www.w3.org/2000/svg" xmlns:xlink="http://www.w3.org/1999/xlink" x="0px" y="0px"
	 viewBox="0 0 16 16" style="enable-background:new 0 0 16 16;" xml:space="preserve">
<style type="text/css">
	.st0{opacity:0.3;enable-background:new    ;}
	.st1{fill:url(#SVGID_1_);}
	.st2{fill:url(#SVGID_2_);}
	.st3{opacity:0.2;}
	.st4{opacity:0.1;enable-background:new    ;}
	.st5{opacity:0.1;fill:#FFFFFF;enable-background:new    ;}
	.st6{fill:#F2F2F2;}
	.st7{fill:url(#SVGID_3_);}
	.st8{fill:url(#SVGID_4_);}
	.st9{fill:url(#SVGID_5_);}
	.st10{fill:url(#SVGID_6_);}
	.st11{opacity:0.7;enable-background:new    ;}
	.st12{opacity:0.7;fill:#333333;enable-background:new    ;}
	.st13{opacity:0.7;fill:#42210B;enable-background:new    ;}
	.st14{fill:#FFC807;}
	.st15{fill:url(#SVGID_7_);}
	.st16{fill:url(#SVGID_8_);}
	.st17{fill:url(#SVGID_9_);}
	.st18{fill:url(#SVGID_10_);}
	.st19{fill:url(#SVGID_11_);}
	.st20{fill:url(#SVGID_12_);}
	.st21{fill:url(#SVGID_13_);}
	.st22{fill:url(#SVGID_14_);}
</style>
<title>wmtweaks_5</title>
<path class="st0" d="M11.4,1.5c0-0.2-0.1-0.3-0.3-0.3H0.3C0.1,1.2,0,1.3,0,1.5v8h11.4V2.4h0.1L11.4,1.5z"/>
<linearGradient id="SVGID_1_" gradientUnits="userSpaceOnUse" x1="5.685" y1="7.95" x2="5.685" y2="15.23" gradientTransform="matrix(1 0 0 -1 0 17.2)">
	<stop  offset="0" style="stop-color:#A3A4A4"/>
	<stop  offset="3.000000e-02" style="stop-color:#A5A6A6"/>
	<stop  offset="0.44" style="stop-color:#C9C9C9"/>
	<stop  offset="0.78" style="stop-color:#DFDEDE"/>
	<stop  offset="1" style="stop-color:#E7E6E6"/>
</linearGradient>
<rect x="0.1" y="2" class="st1" width="11.2" height="7.4"/>
<linearGradient id="SVGID_2_" gradientUnits="userSpaceOnUse" x1="5.715" y1="4.38" x2="5.715" y2="15.84" gradientTransform="matrix(1 0 0 -1 0 17.2)">
	<stop  offset="5.000000e-02" style="stop-color:#1A1A1A"/>
	<stop  offset="0.39" style="stop-color:#1D1D1D"/>
	<stop  offset="0.66" style="stop-color:#272727"/>
	<stop  offset="0.91" style="stop-color:#383838"/>
	<stop  offset="1" style="stop-color:#404040"/>
</linearGradient>
<path class="st2" d="M11.3,2.3V1.5c0-0.1-0.1-0.2-0.2-0.2H0.3c-0.1,0-0.2,0.1-0.2,0.2l0,0v0.8L11.3,2.3z"/>
<g class="st3">
	<path d="M10.2,2.1l0.2-0.3l-0.2-0.2h0.2l0.1,0.1l0.1-0.1h0.2l-0.2,0.2l0.2,0.3h-0.2L10.5,2l-0.1,0.2L10.2,2.1z"/>
</g>
<g class="st3">
	<path d="M9.6,2.1V1.9H9.4V1.8h0.2V1.6h0.1v0.2H10v0.1H9.8v0.2H9.6z"/>
</g>
<rect x="0.1" y="9.4" class="st4" width="11.2" height="0.4"/>
<path class="st5" d="M11.1,1.3H0.3c-0.1,0-0.2,0.1-0.2,0.2l0,0v0.4c0-0.1,0.1-0.2,0.2-0.2h10.9c0.1,0,0.2,0.1,0.2,0.2V1.5
	C11.3,1.4,11.3,1.3,11.1,1.3z"/>
<rect x="0.1" y="2.3" class="st4" width="11.2" height="0.3"/>
<path class="st6" d="M10.2,2.1l0.2-0.3l-0.2-0.2h0.2l0.1,0.1l0.1-0.1h0.2l-0.2,0.2l0.2,0.3h-0.2l-0.1-0.1l-0.1,0.1H10.2z"/>
<path class="st6" d="M9.6,2.1V1.9H9.4V1.7h0.2V1.6h0.1v0.2H10v0.1H9.8v0.2H9.6z"/>
<path class="st0" d="M13.7,3.7c0-0.2-0.1-0.3-0.3-0.3H2.6c-0.2,0-0.3,0.1-0.3,0.3v8h11.4V4.7h0.1V3.7z"/>
<linearGradient id="SVGID_3_" gradientUnits="userSpaceOnUse" x1="7.975" y1="5.66" x2="7.975" y2="12.94" gradientTransform="matrix(1 0 0 -1 0 17.2)">
	<stop  offset="0" style="stop-color:#A3A4A4"/>
	<stop  offset="3.000000e-02" style="stop-color:#A5A6A6"/>
	<stop  offset="0.44" style="stop-color:#C9C9C9"/>
	<stop  offset="0.78" style="stop-color:#DFDEDE"/>
	<stop  offset="1" style="stop-color:#E7E6E6"/>
</linearGradient>
<rect x="2.4" y="4.3" class="st7" width="11.2" height="7.4"/>
<linearGradient id="SVGID_4_" gradientUnits="userSpaceOnUse" x1="8" y1="2.1" x2="8" y2="13.55" gradientTransform="matrix(1 0 0 -1 0 17.2)">
	<stop  offset="5.000000e-02" style="stop-color:#1A1A1A"/>
	<stop  offset="0.39" style="stop-color:#1D1D1D"/>
	<stop  offset="0.66" style="stop-color:#272727"/>
	<stop  offset="0.91" style="stop-color:#383838"/>
	<stop  offset="1" style="stop-color:#404040"/>
</linearGradient>
<path class="st8" d="M13.6,4.6V3.7c0-0.1-0.1-0.2-0.2-0.2H2.6c-0.1,0-0.2,0.1-0.2,0.2l0,0v0.8H13.6z"/>
<g class="st3">
	<path d="M12.5,4.4l0.2-0.3l-0.2-0.2h0.2L12.8,4l0.1-0.1h0.2l-0.2,0.2l0.2,0.3h-0.2l-0.1-0.2l-0.1,0.2H12.5z"/>
</g>
<g class="st3">
	<path d="M11.9,4.4V4.2h-0.2V4.1h0.2V3.9H12v0.2h0.2v0.1H12v0.2H11.9z"/>
</g>
<rect x="2.4" y="11.7" class="st4" width="11.2" height="0.4"/>
<path class="st5" d="M13.4,3.6H2.6c-0.1,0-0.2,0.1-0.2,0.2l0,0v0.3c0-0.1,0.1-0.2,0.2-0.2l0,0h10.9c0.1,0,0.2,0.1,0.2,0.2V3.7
	C13.6,3.6,13.5,3.6,13.4,3.6z"/>
<rect x="2.4" y="4.6" class="st4" width="11.2" height="0.3"/>
<path class="st6" d="M12.5,4.3l0.2-0.3l-0.2-0.2h0.2L12.8,4l0.1-0.1h0.2l-0.2,0.2l0.2,0.3h-0.2l-0.1-0.2l-0.1,0.2H12.5z"/>
<path class="st6" d="M11.9,4.3V4.2h-0.2V4h0.2V3.8H12V4h0.2v0.1H12v0.2L11.9,4.3z"/>
<path class="st0" d="M16,6c0-0.2-0.1-0.3-0.3-0.3H4.8C4.7,5.7,4.6,5.8,4.6,6v8h11.4V7H16V6z"/>
<linearGradient id="SVGID_5_" gradientUnits="userSpaceOnUse" x1="10.255" y1="3.38" x2="10.255" y2="10.66" gradientTransform="matrix(1 0 0 -1 0 17.2)">
	<stop  offset="0" style="stop-color:#A3A4A4"/>
	<stop  offset="3.000000e-02" style="stop-color:#A5A6A6"/>
	<stop  offset="0.44" style="stop-color:#C9C9C9"/>
	<stop  offset="0.78" style="stop-color:#DFDEDE"/>
	<stop  offset="1" style="stop-color:#E7E6E6"/>
</linearGradient>
<rect x="4.7" y="6.5" class="st9" width="11.2" height="7.4"/>
<linearGradient id="SVGID_6_" gradientUnits="userSpaceOnUse" x1="10.285" y1="-0.19" x2="10.285" y2="11.26" gradientTransform="matrix(1 0 0 -1 0 17.2)">
	<stop  offset="5.000000e-02" style="stop-color:#1A1A1A"/>
	<stop  offset="0.39" style="stop-color:#1D1D1D"/>
	<stop  offset="0.66" style="stop-color:#272727"/>
	<stop  offset="0.91" style="stop-color:#383838"/>
	<stop  offset="1" style="stop-color:#404040"/>
</linearGradient>
<path class="st10" d="M15.9,6.9V6c0-0.1-0.1-0.2-0.2-0.2H4.8C4.7,5.8,4.7,5.9,4.7,6l0,0v0.8L15.9,6.9z"/>
<g class="st3">
	<path d="M14.8,6.7L15,6.4l-0.2-0.2H15l0.1,0.1l0.1-0.1h0.2l-0.2,0.2l0.2,0.3h-0.2l-0.1-0.2L15,6.7H14.8z"/>
</g>
<g class="st3">
	<path d="M14.2,6.7V6.5H14V6.4h0.2V6.2h0.1v0.2h0.2v0.1h-0.2v0.2H14.2z"/>
</g>
<rect x="4.7" y="14" class="st4" width="11.2" height="0.4"/>
<path class="st5" d="M15.7,5.8H4.8C4.8,5.8,4.7,5.9,4.7,6v0.3c0-0.1,0.1-0.2,0.2-0.2l0,0h10.9c0.1,0,0.2,0.1,0.2,0.2V6
	C15.9,5.9,15.8,5.8,15.7,5.8z"/>
<rect x="4.7" y="6.9" class="st4" width="11.2" height="0.3"/>
<path class="st6" d="M14.8,6.6L15,6.4l-0.2-0.2H15l0.1,0.1l0.1-0.1h0.2l-0.2,0.2l0.2,0.3h-0.2l-0.1-0.2L15,6.6H14.8z"/>
<path class="st6" d="M14.2,6.6V6.4H14V6.3h0.2V6.1h0.1v0.2h0.2v0.1h-0.2v0.2L14.2,6.6z"/>
<polygon class="st11" points="13.1,15.6 9.2,11.5 11.3,9.5 15.7,14.3 15.7,15.6 "/>
<polygon class="st12" points="6.2,7.9 8,6.2 11.4,9.8 9.5,11.6 "/>
<path class="st13" d="M11.9,4.8c-0.1,0-0.2,0-0.2-0.1l-0.9-0.5c-0.1,0-0.2,0-0.2,0L9.6,4.8c-0.1,0-0.1,0.1-0.2,0.1
	C9.2,4.9,9.1,4.8,9,4.7C8.9,4.6,8.9,4.4,8.9,4.3l0.2-1c0-0.1,0-0.2-0.1-0.3L8.3,2.3c-0.2-0.2-0.2-0.5,0-0.7c0.1-0.1,0.2-0.1,0.3-0.2
	l1-0.1c0.1,0,0.2-0.1,0.2-0.1l0.4-0.9C10.3,0,10.6-0.1,10.9,0C11,0,11,0.1,11.1,0.2l0.4,0.9c0,0.1,0.1,0.1,0.2,0.1l1,0.1
	c0.3,0,0.5,0.3,0.4,0.6c0,0.1-0.1,0.2-0.2,0.3L12.3,3c-0.1,0.1-0.1,0.1-0.1,0.2l0.2,1c0,0.1,0,0.3-0.1,0.4C12.2,4.7,12,4.8,11.9,4.8
	L11.9,4.8z"/>
<path class="st14" d="M10.3,0.3L9.9,1.2C9.8,1.4,9.7,1.4,9.6,1.5l-1,0.1C8.4,1.6,8.2,1.8,8.3,2c0,0.1,0,0.1,0.1,0.2L9.1,3
	c0.1,0.1,0.1,0.2,0.1,0.3L9,4.3c0,0.2,0.1,0.4,0.3,0.4c0.1,0,0.2,0,0.2,0l0.9-0.5c0.1-0.1,0.2-0.1,0.4,0l0.9,0.5
	c0.2,0.1,0.4,0,0.5-0.2c0-0.1,0.1-0.2,0-0.2l-0.2-1c0-0.1,0-0.2,0.1-0.3l0.7-0.7c0.1-0.2,0.1-0.4,0-0.5c-0.1-0.1-0.1-0.1-0.2-0.1
	l-1-0.1c-0.1,0-0.2-0.1-0.3-0.2l-0.4-1c-0.1-0.2-0.3-0.3-0.5-0.2C10.4,0.2,10.3,0.2,10.3,0.3z"/>
<path class="st13" d="M6.4,3.7c-0.1,0-0.1,0-0.2,0L5.5,3.3H5.4H5.4L4.7,3.6c-0.1,0-0.1,0-0.2,0c-0.2,0-0.4-0.2-0.4-0.4
	c0,0,0,0,0-0.1l0.1-0.8c0,0,0-0.1,0-0.1L3.6,1.8c-0.2-0.2-0.2-0.4,0-0.6c0.1-0.1,0.1-0.1,0.2-0.1L4.6,1c0.1,0,0.1,0,0.1-0.1l0.3-0.7
	C5.2,0,5.4-0.1,5.6,0.1c0.1,0,0.1,0.1,0.2,0.2l0.3,0.7C6.2,1,6.2,1,6.2,1L7,1.1c0.2,0,0.4,0.2,0.4,0.5c0,0.1-0.1,0.2-0.1,0.2
	L6.7,2.3c0,0,0,0.1,0,0.1l0.1,0.8c0,0.2-0.1,0.4-0.3,0.5C6.5,3.7,6.4,3.7,6.4,3.7L6.4,3.7z"/>
<path class="st14" d="M5.2,0.3L4.8,1c0,0.1-0.1,0.1-0.2,0.2L3.9,1.3c-0.2,0-0.3,0.2-0.2,0.3c0,0.1,0,0.1,0.1,0.2l0.5,0.5
	c0.1,0.1,0.1,0.2,0.1,0.2L4.2,3.3c0,0.2,0.1,0.3,0.2,0.3c0.1,0,0.1,0,0.2,0l0.7-0.3c0.1,0,0.2,0,0.3,0l0.7,0.3
	c0.1,0.1,0.3,0,0.4-0.1c0-0.1,0-0.1,0-0.2L6.5,2.5c0-0.1,0-0.2,0.1-0.2l0.5-0.5c0.1-0.1,0.2-0.3,0.1-0.4c0-0.1-0.1-0.1-0.2-0.1
	L6.2,1.1C6.2,1.1,6.1,1.1,6,1L5.7,0.3C5.6,0.1,5.5,0.1,5.3,0.1C5.2,0.2,5.2,0.2,5.2,0.3z"/>
<linearGradient id="SVGID_7_" gradientUnits="userSpaceOnUse" x1="10.64" y1="12.01" x2="10.64" y2="17.4" gradientTransform="matrix(1 0 0 -1 0 17.2)">
	<stop  offset="0" style="stop-color:#000000;stop-opacity:0.39"/>
	<stop  offset="1" style="stop-color:#000000;stop-opacity:0"/>
</linearGradient>
<path class="st15" d="M10.3,0.3L9.9,1.2C9.8,1.4,9.7,1.4,9.6,1.5l-1,0.1C8.4,1.6,8.2,1.8,8.3,2c0,0.1,0,0.1,0.1,0.2L9.1,3
	c0.1,0.1,0.1,0.2,0.1,0.3L9,4.3c0,0.2,0.1,0.4,0.3,0.4c0.1,0,0.2,0,0.2,0l0.9-0.5c0.1-0.1,0.2-0.1,0.4,0l0.9,0.5
	c0.2,0.1,0.4,0,0.5-0.2c0-0.1,0.1-0.2,0-0.2l-0.2-1c0-0.1,0-0.2,0.1-0.3l0.7-0.7c0.1-0.2,0.1-0.4,0-0.5c-0.1-0.1-0.1-0.1-0.2-0.1
	l-1-0.1c-0.1,0-0.2-0.1-0.3-0.2l-0.4-1c-0.1-0.2-0.3-0.3-0.5-0.2C10.4,0.2,10.3,0.2,10.3,0.3z"/>
<linearGradient id="SVGID_8_" gradientUnits="userSpaceOnUse" x1="5.4297" y1="13.26" x2="5.4297" y2="17.06" gradientTransform="matrix(1 0 0 -1 0 17.2)">
	<stop  offset="0" style="stop-color:#000000;stop-opacity:0.39"/>
	<stop  offset="1" style="stop-color:#000000;stop-opacity:0"/>
</linearGradient>
<path class="st16" d="M5.2,0.3L4.8,1c0,0.1-0.1,0.1-0.2,0.2L3.9,1.3c-0.2,0-0.3,0.2-0.2,0.3c0,0.1,0,0.1,0.1,0.2l0.5,0.5
	c0.1,0.1,0.1,0.2,0.1,0.2L4.2,3.3c0,0.2,0.1,0.3,0.2,0.3c0.1,0,0.1,0,0.2,0l0.7-0.3c0.1,0,0.2,0,0.3,0l0.7,0.3
	c0.1,0.1,0.3,0,0.4-0.1c0-0.1,0-0.1,0-0.2L6.5,2.5c0-0.1,0-0.2,0.1-0.2l0.5-0.5c0.1-0.1,0.2-0.3,0.1-0.4c0-0.1-0.1-0.1-0.2-0.1
	L6.2,1.1C6.2,1.1,6.1,1.1,6,1L5.7,0.3C5.6,0.1,5.5,0.1,5.3,0.1C5.2,0.2,5.2,0.2,5.2,0.3z"/>
<path class="st13" d="M2.9,6.3c-0.1,0-0.1,0-0.2,0L2.1,6H2L1.4,6.3c-0.1,0-0.1,0-0.2,0C1,6.3,0.9,6.1,0.9,5.9c0,0,0,0,0-0.1L1,5.2
	c0,0,0-0.1,0-0.1L0.4,4.6C0.3,4.4,0.3,4.2,0.5,4.1C0.5,4,0.6,4,0.6,4l0.7-0.1c0,0,0.1,0,0.1-0.1l0.3-0.6C1.8,3,2,3,2.2,3.1
	c0.1,0,0.1,0.1,0.2,0.2l0.3,0.6c0,0,0.1,0.1,0.1,0.1L3.4,4c0.2,0,0.3,0.2,0.3,0.4c0,0.1,0,0.1-0.1,0.2L3.2,5.1c0,0,0,0.1,0,0.1
	l0.1,0.7C3.3,6.1,3.2,6.3,2.9,6.3C2.9,6.3,2.9,6.3,2.9,6.3L2.9,6.3z"/>
<path class="st14" d="M1.8,3.2L1.5,3.8C1.5,3.9,1.4,4,1.3,4L0.7,4.1c-0.1,0-0.2,0.1-0.2,0.3c0,0.1,0,0.1,0.1,0.2L1,5
	c0.1,0.1,0.1,0.1,0.1,0.2L1,5.9C1,6,1.1,6.1,1.2,6.2c0.1,0,0.1,0,0.1,0L2,5.8c0.1,0,0.2,0,0.2,0l0.6,0.3c0.1,0.1,0.3,0,0.3-0.1
	c0,0,0-0.1,0-0.1L3,5.2C3,5.1,3,5.1,3.1,5l0.5-0.5c0.1-0.1,0.1-0.3,0-0.4c0,0-0.1-0.1-0.2-0.1L2.8,4C2.7,4,2.6,3.9,2.6,3.9L2.3,3.3
	C2.2,3.1,2.1,3.1,1.9,3.1C1.9,3.2,1.8,3.2,1.8,3.2z"/>
<linearGradient id="SVGID_9_" gradientUnits="userSpaceOnUse" x1="2.03" y1="10.71" x2="2.03" y2="14.46" gradientTransform="matrix(1 0 0 -1 0 17.2)">
	<stop  offset="0" style="stop-color:#000000;stop-opacity:0.39"/>
	<stop  offset="1" style="stop-color:#000000;stop-opacity:0"/>
</linearGradient>
<path class="st17" d="M1.8,3.2L1.5,3.8C1.5,3.9,1.4,4,1.3,4L0.7,4.1c-0.1,0-0.2,0.1-0.2,0.3c0,0.1,0,0.1,0.1,0.2L1,5
	c0.1,0.1,0.1,0.1,0.1,0.2L1,5.9C1,6,1.1,6.1,1.2,6.2c0.1,0,0.1,0,0.1,0L2,5.8c0.1,0,0.2,0,0.2,0l0.6,0.3c0.1,0.1,0.3,0,0.3-0.1
	c0,0,0-0.1,0-0.1L3,5.2C3,5.1,3,5.1,3.1,5l0.5-0.5c0.1-0.1,0.1-0.3,0-0.4c0,0-0.1-0.1-0.2-0.1L2.8,4C2.7,4,2.6,3.9,2.6,3.9L2.3,3.3
	C2.2,3.1,2.1,3.1,1.9,3.1C1.9,3.2,1.8,3.2,1.8,3.2z"/>
<path class="st13" d="M2.3,10.4c0,0-0.1,0-0.2,0l-0.5-0.2H1.6l-0.5,0.2c0,0-0.1,0-0.1,0c-0.2,0-0.3-0.2-0.3-0.3c0,0,0,0,0,0l0.1-0.5
	c0,0,0,0,0-0.1L0.4,9c-0.1-0.1-0.1-0.3,0-0.5c0.1-0.1,0.1-0.1,0.2-0.1l0.5-0.1c0,0,0,0,0,0l0.2-0.5c0.1-0.2,0.3-0.2,0.4-0.2
	c0.1,0,0.1,0.1,0.2,0.2l0.2,0.5c0,0,0,0,0,0l0.5,0.1C2.9,8.5,3,8.6,3,8.8C3,8.9,3,8.9,2.9,9L2.5,9.4c0,0,0,0,0,0.1l0.1,0.5
	C2.7,10.1,2.5,10.3,2.3,10.4C2.4,10.3,2.3,10.3,2.3,10.4L2.3,10.4z"/>
<path class="st14" d="M1.5,8L1.2,8.5c0,0.1-0.1,0.1-0.1,0.1L0.6,8.7c-0.1,0-0.2,0.1-0.2,0.2c0,0,0,0.1,0,0.1l0.4,0.4
	c0,0,0.1,0.1,0.1,0.2L0.8,10c0,0.1,0.1,0.2,0.2,0.2c0,0,0.1,0,0.1,0L1.5,10c0.1,0,0.1,0,0.2,0l0.5,0.2c0.1,0,0.2,0,0.3-0.1
	c0,0,0-0.1,0-0.2L2.4,9.5c0-0.1,0-0.1,0.1-0.2l0.4-0.4c0.1-0.1,0.1-0.2,0-0.3c0,0-0.1,0-0.1,0L2.2,8.5C2.1,8.5,2.1,8.5,2,8.4L1.8,8
	C1.8,7.9,1.6,7.9,1.5,8C1.5,7.9,1.5,8,1.5,8z"/>
<linearGradient id="SVGID_10_" gradientUnits="userSpaceOnUse" x1="1.645" y1="6.78" x2="1.645" y2="9.57" gradientTransform="matrix(1 0 0 -1 0 17.2)">
	<stop  offset="0" style="stop-color:#000000;stop-opacity:0.39"/>
	<stop  offset="1" style="stop-color:#000000;stop-opacity:0"/>
</linearGradient>
<path class="st18" d="M1.5,8L1.2,8.5c0,0.1-0.1,0.1-0.1,0.1L0.6,8.7c-0.1,0-0.2,0.1-0.2,0.2c0,0,0,0.1,0,0.1l0.4,0.4
	c0,0,0.1,0.1,0.1,0.2L0.8,10c0,0.1,0.1,0.2,0.2,0.2c0,0,0.1,0,0.1,0L1.5,10c0.1,0,0.1,0,0.2,0l0.5,0.2c0.1,0,0.2,0,0.3-0.1
	c0,0,0-0.1,0-0.2L2.4,9.5c0-0.1,0-0.1,0.1-0.2l0.4-0.4c0.1-0.1,0.1-0.2,0-0.3c0,0-0.1,0-0.1,0L2.2,8.5C2.1,8.5,2.1,8.5,2,8.4L1.8,8
	C1.8,7.9,1.6,7.9,1.5,8C1.5,7.9,1.5,8,1.5,8z"/>
<path class="st13" d="M2.8,13.5c0,0-0.1,0-0.1,0l-0.3-0.2l-0.3,0.2c0,0-0.1,0-0.1,0c-0.1,0-0.3-0.1-0.3-0.3c0,0,0,0,0,0l0.1-0.4
	l-0.3-0.3c-0.1-0.1-0.1-0.3,0-0.4c0,0,0.1-0.1,0.1-0.1L2,12.1l0.2-0.3c0.1-0.1,0.2-0.2,0.3-0.1c0.1,0,0.1,0.1,0.1,0.1L2.8,12
	l0.4,0.1c0.1,0,0.2,0.2,0.2,0.3c0,0.1,0,0.1-0.1,0.1L3,12.8l0.1,0.4C3.1,13.3,3,13.4,2.8,13.5C2.8,13.5,2.8,13.5,2.8,13.5L2.8,13.5z
	"/>
<path class="st14" d="M2.3,11.8l-0.2,0.3c0,0-0.1,0.1-0.1,0.1l-0.4,0.1c-0.1,0-0.1,0.1-0.1,0.1c0,0,0,0.1,0,0.1l0.3,0.2
	c0,0,0,0.1,0,0.1l-0.1,0.4c0,0.1,0,0.1,0.1,0.2c0,0,0.1,0,0.1,0l0.3-0.2c0,0,0.1,0,0.1,0l0.3,0.2c0,0.1,0.1,0.1,0.2,0.1
	C3,13.4,3,13.3,3,13.2l0,0l-0.1-0.4c0,0,0-0.1,0-0.1l0.3-0.2c0.1,0,0.1-0.1,0-0.2c0,0-0.1,0-0.1,0l-0.4-0.1c0,0-0.1,0-0.1-0.1
	l-0.2-0.3C2.5,11.7,2.4,11.7,2.3,11.8C2.3,11.7,2.3,11.7,2.3,11.8z"/>
<linearGradient id="SVGID_11_" gradientUnits="userSpaceOnUse" x1="2.385" y1="3.7" x2="2.385" y2="5.63" gradientTransform="matrix(1 0 0 -1 0 17.2)">
	<stop  offset="0" style="stop-color:#000000;stop-opacity:0.39"/>
	<stop  offset="1" style="stop-color:#000000;stop-opacity:0"/>
</linearGradient>
<path class="st19" d="M2.3,11.8l-0.2,0.3c0,0-0.1,0.1-0.1,0.1l-0.4,0.1c-0.1,0-0.1,0.1-0.1,0.1c0,0,0,0.1,0,0.1l0.3,0.2
	c0,0,0,0.1,0,0.1l-0.1,0.4c0,0.1,0,0.1,0.1,0.2c0,0,0.1,0,0.1,0l0.3-0.2c0,0,0.1,0,0.1,0l0.3,0.2c0,0.1,0.1,0.1,0.2,0.1
	C3,13.4,3,13.3,3,13.2l0,0l-0.1-0.4c0,0,0-0.1,0-0.1l0.3-0.2c0.1,0,0.1-0.1,0-0.2c0,0-0.1,0-0.1,0l-0.4-0.1c0,0-0.1,0-0.1-0.1
	l-0.2-0.3C2.5,11.7,2.4,11.7,2.3,11.8C2.3,11.7,2.3,11.7,2.3,11.8z"/>
<path class="st13" d="M4.4,15.1H4.3L4.1,15l-0.3,0.1H3.7c-0.1,0-0.2-0.1-0.2-0.2c0,0,0,0,0,0l0-0.3l-0.2-0.2c-0.1-0.1-0.1-0.2,0-0.3
	c0,0,0.1-0.1,0.1-0.1h0.3l0.1-0.3c0.1-0.1,0.2-0.2,0.3-0.1c0,0,0.1,0.1,0.1,0.1l0.1,0.3h0.3c0.1,0,0.2,0.1,0.2,0.3
	c0,0.1,0,0.1-0.1,0.1l-0.2,0.2l0.1,0.3C4.7,15,4.6,15.1,4.4,15.1C4.5,15.1,4.5,15.1,4.4,15.1L4.4,15.1z"/>
<path class="st14" d="M4,13.6l-0.1,0.3c0,0-0.1,0.1-0.1,0.1H3.5c-0.1,0-0.1,0.1-0.1,0.1c0,0,0,0,0,0.1l0.2,0.2c0,0,0,0.1,0,0.1
	l0,0.3c0,0.1,0,0.1,0.1,0.1c0,0,0,0,0.1,0L4,14.8c0,0,0.1,0,0.1,0L4.4,15c0.1,0,0.1,0,0.2-0.1c0,0,0,0,0-0.1l-0.1-0.3
	c0,0,0-0.1,0-0.1l0.2-0.2c0,0,0-0.1,0-0.2c0,0,0,0-0.1,0H4.3c0,0-0.1,0-0.1-0.1l-0.1-0.3C4.1,13.6,4,13.6,4,13.6z"/>
<linearGradient id="SVGID_12_" gradientUnits="userSpaceOnUse" x1="4.06" y1="2.12" x2="4.06" y2="3.71" gradientTransform="matrix(1 0 0 -1 0 17.2)">
	<stop  offset="0" style="stop-color:#000000;stop-opacity:0.39"/>
	<stop  offset="1" style="stop-color:#000000;stop-opacity:0"/>
</linearGradient>
<path class="st20" d="M4,13.6l-0.1,0.3c0,0-0.1,0.1-0.1,0.1H3.5c-0.1,0-0.1,0.1-0.1,0.1c0,0,0,0,0,0.1l0.2,0.2c0,0,0,0.1,0,0.1
	l0,0.3c0,0.1,0,0.1,0.1,0.1c0,0,0,0,0.1,0L4,14.8c0,0,0.1,0,0.1,0L4.4,15c0.1,0,0.1,0,0.2-0.1c0,0,0,0,0-0.1l-0.1-0.3
	c0,0,0-0.1,0-0.1l0.2-0.2c0,0,0-0.1,0-0.2c0,0,0,0-0.1,0H4.3c0,0-0.1,0-0.1-0.1l-0.1-0.3C4.1,13.6,4,13.6,4,13.6z"/>
<linearGradient id="SVGID_13_" gradientUnits="userSpaceOnUse" x1="-882.6932" y1="2.9865" x2="-885.0032" y2="5.0765" gradientTransform="matrix(-1 0 0 -1 -871 17.2)">
	<stop  offset="0" style="stop-color:#363838"/>
	<stop  offset="2.000000e-02" style="stop-color:#2E3030"/>
	<stop  offset="8.000000e-02" style="stop-color:#1A1B1B"/>
	<stop  offset="0.14" style="stop-color:#0B0C0C"/>
	<stop  offset="0.22" style="stop-color:#030303"/>
	<stop  offset="0.34" style="stop-color:#000000"/>
	<stop  offset="0.74" style="stop-color:#242525"/>
	<stop  offset="1" style="stop-color:#363838"/>
</linearGradient>
<polygon class="st21" points="9.4,11.5 13.1,15.5 15.6,15.5 15.6,14.3 11.3,9.7 "/>
<linearGradient id="SVGID_14_" gradientUnits="userSpaceOnUse" x1="-702.9925" y1="495.4882" x2="-702.9925" y2="497.9" gradientTransform="matrix(-0.68 -0.73 0.73 -0.68 -831.746 -166.654)">
	<stop  offset="0" style="stop-color:#F3F1F0"/>
	<stop  offset="0.51" style="stop-color:#BDBFBF"/>
	<stop  offset="0.52" style="stop-color:#C1C3C2"/>
	<stop  offset="0.62" style="stop-color:#D7D7D7"/>
	<stop  offset="0.72" style="stop-color:#E7E6E5"/>
	<stop  offset="0.84" style="stop-color:#F0EEED"/>
	<stop  offset="1" style="stop-color:#F3F1F0"/>
</linearGradient>
<polygon class="st22" points="6.4,7.9 9.5,11.4 11.2,9.8 8,6.4 "/>
<path class="st5" d="M8.6,2.1l1-0.1c0.1,0,0.2-0.1,0.3-0.2l0.4-0.9c0.1-0.2,0.3-0.3,0.5-0.2c0.1,0,0.1,0.1,0.2,0.2l0.4,0.9
	c0.1,0.1,0.2,0.2,0.3,0.2l1,0.1c0.1,0,0.2,0.1,0.2,0.1C13.1,2,13,1.8,12.9,1.7c-0.1,0-0.1-0.1-0.2-0.1l-1-0.1
	c-0.1,0-0.2-0.1-0.3-0.2L11,0.3c-0.1-0.2-0.3-0.3-0.5-0.2c-0.1,0-0.1,0.1-0.2,0.2L9.9,1.2C9.8,1.4,9.7,1.4,9.6,1.5l-1,0.1
	C8.4,1.6,8.2,1.8,8.3,2c0,0.1,0,0.1,0.1,0.2C8.4,2.2,8.5,2.1,8.6,2.1z"/>
<path class="st4" d="M9.1,3L8.4,2.3l0,0c-0.1,0.1-0.1,0.4,0,0.5l0.7,0.7l0,0V3.3C9.1,3.2,9.1,3.1,9.1,3z"/>
<path class="st4" d="M11.7,4.7l-0.9-0.5c-0.1-0.1-0.2-0.1-0.4,0L9.6,4.7c-0.2,0.1-0.4,0-0.5-0.1v0.2C9,5,9.2,5.2,9.4,5.2
	c0.1,0,0.2,0,0.2,0l0.9-0.5c0.1-0.1,0.2-0.1,0.4,0l0.9,0.5c0.2,0.1,0.4,0,0.5-0.2c0-0.1,0.1-0.2,0-0.2l-0.1-0.3
	c-0.1,0.2-0.3,0.3-0.5,0.3C11.8,4.7,11.7,4.7,11.7,4.7z"/>
<path class="st4" d="M13,2.7c0.1-0.1,0.1-0.4,0-0.5v0L12.2,3c-0.1,0.1-0.1,0.2-0.1,0.3l0.1,0.3c0-0.1,0-0.1,0.1-0.2L13,2.7z"/>
<path class="st5" d="M4.7,1.6c0.1,0,0.2-0.1,0.2-0.1l0.3-0.7c0.1-0.1,0.2-0.2,0.4-0.1c0.1,0,0.1,0.1,0.1,0.1L6,1.4
	c0,0.1,0.1,0.1,0.2,0.1L7,1.7h0.1l0,0c0.1-0.1,0.1-0.3,0-0.4c0,0-0.1-0.1-0.1-0.1L6.2,1.1C6.2,1.1,6.1,1.1,6,1L5.7,0.3
	C5.6,0.1,5.5,0.1,5.3,0.1c-0.1,0-0.1,0.1-0.1,0.1L4.8,1c0,0.1-0.1,0.1-0.2,0.2L3.9,1.3c-0.2,0-0.3,0.2-0.2,0.3c0,0.1,0,0.1,0.1,0.2
	l0.1,0.1c0,0,0.1-0.1,0.1-0.1L4.7,1.6z"/>
<path class="st4" d="M4.3,2.2L3.8,1.8C3.7,1.9,3.7,2,3.8,2.2c0,0,0,0,0,0l0.5,0.5l0,0V2.5C4.3,2.4,4.3,2.3,4.3,2.2z"/>
<path class="st4" d="M7.2,2.2c0.1-0.1,0.1-0.3,0-0.4c0,0,0,0-0.1-0.1L6.6,2.2C6.5,2.3,6.5,2.4,6.5,2.5l0.1,0.3c0,0,0-0.1,0.1-0.1
	L7.2,2.2z"/>
<path class="st4" d="M6.2,3.5L5.6,3.2c-0.1,0-0.2,0-0.3,0L4.6,3.5c-0.1,0.1-0.2,0-0.3,0v0.2C4.3,3.9,4.4,4,4.5,4c0.1,0,0.1,0,0.2,0
	l0.7-0.3c0.1,0,0.2,0,0.3,0L6.3,4c0.1,0.1,0.3,0,0.4-0.1c0-0.1,0-0.1,0-0.2L6.6,3.4C6.6,3.5,6.4,3.6,6.2,3.5
	C6.2,3.5,6.2,3.5,6.2,3.5z"/>
<path class="st5" d="M1.4,4.5c0.1,0,0.2-0.1,0.2-0.1l0.3-0.6c0.1-0.1,0.2-0.2,0.3-0.1c0.1,0,0.1,0.1,0.1,0.1l0.3,0.6
	c0,0.1,0.1,0.1,0.2,0.1l0.7,0.1l0,0l0.1-0.1c0.1-0.1,0.1-0.3,0-0.4c0,0-0.1-0.1-0.2-0.1L2.8,4C2.7,4,2.6,3.9,2.6,3.9L2.3,3.3
	C2.2,3.1,2.1,3.1,1.9,3.1c-0.1,0-0.1,0.1-0.1,0.1L1.5,3.9C1.5,3.9,1.4,4,1.3,4L0.7,4.1c-0.1,0-0.2,0.1-0.2,0.3c0,0.1,0,0.1,0.1,0.2
	l0.1,0.1h0.1L1.4,4.5z"/>
<path class="st4" d="M1,5L0.6,4.6C0.5,4.7,0.4,4.8,0.5,4.9c0,0,0,0,0,0.1L1,5.4V5.2C1,5.1,1,5.1,1,5z"/>
<path class="st4" d="M2.8,6.1L2.2,5.8c-0.1,0-0.2,0-0.2,0L1.3,6.1C1.2,6.2,1.1,6.2,1,6.1v0.2c0,0.1,0.1,0.3,0.2,0.3
	c0.1,0,0.1,0,0.1,0L2,6.3c0.1,0,0.2,0,0.2,0l0.6,0.3c0.1,0.1,0.3,0,0.3-0.1c0,0,0-0.1,0-0.1L3.1,6C3,6.1,2.9,6.2,2.8,6.1
	C2.8,6.1,2.8,6.1,2.8,6.1z"/>
<path class="st4" d="M3.6,5c0.1-0.1,0.1-0.3,0-0.4c0,0-0.1-0.1-0.1-0.1L3.1,5C3,5.1,3,5.1,3,5.2l0.1,0.3c0,0,0-0.1,0-0.1L3.6,5z"/>
<path class="st5" d="M1.3,8.9l0.2-0.5c0.1-0.1,0.2-0.1,0.3-0.1c0,0,0.1,0,0.1,0.1l0.2,0.5C2.1,9,2.2,9,2.2,9l0.5,0.1l0.1-0.1
	c0.1-0.1,0.1-0.2,0-0.3c0,0-0.1,0-0.1,0L2.2,8.5C2.1,8.5,2.1,8.5,2,8.4L1.8,8C1.8,7.9,1.6,7.9,1.5,7.9c0,0-0.1,0-0.1,0.1L1.2,8.5
	c0,0.1-0.1,0.1-0.1,0.1L0.6,8.7c-0.1,0-0.2,0.1-0.2,0.2c0,0,0,0.1,0,0.1l0.1,0.1L1.1,9C1.2,9,1.2,9,1.3,8.9z"/>
<path class="st4" d="M0.8,9.3L0.6,9.1l0,0c-0.1,0-0.2,0.1-0.2,0.2c0,0,0,0.1,0,0.1l0.4,0.3V9.5C0.9,9.4,0.9,9.4,0.8,9.3z"/>
<path class="st4" d="M2.2,10.2L1.7,10c-0.1,0-0.1,0-0.2,0l-0.5,0.2c-0.1,0-0.1,0-0.2,0v0.3c0,0.1,0.1,0.2,0.2,0.2c0,0,0.1,0,0.1,0
	l0.5-0.2c0.1,0,0.1,0,0.2,0l0.5,0.2c0.1,0,0.2,0,0.3-0.1c0,0,0-0.1,0-0.1l-0.1-0.4C2.4,10.3,2.3,10.3,2.2,10.2
	C2.2,10.2,2.2,10.2,2.2,10.2z"/>
<path class="st4" d="M2.9,9.4c0.1-0.1,0.1-0.2,0-0.3c0,0-0.1,0-0.1,0H2.7L2.5,9.3c0,0-0.1,0.1-0.1,0.2l0.1,0.4V9.8L2.9,9.4z"/>
<path class="st5" d="M2.1,12.6l0.2-0.3c0-0.1,0.1-0.1,0.2-0.1c0,0,0.1,0,0.1,0.1l0.2,0.3c0,0,0.1,0.1,0.1,0.1H3l0.2-0.2
	c0.1,0,0.1-0.1,0-0.2c0,0-0.1,0-0.1,0l-0.4-0.1c0,0-0.1,0-0.1-0.1l-0.2-0.3c0-0.1-0.1-0.1-0.2-0.1c0,0-0.1,0-0.1,0.1l-0.2,0.3
	c0,0-0.1,0.1-0.1,0.1l-0.4,0.1c-0.1,0-0.1,0.1-0.1,0.1c0,0,0,0.1,0,0.1l0.2,0.2L2.1,12.6C2.1,12.7,2.1,12.6,2.1,12.6z"/>
<path class="st4" d="M2.9,12.8L3,13.2l0,0l0,0l0.3-0.2c0.1,0,0.1-0.1,0-0.2c0,0-0.1,0-0.1,0H3l0,0C2.9,12.7,2.9,12.8,2.9,12.8z"/>
<path class="st4" d="M2.8,13.3l-0.3-0.2c0,0-0.1,0-0.1,0L2,13.3c0,0-0.1,0-0.1,0l-0.1,0.3c0,0.1,0,0.1,0.1,0.2c0,0,0.1,0,0.1,0
	l0.3-0.2c0,0,0.1,0,0.1,0l0.3,0.2c0.1,0,0.1,0,0.2,0c0,0,0-0.1,0-0.1l-0.1-0.4l0,0C2.9,13.4,2.8,13.4,2.8,13.3z"/>
<path class="st4" d="M1.8,12.7L1.8,12.7H1.7c-0.1,0-0.1,0.1-0.1,0.1c0,0,0,0.1,0,0.1l0.2,0.2l0-0.3C1.9,12.8,1.9,12.7,1.8,12.7z"/>
<path class="st5" d="M3.8,14.4L4,14.1c0-0.1,0.1-0.1,0.2,0c0,0,0,0,0,0l0.1,0.3c0,0,0.1,0.1,0.1,0.1h0.1l0,0l0.2-0.2
	c0,0,0-0.1,0-0.2c0,0,0,0-0.1,0H4.4c0,0-0.1,0-0.1-0.1l-0.1-0.3c0-0.1-0.1-0.1-0.2,0c0,0,0,0,0,0L3.8,14c0,0-0.1,0.1-0.1,0.1H3.4
	c-0.1,0-0.1,0.1-0.1,0.1c0,0,0,0,0,0.1l0.2,0.2l0,0h0.2C3.8,14.5,3.8,14.4,3.8,14.4z"/>
<path class="st4" d="M4.8,14.7c0,0,0-0.1,0-0.2c0,0,0,0-0.1,0H4.5c0,0,0,0,0,0.1l0.1,0.3c0,0.1,0,0.1-0.1,0.1c0,0,0,0-0.1,0
	l-0.3-0.1c0,0-0.1,0-0.1,0L3.7,15c0,0-0.1,0-0.1,0l0,0l0,0.3c0,0.1,0,0.1,0.1,0.1c0,0,0,0,0.1,0L4,15.3c0,0,0.1,0,0.1,0l0.3,0.1
	c0.1,0,0.1,0,0.2-0.1c0,0,0,0,0-0.1l0-0.3c0,0,0-0.1,0-0.1L4.8,14.7z"/>
<path class="st4" d="M3.6,14.5C3.6,14.5,3.6,14.5,3.6,14.5l-0.2-0.1c-0.1,0-0.1,0.1-0.1,0.1c0,0,0,0,0,0.1l0.2,0.2l0,0L3.6,14.5z"/>
<polygon class="st5" points="15.6,14.8 15.6,14.3 11.3,9.7 9.4,11.5 9.7,11.7 11.4,10.2 "/>
<polygon class="st4" points="15.6,14.8 15.6,15.5 13.1,15.5 9.7,11.7 9.4,12 13.2,16 15.6,16 15.6,14.8 "/>
<polygon class="st5" points="11,10 11.2,9.8 8,6.4 6.4,7.9 6.6,8.2 8,6.9 "/>
<polygon class="st4" points="11,10 9.5,11.4 6.6,8.2 6.4,8.4 9.5,11.9 11.3,10.3 "/>
</svg>
