<?xml version="1.0" encoding="utf-8"?>
<!-- Generator: Adobe Illustrator 21.0.0, SVG Export Plug-In . SVG Version: 6.00 Build 0)  -->
<svg version="1.1" id="katman_1" xmlns="http://www.w3.org/2000/svg" xmlns:xlink="http://www.w3.org/1999/xlink" x="0px" y="0px"
	 viewBox="0 0 46.5 48" style="enable-background:new 0 0 46.5 48;" xml:space="preserve">
<style type="text/css">
	.st0{fill:url(#_Dikdörtgen__1_);}
	.st1{opacity:0.1;fill:#FFFFFF;enable-background:new    ;}
	.st2{opacity:0.2;fill:#010101;enable-background:new    ;}
	.st3{opacity:0.2;}
	.st4{fill:#010101;}
	.st5{fill:#FFFFFF;}
</style>
<title>java_1</title>
<radialGradient id="_Dikdörtgen__1_" cx="23.275" cy="24.455" r="23.275" gradientTransform="matrix(1 0 0 -1 0 47.73)" gradientUnits="userSpaceOnUse">
	<stop  offset="0" style="stop-color:#EB6A70"/>
	<stop  offset="0.21" style="stop-color:#EA656B"/>
	<stop  offset="0.46" style="stop-color:#E9585E"/>
	<stop  offset="0.71" style="stop-color:#E64148"/>
	<stop  offset="0.98" style="stop-color:#E22129"/>
	<stop  offset="1" style="stop-color:#E21E26"/>
</radialGradient>
<path id="_Dikdörtgen_" class="st0" d="M46.5,23.3L46.5,23.3c0,12.9-10.4,23.3-23.3,23.3h0C10.4,46.6,0,36.1,0,23.3v0
	C0,10.4,10.4,0,23.3,0h0C36.1,0,46.5,10.4,46.5,23.3z"/>
<path class="st1" d="M46.5,23.3C46.5,10.4,36.1,0,23.3,0c0,0,0,0,0,0l0,0C10.4,0,0,10.4,0,23.3c0,0,0,0,0,0l0,0c0,0.2,0,0.5,0,0.7
	C0.4,11.4,10.7,1.4,23.3,1.5l0,0c12.6,0,22.9,10,23.3,22.5C46.5,23.8,46.5,23.5,46.5,23.3L46.5,23.3z"/>
<path class="st2" d="M23.3,46.6L23.3,46.6C10.7,46.6,0.4,36.6,0,24c0,0.2,0,0.5,0,0.7l0,0C0,37.6,10.4,48,23.3,48l0,0l0,0
	c12.9,0,23.3-10.4,23.3-23.3c0,0,0,0,0,0l0,0c0-0.2,0-0.5,0-0.7C46.2,36.6,35.8,46.6,23.3,46.6z"/>
<g class="st3">
	<path class="st4" d="M22.5,24.6c0.1,0.1,0.3,0.1,0.4,0c0.1-0.1,0.1-0.2,0-0.3c0,0-1.7-3.3-1.6-5.7c0-0.8,1.2-1.8,2.4-2.7
		c1.2-0.9,2.2-1.9,3.1-3.1c0.9-1.6,0.9-3.7-0.2-5.2c-0.1-0.1-0.2-0.2-0.4-0.1C26.1,7.4,26,7.5,26,7.7c0.2,1.2,0,2.4-0.6,3.5
		c-0.6,0.8-1.4,1.5-2.3,2.1c-1.7,1-3.1,2.4-4,4.1C17.5,20.7,22.3,24.4,22.5,24.6z"/>
	<path class="st4" d="M22.9,19c0,1.3,0.5,2.6,1.4,3.6c0.2,0.2,0.4,0.5,0.5,0.7c0.1,0.7-0.1,1.4-0.4,2.1c-0.1,0.1,0,0.3,0.1,0.3
		c0.1,0,0.2,0,0.3,0c0.1-0.1,2.5-1.7,2-3.7c-0.2-0.7-0.5-1.3-0.9-1.8c-0.5-0.8-0.9-1.3-0.3-2.3c0.7-1.2,3.6-3.4,3.7-3.5
		c0.1-0.1,0.1-0.2,0.1-0.4c-0.1-0.1-0.2-0.1-0.3-0.1C28.8,14,22.9,16.3,22.9,19z"/>
	<path class="st4" d="M20.5,28L20.5,28H22c5.5-0.2,7.5-1.9,7.6-2c0.1-0.1,0.1-0.3,0-0.4c-0.1-0.1-0.2-0.1-0.3-0.1
		c-2.7,0.5-5.4,0.8-8.1,0.7c-1.5,0.1-3.1,0-4.6-0.3c0.8-0.5,1.7-0.9,2.7-1c0.1,0,0.2-0.2,0.2-0.3c0-0.1-0.1-0.2-0.2-0.2
		c-0.8,0-4.9,0.1-5.3,1.3c-0.1,0.3,0,0.6,0.1,0.9C14.8,27.6,17.1,28,20.5,28z"/>
	<path class="st4" d="M29.8,30.3c-0.1,0.1-0.2,0.2-0.1,0.4c0,0.1,0.1,0.1,0.2,0.1H30c0.2,0,5.6-1.2,5-4.4c-0.1-1.3-1.2-2.4-2.5-2.3
		c-0.8,0-1.6,0.2-2.3,0.6c-0.1,0.1-0.2,0.2-0.1,0.4c0,0.1,0.1,0.1,0.2,0.1c0,0,2.4,0,2.6,1.4C33.2,27.7,30.7,29.6,29.8,30.3z"/>
	<path class="st4" d="M28.8,29.9c0-0.1,0-0.2-0.1-0.3l-1.3-0.9c-0.1,0-0.2,0-0.2,0c-1.1,0.3-2.2,0.5-3.3,0.6
		c-0.8,0.1-1.7,0.1-2.5,0.1c-1.2,0.1-2.3-0.1-3.4-0.4c0,0,0-0.1,0-0.1c0.1-0.1,0.2-0.2,0.3-0.2c0.1,0,0.2-0.2,0.2-0.3
		c0-0.1-0.2-0.2-0.3-0.2c-1.3,0.3-1.9,0.8-1.9,1.3c0.1,1,2.3,1.5,4.2,1.6c0.3,0,0.6,0,0.9,0l0,0c2.4-0.1,4.9-0.4,7.3-1
		C28.7,30.1,28.8,30,28.8,29.9z"/>
	<path class="st4" d="M19.2,31.7c0-0.1-0.1-0.2-0.2-0.2c-0.2,0-1.7,0.1-1.8,1c0,0.3,0.1,0.6,0.2,0.8c0.5,0.7,2,1,4.5,1.2h0.9
		c1.8,0,3.7-0.3,5.4-1c0.1-0.1,0.2-0.2,0.1-0.4c0,0-0.1-0.1-0.1-0.1l-1.6-1c-0.1,0-0.1,0-0.2,0c0,0-1,0.2-2.6,0.4
		c-0.4,0-0.7,0.1-1.1,0.1c-1.2,0-2.5-0.1-3.7-0.4c0,0,0-0.1,0-0.1C19.1,31.9,19.2,31.8,19.2,31.7z"/>
	<path class="st4" d="M21.3,37.5c7.2,0,11.1-1.3,11.9-2.1c0.2-0.2,0.3-0.5,0.3-0.7c-0.1-0.3-0.2-0.6-0.5-0.7c-0.1-0.1-0.2-0.1-0.3,0
		c-0.1,0.1-0.1,0.2,0,0.3c0,0.1,0.1,0.2-0.1,0.3c-0.3,0.3-3.3,1.1-8.3,1.4c-0.7,0-1.4,0-2.1,0c-4.5,0-7.8-0.6-8.2-1
		c0.8-0.5,1.7-0.7,2.6-0.8c0.1,0,0.2-0.2,0.2-0.3c0-0.1-0.1-0.2-0.3-0.2H16c-2,0.1-4.4,0.4-4.5,1.5c0,0.3,0.1,0.6,0.3,0.9
		C12.3,36.6,13.9,37.4,21.3,37.5L21.3,37.5z"/>
	<path class="st4" d="M34.6,35.6c-0.1,0-0.2,0-0.3,0.1c0,0-1.1,1.2-4.4,1.8c-2.3,0.3-4.7,0.4-7,0.4c-3.4,0-6.6-0.1-6.6-0.1
		c-0.1,0-0.3,0.1-0.3,0.3c0,0.1,0.1,0.2,0.2,0.2c2.6,0.5,5.3,0.8,8,0.8c2.2,0,4.3-0.2,6.4-0.5c3.8-0.7,4.1-2.5,4.1-2.6
		C34.7,35.8,34.7,35.7,34.6,35.6z"/>
</g>
<path class="st5" d="M22.5,23.2c0.1,0.1,0.3,0.1,0.4,0c0.1-0.1,0.1-0.2,0-0.3c0,0-1.7-3.3-1.6-5.7c0-0.8,1.2-1.8,2.4-2.7
	c1.2-0.9,2.2-1.9,3.1-3.1c0.9-1.7,0.9-3.7-0.2-5.3c-0.1-0.1-0.2-0.2-0.4-0.1C26.1,6,26,6.1,26,6.2c0.2,1.2,0,2.4-0.6,3.5
	c-0.6,0.8-1.4,1.5-2.3,2.1c-1.7,1-3.1,2.4-4,4.1C17.5,19.3,22.3,23,22.5,23.2z"/>
<path class="st5" d="M22.9,17.6c0,1.3,0.5,2.6,1.4,3.6c0.2,0.2,0.4,0.5,0.5,0.7c0.1,0.7-0.1,1.4-0.4,2.1c-0.1,0.1,0,0.3,0.1,0.3
	c0.1,0,0.2,0,0.3,0c0.1-0.1,2.5-1.7,2-3.7c-0.2-0.7-0.5-1.3-0.9-1.8c-0.5-0.8-0.9-1.3-0.3-2.3c0.7-1.2,3.6-3.4,3.7-3.5
	c0.1-0.1,0.1-0.2,0.1-0.4c-0.1-0.1-0.2-0.1-0.3-0.1C28.8,12.6,22.9,14.9,22.9,17.6z"/>
<path class="st5" d="M20.5,26.6L20.5,26.6H22c5.5-0.2,7.5-1.9,7.6-2c0.1-0.1,0.1-0.3,0-0.4c-0.1-0.1-0.2-0.1-0.3-0.1
	c-2.7,0.5-5.4,0.8-8.1,0.7c-1.5,0.1-3.1,0-4.6-0.4c0.8-0.5,1.7-0.9,2.7-1c0.1,0,0.2-0.2,0.2-0.3c0-0.1-0.1-0.2-0.2-0.2
	c-0.8,0-4.9,0.1-5.3,1.3c-0.1,0.3,0,0.6,0.1,0.9C14.8,26.2,17.1,26.6,20.5,26.6z"/>
<path class="st5" d="M29.8,28.9c-0.1,0.1-0.2,0.2-0.1,0.4c0,0.1,0.1,0.1,0.2,0.1H30c0.2,0,5.6-1.2,5-4.4c-0.1-1.3-1.2-2.4-2.5-2.3
	c-0.8,0-1.6,0.2-2.3,0.6c-0.1,0.1-0.2,0.2-0.1,0.4c0,0.1,0.1,0.1,0.2,0.1c0,0,2.4,0,2.6,1.4C33.2,26.3,30.7,28.2,29.8,28.9z"/>
<path class="st5" d="M28.8,28.5c0-0.1,0-0.2-0.1-0.3l-1.3-0.9c-0.1,0-0.2,0-0.2,0c-1.1,0.3-2.2,0.5-3.3,0.6C23,28,22.2,28,21.4,28
	c-1.2,0.1-2.3-0.1-3.4-0.4c0,0,0-0.1,0-0.1c0.1-0.1,0.2-0.2,0.3-0.2c0.1,0,0.2-0.2,0.2-0.3c0-0.1-0.2-0.2-0.3-0.2
	c-1.3,0.3-1.9,0.8-1.9,1.3c0.1,1,2.3,1.5,4.2,1.6c0.3,0,0.6,0,0.9,0l0,0c2.4-0.1,4.9-0.4,7.3-1C28.7,28.7,28.8,28.6,28.8,28.5z"/>
<path class="st5" d="M19.2,30.3c0-0.1-0.1-0.2-0.2-0.2c-0.2,0-1.7,0.1-1.8,1c0,0.3,0.1,0.6,0.2,0.8c0.5,0.6,2,1,4.5,1.2h0.9
	c1.8,0,3.7-0.3,5.4-1c0.1-0.1,0.2-0.2,0.1-0.4c0,0-0.1-0.1-0.1-0.1l-1.6-1c-0.1,0-0.1,0-0.2,0c0,0-1,0.2-2.6,0.4
	c-0.4,0-0.7,0.1-1.1,0.1c-1.2,0-2.5-0.1-3.7-0.4c0,0,0-0.1,0-0.1C19.1,30.5,19.2,30.4,19.2,30.3z"/>
<path class="st5" d="M21.3,36.1c7.2,0,11.1-1.3,11.9-2.1c0.2-0.2,0.3-0.5,0.3-0.7c-0.1-0.3-0.2-0.6-0.5-0.7c-0.1-0.1-0.2-0.1-0.3,0
	c-0.1,0.1-0.1,0.2,0,0.3c0,0.1,0.1,0.2-0.1,0.3c-0.3,0.3-3.3,1.1-8.3,1.4c-0.7,0-1.4,0-2.1,0c-4.5,0-7.8-0.6-8.2-1
	c0.8-0.5,1.7-0.7,2.6-0.8c0.1,0,0.2-0.2,0.2-0.3c0-0.1-0.1-0.2-0.3-0.2H16c-2,0.1-4.4,0.4-4.5,1.5c0,0.3,0.1,0.6,0.3,0.9
	C12.3,35.2,13.9,36,21.3,36.1L21.3,36.1z"/>
<path class="st5" d="M34.6,34.2c-0.1,0-0.2,0-0.3,0.1c0,0-1.1,1.2-4.4,1.8c-2.3,0.3-4.7,0.4-7,0.4c-3.4,0-6.6-0.1-6.6-0.1
	c-0.1,0-0.3,0.1-0.3,0.3c0,0.1,0.1,0.2,0.2,0.2c2.6,0.5,5.3,0.8,8,0.8c2.2,0,4.3-0.2,6.4-0.5c3.8-0.7,4.1-2.5,4.1-2.6
	C34.7,34.4,34.7,34.3,34.6,34.2z"/>
</svg>
