<?xml version="1.0" encoding="utf-8"?>
<!-- Generator: Adobe Illustrator 21.0.0, SVG Export Plug-In . SVG Version: 6.00 Build 0)  -->
<svg version="1.1" id="katman_1" xmlns="http://www.w3.org/2000/svg" xmlns:xlink="http://www.w3.org/1999/xlink" x="0px" y="0px"
	 viewBox="0 0 15.5 16" style="enable-background:new 0 0 15.5 16;" xml:space="preserve">
<style type="text/css">
	.st0{fill:url(#SVGID_1_);}
	.st1{fill:#F2F2F2;}
	.st2{opacity:0.1;fill:#FFFFFF;enable-background:new    ;}
	.st3{opacity:0.1;enable-background:new    ;}
</style>
<title>system-lock-screen_5</title>
<radialGradient id="SVGID_1_" cx="7.76" cy="7.97" r="7.76" gradientTransform="matrix(1 0 0 -1 0 15.73)" gradientUnits="userSpaceOnUse">
	<stop  offset="0" style="stop-color:#74BB6F"/>
	<stop  offset="0.26" style="stop-color:#70BA6E"/>
	<stop  offset="0.51" style="stop-color:#65B769"/>
	<stop  offset="0.74" style="stop-color:#52B362"/>
	<stop  offset="0.97" style="stop-color:#38AC58"/>
	<stop  offset="1" style="stop-color:#34AB56"/>
</radialGradient>
<circle class="st0" cx="7.8" cy="7.8" r="7.8"/>
<path class="st1" d="M11.4,6.5h-0.7V5.8c0-1.6-1.3-2.9-2.9-3H7.7c-1.6,0.1-2.9,1.4-2.9,3v0.7H4.1c-0.2,0-0.4,0.2-0.4,0.4
	c0,0,0,0,0,0v5c0,0.2,0.2,0.4,0.4,0.4h7.3c0.2,0,0.4-0.2,0.4-0.4v-5C11.8,6.7,11.6,6.5,11.4,6.5L11.4,6.5z M5.9,5.8
	c0-1,0.8-1.8,1.8-1.8s1.8,0.8,1.8,1.8v0.7H5.9V5.8z M8.4,9.6v1.4c0,0.2-0.1,0.3-0.3,0.3H7.4c-0.2,0-0.3-0.1-0.3-0.3V9.6
	c-0.3-0.3-0.3-0.8,0-1.2c0.1-0.1,0.3-0.2,0.5-0.2h0.2c0.5,0,0.8,0.4,0.7,0.9C8.6,9.3,8.5,9.4,8.4,9.6z"/>
<path class="st2" d="M7.8,0.5c4.2,0,7.6,3.3,7.8,7.5c0-0.1,0-0.2,0-0.2c-0.2-4.3-3.8-7.6-8-7.5C3.4,0.4,0.1,3.7,0,7.8
	C0,7.8,0,7.9,0,8C0.1,3.8,3.6,0.5,7.8,0.5z"/>
<path class="st3" d="M7.8,15.5C3.6,15.5,0.1,12.2,0,8c0,0.1,0,0.2,0,0.2C0,12.5,3.5,16,7.8,16s7.8-3.5,7.8-7.8c0-0.1,0-0.2,0-0.2
	C15.4,12.2,12,15.5,7.8,15.5z"/>
<path class="st3" d="M11.4,12.2H4.1c-0.2,0-0.4-0.2-0.4-0.4v0.5c0,0.2,0.2,0.4,0.4,0.4h7.3c0.2,0,0.4-0.2,0.4-0.4v-0.5
	C11.8,12.1,11.6,12.2,11.4,12.2z"/>
<path class="st3" d="M7.8,3.9c-1,0-1.9,0.8-1.9,1.8c0,0,0,0,0,0v0.5c0-1,0.8-1.8,1.8-1.8s1.8,0.8,1.8,1.8V5.8
	C9.6,4.8,8.8,3.9,7.8,3.9C7.8,3.9,7.8,3.9,7.8,3.9z"/>
<path class="st3" d="M7.8,8.2H7.7C7.2,8.2,6.9,8.6,6.9,9c0,0.1,0,0.2,0,0.2C7,8.9,7.3,8.7,7.6,8.7h0.2c0.3,0,0.6,0.2,0.7,0.6
	c0-0.1,0.1-0.2,0.1-0.2C8.6,8.6,8.3,8.2,7.8,8.2z"/>
</svg>
