<?xml version="1.0" encoding="utf-8"?>
<!-- Generator: Adobe Illustrator 21.0.0, SVG Export Plug-In . SVG Version: 6.00 Build 0)  -->
<svg version="1.1" id="katman_1" xmlns="http://www.w3.org/2000/svg" xmlns:xlink="http://www.w3.org/1999/xlink" x="0px" y="0px"
	 viewBox="0 0 21.4 22" style="enable-background:new 0 0 21.4 22;" xml:space="preserve">
<style type="text/css">
	.st0{fill:#333333;}
	.st1{fill:url(#SVGID_1_);}
	.st2{opacity:0.2;fill:#FFFFFF;enable-background:new    ;}
	.st3{opacity:0.2;enable-background:new    ;}
	.st4{opacity:0.5;enable-background:new    ;}
	.st5{fill:url(#SVGID_2_);}
	.st6{fill:url(#SVGID_3_);}
	.st7{opacity:0.65;enable-background:new    ;}
</style>
<title>avatar-default_4</title>
<path class="st0" d="M10.7,21.4C4.8,21.4,0,16.6,0,10.7S4.8,0,10.7,0s10.7,4.8,10.7,10.7l0,0C21.4,16.6,16.6,21.4,10.7,21.4z"/>
<linearGradient id="SVGID_1_" gradientUnits="userSpaceOnUse" x1="10.69" y1="0.69" x2="10.69" y2="21.94" gradientTransform="matrix(1 0 0 -1 0 21.73)">
	<stop  offset="0" style="stop-color:#DD922E"/>
	<stop  offset="6.000000e-02" style="stop-color:#F9AE42"/>
	<stop  offset="0.42" style="stop-color:#F8DB6E"/>
	<stop  offset="1" style="stop-color:#FDDEB1"/>
</linearGradient>
<circle class="st1" cx="10.7" cy="10.7" r="10.6"/>
<path class="st2" d="M10.6,0.8c5.8,0,10.6,4.7,10.6,10.5c0-0.2,0-0.4,0-0.6c0-5.9-4.7-10.6-10.6-10.6S0,4.8,0,10.7c0,0,0,0,0,0.1
	C0.4,5.1,5,0.8,10.6,0.8z"/>
<path class="st3" d="M10.7,21.3c-5.8,0-10.6-4.7-10.6-10.5c0,0.2,0,0.4,0,0.6C0.1,17.2,4.8,22,10.7,22s10.6-4.7,10.6-10.6
	c0,0,0,0,0-0.1C20.9,16.9,16.3,21.3,10.7,21.3z"/>
<circle class="st4" cx="10.5" cy="6.1" r="4.1"/>
<radialGradient id="SVGID_2_" cx="10.49" cy="15.64" r="5.39" gradientTransform="matrix(1 0 0 -1 0 21.73)" gradientUnits="userSpaceOnUse">
	<stop  offset="0" style="stop-color:#E7E6E6"/>
	<stop  offset="0.26" style="stop-color:#E3E3E3"/>
	<stop  offset="0.49" style="stop-color:#D9D8D8"/>
	<stop  offset="0.72" style="stop-color:#C6C6C6"/>
	<stop  offset="0.93" style="stop-color:#ADAEAE"/>
	<stop  offset="1" style="stop-color:#A3A4A4"/>
</radialGradient>
<circle class="st5" cx="10.5" cy="6.1" r="4"/>
<path class="st4" d="M10.7,21.4c-3.5,0-6.8-1.7-8.8-4.6l0,0v0c1.5-4.8,6.7-7.4,11.5-5.8c2.9,0.9,5.1,3.3,6,6.2v0l0,0
	C17.2,19.8,14.1,21.4,10.7,21.4z"/>
<radialGradient id="SVGID_3_" cx="11.05" cy="8.57" r="9.09" gradientTransform="matrix(1 0 0 -1 0 21.73)" gradientUnits="userSpaceOnUse">
	<stop  offset="0" style="stop-color:#E7E6E6"/>
	<stop  offset="0.26" style="stop-color:#E3E3E3"/>
	<stop  offset="0.49" style="stop-color:#D9D8D8"/>
	<stop  offset="0.72" style="stop-color:#C6C6C6"/>
	<stop  offset="0.93" style="stop-color:#ADAEAE"/>
	<stop  offset="1" style="stop-color:#A3A4A4"/>
</radialGradient>
<path class="st6" d="M10.5,10.5L10.5,10.5c-3.9,0-7.3,2.5-8.5,6.2c3.3,4.8,9.9,6,14.7,2.7c0.9-0.6,1.8-1.4,2.4-2.3
	C18.1,13.2,14.5,10.5,10.5,10.5z"/>
<ellipse transform="matrix(0.4465 -0.8948 0.8948 0.4465 -11.1103 19.8997)" class="st7" cx="10.5" cy="18.9" rx="1" ry="1"/>
<ellipse transform="matrix(0.1551 -0.9879 0.9879 0.1551 -6.8734 23.7705)" class="st7" cx="10.5" cy="15.9" rx="1.2" ry="0.6"/>
<ellipse transform="matrix(0.4465 -0.8948 0.8948 0.4465 -11.1039 17.4792)" class="st7" cx="8.6" cy="17.7" rx="0.6" ry="0.7"/>
</svg>
