<?xml version="1.0" encoding="utf-8"?>
<!-- Generator: Adobe Illustrator 21.0.0, SVG Export Plug-In . SVG Version: 6.00 Build 0)  -->
<svg version="1.1" id="katman_1" xmlns="http://www.w3.org/2000/svg" xmlns:xlink="http://www.w3.org/1999/xlink" x="0px" y="0px"
	 viewBox="0 0 16 15.8" style="enable-background:new 0 0 16 15.8;" xml:space="preserve">
<style type="text/css">
	.st0{opacity:0.7;fill:#1A1A1A;enable-background:new    ;}
	.st1{fill:url(#SVGID_1_);}
	.st2{opacity:0.5;}
	.st3{fill:url(#SVGID_2_);}
	.st4{fill:url(#SVGID_3_);}
	.st5{fill:url(#SVGID_4_);}
	.st6{fill:url(#SVGID_5_);}
	.st7{fill:url(#SVGID_6_);}
	.st8{fill:url(#SVGID_7_);}
	.st9{fill:url(#SVGID_8_);}
	.st10{fill:url(#SVGID_9_);}
	.st11{fill:url(#SVGID_10_);}
	.st12{fill:url(#SVGID_11_);}
	.st13{fill:url(#SVGID_12_);}
	.st14{opacity:0.2;enable-background:new    ;}
	.st15{opacity:0.1;fill:#FFFFFF;enable-background:new    ;}
</style>
<title>network-server_5</title>
<path class="st0" d="M0.8,10.1h14.3c0.5,0,0.8,0.4,0.8,0.8v3.7c0,0.5-0.4,0.8-0.8,0.8H0.8c-0.5,0-0.8-0.4-0.8-0.8V11
	C0,10.5,0.4,10.1,0.8,10.1z"/>
<linearGradient id="SVGID_1_" gradientUnits="userSpaceOnUse" x1="7.995" y1="2.73" x2="7.995" y2="7.86" gradientTransform="matrix(1 0 0 -1 0 18)">
	<stop  offset="0" style="stop-color:#A3A4A4"/>
	<stop  offset="0.39" style="stop-color:#C3C4C4"/>
	<stop  offset="0.77" style="stop-color:#DDDDDD"/>
	<stop  offset="1" style="stop-color:#E7E6E6"/>
</linearGradient>
<path class="st1" d="M0.8,10.2h14.4c0.4,0,0.7,0.3,0.7,0.7v3.7c0,0.4-0.3,0.7-0.7,0.7H0.8c-0.4,0-0.7-0.3-0.7-0.7v-3.7
	C0.1,10.6,0.4,10.2,0.8,10.2z"/>
<g class="st2">
	<path d="M4.6,14c-0.2,0-0.4-0.2-0.4-0.4c0-0.1,0-0.1,0.1-0.2l1.1-1.7c0.1-0.2,0.3-0.3,0.5-0.2c0.2,0.1,0.3,0.3,0.2,0.5
		c0,0,0,0,0,0.1l-1.1,1.7C4.9,13.9,4.7,14,4.6,14z"/>
</g>
<g class="st2">
	<path d="M2.9,14c-0.2,0-0.4-0.2-0.4-0.4c0-0.1,0-0.1,0.1-0.2l1.1-1.7c0.1-0.2,0.3-0.3,0.5-0.2c0.2,0.1,0.3,0.3,0.2,0.5
		c0,0,0,0,0,0.1l-1.1,1.7C3.2,13.9,3.1,14,2.9,14z"/>
</g>
<g class="st2">
	<path d="M1.2,14c-0.2,0-0.4-0.2-0.4-0.4c0-0.1,0-0.1,0.1-0.2l1.1-1.7c0.1-0.2,0.3-0.3,0.5-0.2c0.2,0.1,0.3,0.3,0.2,0.5
		c0,0,0,0,0,0.1l-1.1,1.7C1.5,13.9,1.4,14,1.2,14z"/>
</g>
<g class="st2">
	<path d="M6.3,14c-0.2,0-0.4-0.2-0.4-0.4c0-0.1,0-0.2,0.1-0.2l1.1-1.7c0.1-0.2,0.3-0.3,0.5-0.2c0.2,0.1,0.3,0.3,0.2,0.5
		c0,0,0,0,0,0.1l-1.1,1.7C6.6,13.9,6.4,14,6.3,14z"/>
</g>
<radialGradient id="SVGID_2_" cx="10.39" cy="6.2" r="0.7" gradientTransform="matrix(1 0 0 -1 0 18)" gradientUnits="userSpaceOnUse">
	<stop  offset="0" style="stop-color:#6FC379"/>
	<stop  offset="0.23" style="stop-color:#6BC175"/>
	<stop  offset="0.47" style="stop-color:#5EBC6A"/>
	<stop  offset="0.71" style="stop-color:#49B456"/>
	<stop  offset="0.96" style="stop-color:#2CA93C"/>
	<stop  offset="1" style="stop-color:#27A737"/>
</radialGradient>
<circle class="st3" cx="10.4" cy="11.8" r="0.7"/>
<radialGradient id="SVGID_3_" cx="12.36" cy="6.2" r="0.7" gradientTransform="matrix(1 0 0 -1 0 18)" gradientUnits="userSpaceOnUse">
	<stop  offset="0" style="stop-color:#FCE182"/>
	<stop  offset="0.15" style="stop-color:#FCE07D"/>
	<stop  offset="0.33" style="stop-color:#FCDD6E"/>
	<stop  offset="0.53" style="stop-color:#FDD856"/>
	<stop  offset="0.74" style="stop-color:#FDD235"/>
	<stop  offset="0.96" style="stop-color:#FEC90A"/>
	<stop  offset="1" style="stop-color:#FEC700"/>
</radialGradient>
<circle class="st4" cx="12.4" cy="11.8" r="0.7"/>
<radialGradient id="SVGID_4_" cx="14.33" cy="6.2" r="0.7" gradientTransform="matrix(1 0 0 -1 0 18)" gradientUnits="userSpaceOnUse">
	<stop  offset="0" style="stop-color:#EE8961"/>
	<stop  offset="0.28" style="stop-color:#EE875E"/>
	<stop  offset="0.49" style="stop-color:#ED8055"/>
	<stop  offset="0.67" style="stop-color:#EC7545"/>
	<stop  offset="0.83" style="stop-color:#EA652F"/>
	<stop  offset="0.99" style="stop-color:#E85012"/>
	<stop  offset="1" style="stop-color:#E84E0F"/>
</radialGradient>
<circle class="st5" cx="14.3" cy="11.8" r="0.7"/>
<path class="st0" d="M0.8,5.1h14.3c0.5,0,0.8,0.4,0.8,0.8v3.7c0,0.5-0.4,0.8-0.8,0.8H0.8C0.4,10.4,0,10,0,9.5V5.9
	C0,5.4,0.4,5.1,0.8,5.1z"/>
<linearGradient id="SVGID_5_" gradientUnits="userSpaceOnUse" x1="7.995" y1="7.86" x2="7.995" y2="12.89" gradientTransform="matrix(1 0 0 -1 0 18)">
	<stop  offset="0" style="stop-color:#A3A4A4"/>
	<stop  offset="0.39" style="stop-color:#C3C4C4"/>
	<stop  offset="0.77" style="stop-color:#DDDDDD"/>
	<stop  offset="1" style="stop-color:#E7E6E6"/>
</linearGradient>
<path class="st6" d="M0.8,5.2h14.4c0.4,0,0.7,0.3,0.7,0.7v3.7c0,0.4-0.3,0.7-0.7,0.7H0.8c-0.4,0-0.7-0.3-0.7-0.7V5.9
	C0.1,5.5,0.4,5.2,0.8,5.2z"/>
<g class="st2">
	<path d="M4.6,8.9c-0.2,0-0.4-0.2-0.4-0.4c0-0.1,0-0.1,0.1-0.2l1.1-1.7c0.1-0.2,0.4-0.2,0.5,0c0.1,0.1,0.2,0.3,0.1,0.5L4.9,8.8
		C4.9,8.9,4.7,8.9,4.6,8.9z"/>
</g>
<g class="st2">
	<path d="M2.9,8.9c-0.2,0-0.4-0.2-0.4-0.4c0-0.1,0-0.1,0.1-0.2l1.1-1.7c0.1-0.2,0.4-0.2,0.5,0c0.1,0.1,0.2,0.3,0.1,0.5L3.2,8.8
		C3.2,8.9,3.1,8.9,2.9,8.9z"/>
</g>
<g class="st2">
	<path d="M1.2,8.9C1,8.9,0.9,8.8,0.9,8.6c0-0.1,0-0.1,0.1-0.2l1.1-1.7c0.1-0.2,0.4-0.2,0.5,0c0.1,0.1,0.2,0.3,0.1,0.5L1.6,8.8
		C1.5,8.9,1.4,8.9,1.2,8.9z"/>
</g>
<g class="st2">
	<path d="M6.3,8.9c-0.2,0-0.4-0.2-0.4-0.4c0-0.1,0-0.1,0.1-0.2l1.1-1.7c0.1-0.2,0.4-0.2,0.5,0c0.1,0.1,0.2,0.3,0.1,0.5L6.6,8.8
		C6.5,8.9,6.4,8.9,6.3,8.9z"/>
</g>
<radialGradient id="SVGID_6_" cx="10.39" cy="11.27" r="0.7" gradientTransform="matrix(1 0 0 -1 0 18)" gradientUnits="userSpaceOnUse">
	<stop  offset="0" style="stop-color:#6FC379"/>
	<stop  offset="0.23" style="stop-color:#6BC175"/>
	<stop  offset="0.47" style="stop-color:#5EBC6A"/>
	<stop  offset="0.71" style="stop-color:#49B456"/>
	<stop  offset="0.96" style="stop-color:#2CA93C"/>
	<stop  offset="1" style="stop-color:#27A737"/>
</radialGradient>
<circle class="st7" cx="10.4" cy="6.7" r="0.7"/>
<radialGradient id="SVGID_7_" cx="12.36" cy="11.27" r="0.7" gradientTransform="matrix(1 0 0 -1 0 18)" gradientUnits="userSpaceOnUse">
	<stop  offset="0" style="stop-color:#FCE182"/>
	<stop  offset="0.15" style="stop-color:#FCE07D"/>
	<stop  offset="0.33" style="stop-color:#FCDD6E"/>
	<stop  offset="0.53" style="stop-color:#FDD856"/>
	<stop  offset="0.74" style="stop-color:#FDD235"/>
	<stop  offset="0.96" style="stop-color:#FEC90A"/>
	<stop  offset="1" style="stop-color:#FEC700"/>
</radialGradient>
<circle class="st8" cx="12.4" cy="6.7" r="0.7"/>
<radialGradient id="SVGID_8_" cx="14.33" cy="11.27" r="0.7" gradientTransform="matrix(1 0 0 -1 0 18)" gradientUnits="userSpaceOnUse">
	<stop  offset="0" style="stop-color:#EE8961"/>
	<stop  offset="0.28" style="stop-color:#EE875E"/>
	<stop  offset="0.49" style="stop-color:#ED8055"/>
	<stop  offset="0.67" style="stop-color:#EC7545"/>
	<stop  offset="0.83" style="stop-color:#EA652F"/>
	<stop  offset="0.99" style="stop-color:#E85012"/>
	<stop  offset="1" style="stop-color:#E84E0F"/>
</radialGradient>
<circle class="st9" cx="14.3" cy="6.7" r="0.7"/>
<path class="st0" d="M0.8,0h14.3C15.6,0,16,0.4,16,0.8v3.7c0,0.5-0.4,0.8-0.8,0.8H0.8C0.4,5.3,0,4.9,0,4.5V0.8C0,0.4,0.4,0,0.8,0z"
	/>
<linearGradient id="SVGID_9_" gradientUnits="userSpaceOnUse" x1="7.995" y1="12.82" x2="7.995" y2="18.39" gradientTransform="matrix(1 0 0 -1 0 18)">
	<stop  offset="0" style="stop-color:#A3A4A4"/>
	<stop  offset="0.39" style="stop-color:#C3C4C4"/>
	<stop  offset="0.77" style="stop-color:#DDDDDD"/>
	<stop  offset="1" style="stop-color:#E7E6E6"/>
</linearGradient>
<path class="st10" d="M0.8,0.1h14.4c0.4,0,0.7,0.3,0.7,0.7v3.7c0,0.4-0.3,0.7-0.7,0.7H0.8c-0.4,0-0.7-0.3-0.7-0.7V0.8
	C0.1,0.4,0.4,0.1,0.8,0.1z"/>
<g class="st2">
	<path d="M4.6,3.9c-0.2,0-0.4-0.2-0.4-0.4c0-0.1,0-0.1,0.1-0.2l1.1-1.7c0.1-0.2,0.4-0.2,0.5,0C6.1,1.7,6.1,1.8,6.1,2L4.9,3.7
		C4.9,3.8,4.7,3.9,4.6,3.9z"/>
</g>
<g class="st2">
	<path d="M2.9,3.9c-0.2,0-0.4-0.2-0.4-0.4c0-0.1,0-0.1,0.1-0.2l1.1-1.7c0.1-0.2,0.4-0.2,0.5,0C4.4,1.7,4.4,1.8,4.4,2L3.2,3.7
		C3.2,3.8,3.1,3.9,2.9,3.9z"/>
</g>
<g class="st2">
	<path d="M1.2,3.9C1,3.9,0.9,3.7,0.9,3.5c0-0.1,0-0.1,0.1-0.2l1.1-1.7c0.1-0.1,0.4-0.1,0.5,0C2.7,1.7,2.7,1.9,2.7,2L1.6,3.7
		C1.5,3.8,1.4,3.9,1.2,3.9z"/>
</g>
<g class="st2">
	<path d="M6.3,3.9c-0.2,0-0.4-0.2-0.4-0.4c0-0.1,0-0.2,0.1-0.2l1.1-1.7c0.1-0.1,0.4-0.1,0.5,0C7.8,1.7,7.8,1.9,7.7,2L6.6,3.7
		C6.6,3.8,6.4,3.9,6.3,3.9z"/>
</g>
<radialGradient id="SVGID_10_" cx="10.11" cy="16.33" r="0.7" gradientTransform="matrix(1 0 0 -1 0 18)" gradientUnits="userSpaceOnUse">
	<stop  offset="0" style="stop-color:#6FC379"/>
	<stop  offset="0.23" style="stop-color:#6BC175"/>
	<stop  offset="0.47" style="stop-color:#5EBC6A"/>
	<stop  offset="0.71" style="stop-color:#49B456"/>
	<stop  offset="0.96" style="stop-color:#2CA93C"/>
	<stop  offset="1" style="stop-color:#27A737"/>
</radialGradient>
<circle class="st11" cx="10.1" cy="1.7" r="0.7"/>
<radialGradient id="SVGID_11_" cx="12.36" cy="16.33" r="0.7" gradientTransform="matrix(1 0 0 -1 0 18)" gradientUnits="userSpaceOnUse">
	<stop  offset="0" style="stop-color:#FCE182"/>
	<stop  offset="0.15" style="stop-color:#FCE07D"/>
	<stop  offset="0.33" style="stop-color:#FCDD6E"/>
	<stop  offset="0.53" style="stop-color:#FDD856"/>
	<stop  offset="0.74" style="stop-color:#FDD235"/>
	<stop  offset="0.96" style="stop-color:#FEC90A"/>
	<stop  offset="1" style="stop-color:#FEC700"/>
</radialGradient>
<circle class="st12" cx="12.4" cy="1.7" r="0.7"/>
<radialGradient id="SVGID_12_" cx="14.33" cy="16.33" r="0.7" gradientTransform="matrix(1 0 0 -1 0 18)" gradientUnits="userSpaceOnUse">
	<stop  offset="0" style="stop-color:#EE8961"/>
	<stop  offset="0.28" style="stop-color:#EE875E"/>
	<stop  offset="0.49" style="stop-color:#ED8055"/>
	<stop  offset="0.67" style="stop-color:#EC7545"/>
	<stop  offset="0.83" style="stop-color:#EA652F"/>
	<stop  offset="0.99" style="stop-color:#E85012"/>
	<stop  offset="1" style="stop-color:#E84E0F"/>
</radialGradient>
<circle class="st13" cx="14.3" cy="1.7" r="0.7"/>
<path class="st14" d="M15.2,15.3H0.8c-0.4,0-0.7-0.3-0.7-0.7v0.5c0,0.4,0.3,0.7,0.7,0.7h14.3c0.4,0,0.7-0.3,0.7-0.7v-0.5
	C15.9,15,15.6,15.3,15.2,15.3z"/>
<path class="st15" d="M6,12.1L6,12.1L6,12.1c0.2-0.1,0.2-0.3,0-0.5c-0.2-0.1-0.4-0.1-0.5,0c0,0,0,0,0,0.1l-1.1,1.6
	c-0.1,0.1-0.1,0.3,0,0.4l1.1-1.6C5.5,12,5.7,12,6,12.1C5.9,12.1,6,12.1,6,12.1z"/>
<path class="st15" d="M4.3,12.1L4.3,12.1L4.3,12.1c0.2-0.1,0.2-0.3,0-0.5c-0.2-0.1-0.4-0.1-0.5,0c0,0,0,0,0,0.1l-1.1,1.6
	c-0.1,0.1-0.1,0.3,0,0.4l1.1-1.6C3.8,12.1,4,12,4.3,12.1C4.2,12.1,4.3,12.1,4.3,12.1z"/>
<path class="st15" d="M2.6,12.1L2.6,12.1L2.6,12.1c0.2-0.1,0.2-0.3,0-0.5c-0.2-0.1-0.4-0.1-0.5,0c0,0,0,0,0,0.1l-1.1,1.6
	c-0.1,0.1-0.1,0.3,0,0.4L2,12.2C2.1,12.1,2.4,12,2.6,12.1C2.6,12.1,2.6,12.1,2.6,12.1z"/>
<path class="st15" d="M7.6,12.1L7.6,12.1L7.6,12.1c0.2-0.1,0.2-0.3,0-0.5c-0.2-0.1-0.4-0.1-0.5,0c0,0,0,0,0,0.1L6,13.4
	c-0.1,0.1-0.1,0.3,0,0.4l1.1-1.6C7.2,12.1,7.4,12,7.6,12.1C7.6,12.1,7.6,12.1,7.6,12.1z"/>
<path class="st14" d="M6,12.2l-1.1,1.6C4.8,14,4.6,14,4.4,13.9l-0.1-0.1l0,0c-0.1,0.2-0.1,0.4,0,0.5c0.2,0.1,0.4,0.1,0.5,0
	c0,0,0,0,0-0.1l1.1-1.7C6.1,12.4,6.1,12.3,6,12.2z"/>
<path class="st14" d="M4.3,12.2l-1.1,1.6C3.1,14,2.9,14,2.7,13.9l-0.1-0.1l0,0c-0.1,0.2-0.1,0.4,0,0.5c0.2,0.1,0.4,0.1,0.5,0
	c0,0,0,0,0-0.1l1.1-1.7C4.5,12.4,4.4,12.3,4.3,12.2z"/>
<path class="st14" d="M2.7,12.2l-1.1,1.6C1.4,14,1.2,14,1,13.9l0-0.1l0,0c-0.1,0.2-0.1,0.4,0,0.5c0.2,0.1,0.4,0.1,0.5,0
	c0,0,0,0,0-0.1l1.1-1.7C2.8,12.5,2.8,12.3,2.7,12.2z"/>
<path class="st14" d="M6.6,13.8C6.5,14,6.3,14,6.1,13.9L6,13.9l0,0c-0.1,0.2-0.1,0.4,0,0.5c0.2,0.1,0.4,0.1,0.5,0c0,0,0,0,0-0.1
	l1.1-1.7c0.1-0.1,0.1-0.3,0-0.4L6.6,13.8z"/>
<path class="st15" d="M10.4,11.6c0.3,0,0.5,0.2,0.6,0.4c0.1-0.4,0-0.8-0.4-0.9c-0.4-0.1-0.8,0-0.9,0.4c-0.1,0.2-0.1,0.3,0,0.5
	C9.8,11.7,10.1,11.6,10.4,11.6z"/>
<path class="st14" d="M10.4,12.5c-0.3,0-0.6-0.2-0.7-0.5c-0.2,0.4,0,0.8,0.3,0.9c0.4,0.2,0.8,0,0.9-0.3c0.1-0.2,0.1-0.4,0-0.6
	C10.9,12.3,10.7,12.5,10.4,12.5z"/>
<path class="st15" d="M12.4,11.6c0.3,0,0.5,0.2,0.6,0.4c0.1-0.4,0-0.8-0.4-0.9c-0.4-0.1-0.8,0-0.9,0.4c-0.1,0.2-0.1,0.3,0,0.5
	C11.8,11.7,12.1,11.6,12.4,11.6z"/>
<path class="st14" d="M12.4,12.5c-0.3,0-0.6-0.2-0.7-0.5c-0.1,0.4,0,0.8,0.4,0.9c0.4,0.1,0.8,0,0.9-0.4c0.1-0.2,0.1-0.4,0-0.5
	C12.9,12.3,12.7,12.5,12.4,12.5z"/>
<path class="st15" d="M14.3,11.6c0.3,0,0.6,0.1,0.7,0.4c0.1-0.4,0-0.8-0.4-0.9c-0.4-0.1-0.8,0-0.9,0.4c-0.1,0.2-0.1,0.3,0,0.5
	C13.8,11.7,14.1,11.6,14.3,11.6z"/>
<path class="st14" d="M14.3,12.5c-0.3,0-0.6-0.2-0.7-0.5c-0.1,0.4,0.1,0.8,0.5,0.9c0.4,0.1,0.8-0.1,0.9-0.5c0-0.1,0-0.3,0-0.4
	C14.9,12.3,14.6,12.5,14.3,12.5z"/>
<path class="st14" d="M15.2,10.2H0.8c-0.4,0-0.7-0.3-0.7-0.7V10c0,0.4,0.3,0.7,0.7,0.7h14.3c0.4,0,0.7-0.3,0.7-0.7V9.6
	C15.9,9.9,15.6,10.2,15.2,10.2z"/>
<path class="st15" d="M6,7.1L6,7.1L6,7.1c0.1-0.1,0-0.3-0.2-0.4c-0.2-0.1-0.3,0-0.5,0.1L4.3,8.4c-0.1,0.1-0.1,0.3,0,0.4l1.1-1.6
	C5.5,7,5.8,6.9,6,7.1C6,7,6,7,6,7.1z"/>
<path class="st15" d="M4.3,7.1L4.3,7.1L4.3,7.1c0.2-0.1,0.1-0.3-0.1-0.4C4,6.6,3.8,6.6,3.7,6.7L2.6,8.4c-0.1,0.1-0.1,0.3,0,0.4
	l1.1-1.6C3.9,7,4.1,6.9,4.3,7.1C4.3,7.1,4.3,7.1,4.3,7.1z"/>
<path class="st15" d="M2.6,7.1L2.6,7.1L2.6,7.1c0.2-0.1,0.1-0.3-0.1-0.4C2.3,6.6,2.2,6.6,2,6.7L0.9,8.4C0.9,8.5,0.9,8.7,1,8.8
	l1.1-1.6C2.2,7,2.4,6.9,2.6,7.1z"/>
<path class="st15" d="M7.6,7.1L7.6,7.1L7.6,7.1c0.2-0.1,0.1-0.3-0.1-0.4c-0.2-0.1-0.3,0-0.5,0.1L6,8.4C5.9,8.5,5.9,8.7,6,8.8
	l1.1-1.6C7.2,7,7.5,6.9,7.6,7.1z"/>
<path class="st14" d="M6,7.1L4.9,8.8C4.8,8.9,4.6,9,4.4,8.9L4.3,8.8l0,0C4.2,9,4.2,9.2,4.4,9.3c0.2,0.1,0.4,0.1,0.5,0c0,0,0,0,0-0.1
	l1.1-1.6C6.1,7.4,6.1,7.2,6,7.1z"/>
<path class="st14" d="M4.3,7.1L3.2,8.8C3.1,8.9,2.9,9,2.7,8.9L2.7,8.8l0,0C2.5,9,2.5,9.2,2.7,9.3c0.2,0.1,0.4,0.1,0.5,0
	c0,0,0,0,0-0.1l1.1-1.6C4.5,7.4,4.5,7.2,4.3,7.1z"/>
<path class="st14" d="M2.7,7.1L1.6,8.8C1.4,8.9,1.2,9,1,8.9l0-0.1l0,0C0.9,9,0.9,9.2,1,9.3c0.2,0.1,0.4,0.1,0.5,0c0,0,0,0,0-0.1
	l1.1-1.6C2.8,7.4,2.8,7.2,2.7,7.1z"/>
<path class="st14" d="M6.6,8.8C6.5,8.9,6.3,9,6.1,8.9L6,8.8l0,0C5.9,9,5.9,9.2,6,9.3c0.2,0.1,0.4,0.1,0.5,0c0,0,0,0,0-0.1l1.1-1.6
	c0.1-0.1,0.1-0.3,0-0.4L6.6,8.8z"/>
<path class="st15" d="M10.4,6.5c0.3,0,0.5,0.2,0.6,0.5c0.2-0.4,0-0.8-0.3-0.9c-0.4-0.2-0.8,0-0.9,0.3C9.6,6.6,9.6,6.8,9.7,7
	C9.8,6.7,10.1,6.5,10.4,6.5z"/>
<path class="st14" d="M10.4,7.4c-0.3,0-0.6-0.2-0.7-0.4c-0.2,0.4,0,0.8,0.3,0.9c0.4,0.2,0.8,0,0.9-0.3c0.1-0.2,0.1-0.4,0-0.6
	C10.9,7.3,10.7,7.4,10.4,7.4z"/>
<path class="st15" d="M12.4,6.5c0.3,0,0.5,0.2,0.6,0.5c0.1-0.4,0-0.8-0.4-0.9c-0.4-0.1-0.8,0-0.9,0.4c-0.1,0.2-0.1,0.4,0,0.5
	C11.8,6.7,12.1,6.5,12.4,6.5z"/>
<path class="st14" d="M12.4,7.4c-0.3,0-0.6-0.2-0.7-0.4c-0.1,0.4,0,0.8,0.4,0.9c0.4,0.1,0.8,0,0.9-0.4c0.1-0.2,0.1-0.4,0-0.5
	C12.9,7.3,12.6,7.4,12.4,7.4z"/>
<path class="st15" d="M14.3,6.5c0.3,0,0.6,0.2,0.7,0.5c0.1-0.4,0-0.8-0.4-0.9c-0.4-0.1-0.8,0-0.9,0.4c-0.1,0.2-0.1,0.3,0,0.5
	C13.8,6.7,14,6.5,14.3,6.5z"/>
<path class="st14" d="M14.3,7.4c-0.3,0-0.6-0.2-0.7-0.4c-0.1,0.4,0.1,0.8,0.4,0.9C14.5,8,14.9,7.8,15,7.4c0-0.1,0-0.3,0-0.4
	C14.9,7.3,14.6,7.4,14.3,7.4z"/>
<path class="st15" d="M15.2,0.1H0.8c-0.4,0-0.7,0.3-0.7,0.7l0,0v0.5c0-0.4,0.3-0.7,0.7-0.7l0,0h14.3c0.4,0,0.7,0.3,0.7,0.7V0.8
	C15.9,0.4,15.6,0.1,15.2,0.1C15.2,0.1,15.2,0.1,15.2,0.1z"/>
<path class="st14" d="M15.2,5.2H0.8c-0.4,0-0.7-0.3-0.7-0.7V5c0,0.4,0.3,0.7,0.7,0.7h14.3c0.4,0,0.7-0.3,0.7-0.7V4.5
	C15.9,4.9,15.6,5.2,15.2,5.2C15.2,5.2,15.2,5.2,15.2,5.2z"/>
<path class="st15" d="M6,2L6,2L6,2c0.1-0.1,0-0.3-0.2-0.4c-0.2-0.1-0.3,0-0.5,0.1L4.3,3.3c-0.1,0.1-0.1,0.3,0,0.5l1.1-1.6
	C5.5,1.9,5.8,1.9,6,2C6,2,6,2,6,2z"/>
<path class="st15" d="M4.3,2L4.3,2L4.3,2c0.2-0.1,0.1-0.3-0.1-0.4C4,1.5,3.8,1.5,3.7,1.7L2.6,3.3c-0.1,0.1-0.1,0.3,0,0.5l1.1-1.6
	C3.9,1.9,4.1,1.9,4.3,2C4.3,2,4.3,2,4.3,2z"/>
<path class="st15" d="M2.6,2L2.6,2L2.6,2c0.2-0.1,0.1-0.3-0.1-0.4C2.3,1.5,2.2,1.5,2,1.7L0.9,3.3c-0.1,0.1-0.1,0.3,0,0.5l1.1-1.6
	C2.2,1.9,2.4,1.9,2.6,2z"/>
<path class="st15" d="M7.6,2L7.6,2L7.6,2c0.2-0.1,0.1-0.3-0.1-0.4c-0.2-0.1-0.3,0-0.5,0.1L6,3.3C5.9,3.4,5.9,3.6,6,3.7l1.1-1.6
	C7.2,1.9,7.5,1.9,7.6,2z"/>
<path class="st14" d="M6,2.1L4.9,3.7C4.8,3.9,4.6,3.9,4.4,3.8L4.3,3.7l0,0c-0.1,0.2-0.1,0.4,0,0.5c0.2,0.1,0.4,0.1,0.5,0
	c0,0,0,0,0-0.1l1.1-1.6C6.1,2.4,6.1,2.2,6,2.1z"/>
<path class="st14" d="M4.3,2.1L3.2,3.7C3.1,3.9,2.9,3.9,2.7,3.8L2.7,3.7l0,0c-0.1,0.2-0.1,0.4,0,0.5c0.2,0.1,0.4,0.1,0.5,0
	c0,0,0,0,0-0.1l1.1-1.6C4.5,2.4,4.5,2.2,4.3,2.1z"/>
<path class="st14" d="M2.7,2.1L1.6,3.7C1.4,3.9,1.2,3.9,1,3.8l0-0.1l0,0C0.9,3.9,0.9,4.1,1,4.3s0.4,0.1,0.5,0c0,0,0,0,0-0.1l1.1-1.6
	C2.8,2.4,2.8,2.2,2.7,2.1z"/>
<path class="st14" d="M6.6,3.7C6.5,3.9,6.3,3.9,6.1,3.8L6,3.7l0,0C5.9,3.9,5.9,4.1,6,4.3c0.2,0.1,0.4,0.1,0.5,0c0,0,0,0,0-0.1
	l1.1-1.6c0.1-0.1,0.1-0.3,0-0.5L6.6,3.7z"/>
<path class="st15" d="M10.1,1.5c0.3,0,0.6,0.2,0.7,0.5c0.1-0.4,0-0.8-0.4-0.9s-0.8,0-0.9,0.4c-0.1,0.2-0.1,0.3,0,0.5
	C9.6,1.6,9.8,1.5,10.1,1.5z"/>
<path class="st14" d="M10.1,2.4c-0.3,0-0.6-0.2-0.7-0.5c-0.1,0.4,0,0.8,0.4,0.9s0.8,0,0.9-0.4c0.1-0.2,0.1-0.3,0-0.5
	C10.7,2.2,10.4,2.4,10.1,2.4z"/>
<path class="st15" d="M12.4,1.5c0.3,0,0.6,0.2,0.7,0.5c0.1-0.4,0-0.8-0.4-0.9s-0.8,0-0.9,0.4c-0.1,0.2-0.1,0.3,0,0.5
	C11.8,1.6,12.1,1.5,12.4,1.5z"/>
<path class="st14" d="M12.4,2.4c-0.3,0-0.6-0.2-0.7-0.5c-0.1,0.4,0,0.8,0.4,0.9s0.8,0,0.9-0.4c0.1-0.2,0.1-0.3,0-0.5
	C12.9,2.2,12.7,2.4,12.4,2.4z"/>
<path class="st15" d="M14.3,1.5c0.3,0,0.6,0.2,0.7,0.5c0.1-0.4,0-0.8-0.4-0.9c-0.4-0.1-0.8,0-0.9,0.4c-0.1,0.2-0.1,0.3,0,0.5
	C13.8,1.6,14,1.5,14.3,1.5z"/>
<path class="st14" d="M14.3,2.4c-0.3,0-0.6-0.2-0.7-0.5c-0.1,0.4,0,0.8,0.4,0.9c0.4,0.1,0.8,0,0.9-0.4C15,2.2,15,2.1,15,1.9
	C14.9,2.2,14.6,2.4,14.3,2.4z"/>
</svg>
