<?xml version="1.0" encoding="utf-8"?>
<!-- Generator: Adobe Illustrator 21.0.0, SVG Export Plug-In . SVG Version: 6.00 Build 0)  -->
<svg version="1.1" id="katman_1" xmlns="http://www.w3.org/2000/svg" xmlns:xlink="http://www.w3.org/1999/xlink" x="0px" y="0px"
	 viewBox="0 0 18.5 24" style="enable-background:new 0 0 18.5 24;" xml:space="preserve">
<style type="text/css">
	.st0{opacity:0.2;enable-background:new    ;}
	.st1{fill:url(#SVGID_1_);}
	.st2{opacity:0.1;enable-background:new    ;}
	.st3{fill:#F5F5F5;}
	.st4{opacity:0.1;fill:#FFFFFF;enable-background:new    ;}
	.st5{opacity:0.5;enable-background:new    ;}
</style>
<title>libreoffice-calc_5</title>
<path class="st0" d="M0,21.9v0.8C0,23.4,0.6,24,1.2,24c0,0,0,0,0,0h16c0.7,0,1.3-0.6,1.3-1.3l0,0v-0.8c0,0.7-0.6,1.3-1.3,1.3l0,0
	h-16C0.6,23.2,0,22.6,0,21.9C0,21.9,0,21.9,0,21.9z"/>
<linearGradient id="SVGID_1_" gradientUnits="userSpaceOnUse" x1="9.265" y1="1.71" x2="9.265" y2="25.29" gradientTransform="matrix(1 0 0 -1 0 25.29)">
	<stop  offset="0" style="stop-color:#00934A"/>
	<stop  offset="1" style="stop-color:#4BAE4F"/>
</linearGradient>
<path class="st1" d="M18.5,22.3V1.3C18.5,0.6,18,0,17.3,0c0,0,0,0,0,0h-16C0.6,0,0,0.6,0,1.3c0,0,0,0,0,0v21.1
	c0,0.7,0.6,1.3,1.3,1.3c0,0,0,0,0,0h16C18,23.6,18.5,23,18.5,22.3C18.5,22.3,18.5,22.3,18.5,22.3z"/>
<path class="st2" d="M1.7,2.1v20.2h15.2V9.2L9.8,2.1H1.7z M12.1,2.1l4.7,4.7V2.1H12.1z"/>
<path class="st3" d="M1.7,1.7v20.2h15.2V8.8L9.8,1.7H1.7z M12.1,1.7l4.7,4.7V1.7H12.1z"/>
<path class="st4" d="M1.3,0C0.6,0,0,0.6,0,1.3v0.4C0,1,0.6,0.4,1.3,0.4h16c0.7,0,1.3,0.6,1.3,1.3c0,0,0,0,0,0V1.3
	C18.5,0.6,18,0,17.3,0c0,0,0,0,0,0H1.3z"/>
<path class="st5" d="M4.2,19.4h10.1v-8.4H4.2V19.4z M5.1,11.8h3.8v1.7H5.1V11.8z M9.7,11.8h3.8v1.7H9.7V11.8z M5.1,14.3h3.8V16H5.1
	V14.3z M9.7,14.3h3.8V16H9.7V14.3z M5.1,16.8h3.8v1.7H5.1V16.8z M9.7,16.8h3.8v1.7H9.7V16.8z"/>
<rect x="5.1" y="18.5" class="st4" width="3.8" height="0.4"/>
<rect x="5.1" y="13.5" class="st4" width="3.8" height="0.4"/>
<rect x="5.1" y="16" class="st4" width="3.8" height="0.4"/>
<rect x="9.7" y="13.5" class="st4" width="3.8" height="0.4"/>
<rect x="4.2" y="10.9" class="st4" width="10.1" height="0.4"/>
<rect x="9.7" y="16" class="st4" width="3.8" height="0.4"/>
<rect x="9.7" y="18.5" class="st4" width="3.8" height="0.4"/>
<rect x="9.7" y="11.8" class="st0" width="3.8" height="0.4"/>
<rect x="9.7" y="16.8" class="st0" width="3.8" height="0.4"/>
<rect x="4.2" y="19.4" class="st0" width="10.1" height="0.4"/>
<rect x="5.1" y="11.8" class="st0" width="3.8" height="0.4"/>
<rect x="5.1" y="16.8" class="st0" width="3.8" height="0.4"/>
<rect x="5.1" y="14.3" class="st0" width="3.8" height="0.4"/>
<rect x="9.7" y="14.3" class="st0" width="3.8" height="0.4"/>
</svg>
