<?xml version="1.0" encoding="utf-8"?>
<!-- Generator: Adobe Illustrator 21.0.0, SVG Export Plug-In . SVG Version: 6.00 Build 0)  -->
<svg version="1.1" id="katman_1" xmlns="http://www.w3.org/2000/svg" xmlns:xlink="http://www.w3.org/1999/xlink" x="0px" y="0px"
	 viewBox="0 0 16 16" style="enable-background:new 0 0 16 16;" xml:space="preserve">
<style type="text/css">
	.st0{fill:#2F3134;}
</style>
<title>document-open-data_5</title>
<path class="st0" d="M3.8,7.7L7,4.4v7.9c0,0.1,0.1,0.3,0.3,0.3h0h1.9c0.1,0,0.3-0.1,0.3-0.3l0,0V4.4l3.2,3.2c0.1,0.1,0.3,0.1,0.4,0
	l1.3-1.4c0.1-0.1,0.1-0.3,0-0.4L9.9,1.5L8.5,0.2C8.3,0,8,0,7.8,0.2L6.5,1.5L2,5.9C1.9,6,1.9,6.2,2,6.3l1.4,1.3
	C3.5,7.7,3.6,7.7,3.8,7.7z"/>
<path class="st0" d="M0.4,13.5h15.3c0.2,0,0.4,0.2,0.4,0.4v1.7c0,0.2-0.2,0.4-0.4,0.4H0.4C0.2,16,0,15.8,0,15.6v-1.7
	C0,13.7,0.2,13.5,0.4,13.5z"/>
</svg>
