<?xml version="1.0" encoding="utf-8"?>
<!-- Generator: Adobe Illustrator 21.0.0, SVG Export Plug-In . SVG Version: 6.00 Build 0)  -->
<svg version="1.1" id="katman_1" xmlns="http://www.w3.org/2000/svg" xmlns:xlink="http://www.w3.org/1999/xlink" x="0px" y="0px"
	 viewBox="0 0 64 64.8" style="enable-background:new 0 0 64 64.8;" xml:space="preserve">
<style type="text/css">
	.st0{fill:url(#SVGID_1_);}
	.st1{opacity:0.2;enable-background:new    ;}
	.st2{fill:url(#SVGID_2_);}
	.st3{fill:url(#SVGID_3_);}
	.st4{fill:url(#SVGID_4_);}
	.st5{fill:url(#SVGID_5_);}
	.st6{fill:url(#SVGID_6_);}
	.st7{fill:url(#SVGID_7_);}
	.st8{fill:url(#SVGID_8_);}
	.st9{fill:url(#SVGID_9_);}
	.st10{fill:url(#SVGID_10_);}
	.st11{fill:url(#SVGID_11_);}
	.st12{fill:url(#SVGID_12_);}
	.st13{fill:url(#SVGID_13_);}
	.st14{fill:url(#SVGID_14_);}
	.st15{fill:url(#SVGID_15_);}
	.st16{fill:url(#SVGID_16_);}
	.st17{fill:url(#SVGID_17_);}
	.st18{fill:url(#SVGID_18_);}
	.st19{fill:url(#SVGID_19_);}
	.st20{fill:url(#SVGID_20_);}
	.st21{fill:url(#SVGID_21_);}
	.st22{fill:url(#SVGID_22_);}
	.st23{fill:url(#SVGID_23_);}
	.st24{fill:url(#SVGID_24_);}
	.st25{fill:url(#SVGID_25_);}
	.st26{fill:url(#SVGID_26_);}
	.st27{fill:url(#SVGID_27_);}
	.st28{fill:url(#SVGID_28_);}
	.st29{opacity:0.1;fill:#FFFFFF;enable-background:new    ;}
</style>
<title>time-admin</title>
<linearGradient id="SVGID_1_" gradientUnits="userSpaceOnUse" x1="14.132" y1="55.2217" x2="63.922" y2="-2.9983" gradientTransform="matrix(1 0 0 -1 -8.026766e-03 65.7278)">
	<stop  offset="0" style="stop-color:#DFDFDF"/>
	<stop  offset="9.000000e-02" style="stop-color:#E8E8E8"/>
	<stop  offset="0.27" style="stop-color:#F5F5F5"/>
	<stop  offset="0.51" style="stop-color:#FDFDFD"/>
	<stop  offset="1" style="stop-color:#FFFFFF"/>
</linearGradient>
<path class="st0" d="M3.8,31.3C3.8,16,16.5,3.6,32.1,3.7s28.2,12.5,28.1,27.8S47.5,59.2,31.9,59.1C16.3,59,3.7,46.6,3.8,31.3z"/>
<path class="st1" d="M47.6,32.3l-13.5-0.9v1.3v0.6c-0.1,0.4-0.3,0.8-0.6,1l14.1-0.9c0.3,0,0.5-0.2,0.5-0.5v-0.1
	C48.1,32.6,47.9,32.4,47.6,32.3z"/>
<path class="st1" d="M33.6,32.8L33.6,32.8l-1-18.2c0-0.3-0.2-0.5-0.5-0.5H32c-0.3,0-0.5,0.2-0.5,0.5l-1,18.2l0,0c0,0,0,0.1,0,0.1
	c0,0.9,0.7,1.6,1.6,1.6C33,34.5,33.7,33.8,33.6,32.8C33.7,32.9,33.6,32.9,33.6,32.8z M32.2,33.6c-0.2,0.1-0.4,0-0.6-0.2
	c-0.1-0.2,0-0.4,0.1-0.5c0,0,0,0,0,0c0.2-0.1,0.4,0,0.6,0.2C32.5,33.2,32.4,33.5,32.2,33.6C32.3,33.6,32.3,33.6,32.2,33.6z"/>
<ellipse transform="matrix(3.490598e-03 -1 1 3.490598e-03 21.5534 42.4619)" class="st1" cx="32.1" cy="10.4" rx="1.5" ry="1.5"/>
<ellipse transform="matrix(3.665167e-03 -1 1 3.665167e-03 -22.7685 41.805)" class="st1" cx="9.6" cy="32.3" rx="1.5" ry="1.5"/>
<ellipse transform="matrix(3.490598e-03 -1 1 3.490598e-03 -22.5801 86.1211)" class="st1" cx="31.9" cy="54.4" rx="1.5" ry="1.5"/>
<ellipse transform="matrix(3.665167e-03 -1 1 3.665167e-03 21.7106 86.7692)" class="st1" cx="54.4" cy="32.5" rx="1.5" ry="1.5"/>
<ellipse transform="matrix(0.9684 -0.2496 0.2496 0.9684 -1.9613 6.9229)" class="st1" cx="26.3" cy="11.2" rx="0.4" ry="0.4"/>
<path class="st1" d="M21.2,13.1c0.1,0.2,0,0.4-0.1,0.5c0,0,0,0,0,0c-0.2,0.1-0.4,0-0.6-0.1c-0.1-0.2,0-0.4,0.1-0.5c0,0,0,0,0,0
	C20.9,12.9,21.1,12.9,21.2,13.1z"/>
<path class="st1" d="M16.5,16.5c0.2,0.2,0.2,0.4,0,0.6c0,0,0,0,0,0c-0.2,0.2-0.4,0.2-0.6,0c0,0,0,0,0,0c-0.2-0.2-0.2-0.4,0-0.6
	c0,0,0,0,0,0C16.1,16.4,16.3,16.4,16.5,16.5C16.5,16.5,16.5,16.5,16.5,16.5z"/>
<path class="st1" d="M12.9,21c0.2,0.1,0.3,0.4,0.2,0.5c0,0,0,0,0,0c-0.1,0.2-0.4,0.3-0.6,0.1c-0.2-0.1-0.3-0.4-0.2-0.5c0,0,0,0,0,0
	C12.4,21,12.7,20.9,12.9,21z"/>
<ellipse transform="matrix(0.2669 -0.9637 0.9637 0.2669 -18.0677 29.5421)" class="st1" cx="10.4" cy="26.6" rx="0.4" ry="0.4"/>
<ellipse transform="matrix(0.9657 -0.2598 0.2598 0.9657 -9.5229 3.9933)" class="st1" cx="10.3" cy="38" rx="0.4" ry="0.4"/>
<path class="st1" d="M12.4,43c0.2-0.1,0.4,0,0.6,0.2c0.1,0.2,0,0.4-0.1,0.5c0,0,0,0,0,0c-0.2,0.1-0.4,0-0.6-0.2
	C12.1,43.4,12.2,43.1,12.4,43C12.4,43,12.4,43,12.4,43z"/>
<path class="st1" d="M15.8,47.6c0.2-0.2,0.4-0.2,0.6,0c0,0,0,0,0,0c0.2,0.2,0.2,0.4,0,0.6c0,0,0,0,0,0c-0.2,0.2-0.4,0.2-0.6,0
	c0,0,0,0,0,0c-0.2,0-0.4-0.1-0.4-0.3S15.6,47.5,15.8,47.6z"/>
<path class="st1" d="M20.4,51.2c0.1-0.2,0.4-0.3,0.6-0.2c0.2,0.1,0.3,0.4,0.2,0.5c0,0,0,0,0,0c-0.1,0.2-0.4,0.3-0.6,0.2
	C20.3,51.7,20.3,51.4,20.4,51.2C20.4,51.2,20.4,51.2,20.4,51.2z"/>
<ellipse transform="matrix(0.2578 -0.9662 0.9662 0.2578 -32.4317 65.0583)" class="st1" cx="26.1" cy="53.6" rx="0.4" ry="0.4"/>
<ellipse transform="matrix(0.968 -0.2509 0.2509 0.968 -12.2587 11.1797)" class="st1" cx="37.7" cy="53.7" rx="0.4" ry="0.4"/>
<path class="st1" d="M42.8,51.7c-0.1-0.2,0-0.4,0.1-0.5c0,0,0,0,0,0c0.2-0.1,0.4,0,0.6,0.2c0.1,0.2,0,0.4-0.1,0.5c0,0,0,0,0,0
	C43.1,52,42.9,51.9,42.8,51.7z"/>
<path class="st1" d="M47.5,48.3c-0.2-0.2-0.2-0.4,0-0.6c0,0,0,0,0,0c0.2-0.2,0.4-0.2,0.6,0c0,0,0,0,0,0c0.2,0.2,0.2,0.4,0,0.6
	c0,0,0,0,0,0C47.9,48.5,47.7,48.5,47.5,48.3C47.5,48.3,47.5,48.3,47.5,48.3z"/>
<path class="st1" d="M51.2,43.8c-0.2-0.1-0.3-0.4-0.2-0.5c0,0,0,0,0,0c0.1-0.2,0.4-0.3,0.6-0.2c0.2,0.1,0.3,0.4,0.2,0.5c0,0,0,0,0,0
	C51.6,43.9,51.3,43.9,51.2,43.8z"/>
<ellipse transform="matrix(0.2707 -0.9627 0.9627 0.2707 2.0689 79.7179)" class="st1" cx="53.7" cy="38.5" rx="0.4" ry="0.4"/>
<ellipse transform="matrix(0.9657 -0.2598 0.2598 0.9657 -5.1173 14.862)" class="st1" cx="53.7" cy="26.8" rx="0.4" ry="0.4"/>
<path class="st1" d="M51.6,21.8c-0.2,0.1-0.4,0-0.6-0.1c-0.1-0.2,0-0.4,0.1-0.5c0,0,0,0,0,0c0.2-0.1,0.4,0,0.6,0.1
	C51.9,21.5,51.8,21.7,51.6,21.8C51.6,21.8,51.6,21.8,51.6,21.8z"/>
<path class="st1" d="M48.2,17.2c-0.2,0.2-0.4,0.2-0.6,0c0,0,0,0,0,0c-0.2-0.2-0.2-0.4,0-0.6c0,0,0,0,0,0c0.2-0.2,0.4-0.2,0.6,0
	c0,0,0,0,0,0C48.3,16.8,48.3,17,48.2,17.2C48.2,17.2,48.2,17.2,48.2,17.2z"/>
<path class="st1" d="M43.6,13.6c-0.1,0.2-0.4,0.3-0.6,0.1c-0.2-0.1-0.3-0.4-0.2-0.5c0,0,0,0,0,0c0.1-0.2,0.4-0.3,0.6-0.1
	C43.7,13.2,43.7,13.4,43.6,13.6C43.6,13.6,43.6,13.6,43.6,13.6z"/>
<ellipse transform="matrix(0.2578 -0.9662 0.9662 0.2578 17.3051 44.8988)" class="st1" cx="37.9" cy="11.2" rx="0.4" ry="0.4"/>
<radialGradient id="SVGID_2_" cx="32" cy="34.32" r="31.7066" gradientTransform="matrix(1 0 0 -1 0 65.73)" gradientUnits="userSpaceOnUse">
	<stop  offset="9.000000e-02" style="stop-color:#B276AD"/>
	<stop  offset="0.3" style="stop-color:#AC6AA6"/>
	<stop  offset="0.67" style="stop-color:#9B4B94"/>
	<stop  offset="1" style="stop-color:#892A81"/>
</radialGradient>
<path class="st2" d="M32.1,0C14.4-0.1,0.1,14,0,31.3s14.2,31.5,31.9,31.5s32.1-14,32.1-31.3C64.1,14.2,49.8,0.1,32.1,0z M31.9,59.1
	c-15.6,0-28.2-12.5-28.1-27.8S16.5,3.7,32.1,3.7s28.2,12.5,28.1,27.8S47.5,59.2,31.9,59.1z"/>
<radialGradient id="SVGID_3_" cx="32.1921" cy="56.983" r="1.48" gradientTransform="matrix(1 3.490598e-03 3.490598e-03 -1 -0.3089 66.2933)" gradientUnits="userSpaceOnUse">
	<stop  offset="9.000000e-02" style="stop-color:#B276AD"/>
	<stop  offset="0.3" style="stop-color:#AC6AA6"/>
	<stop  offset="0.67" style="stop-color:#9B4B94"/>
	<stop  offset="1" style="stop-color:#892A81"/>
</radialGradient>
<path class="st3" d="M30.6,9.4c0-0.8,0.7-1.5,1.5-1.5c0.8,0,1.5,0.7,1.5,1.5s-0.7,1.5-1.5,1.5S30.6,10.2,30.6,9.4z"/>
<radialGradient id="SVGID_4_" cx="9.7987" cy="35.0171" r="1.48" gradientTransform="matrix(1 3.665167e-03 3.665167e-03 -1 -0.332 66.3059)" gradientUnits="userSpaceOnUse">
	<stop  offset="9.000000e-02" style="stop-color:#B276AD"/>
	<stop  offset="0.3" style="stop-color:#AC6AA6"/>
	<stop  offset="0.67" style="stop-color:#9B4B94"/>
	<stop  offset="1" style="stop-color:#892A81"/>
</radialGradient>
<path class="st4" d="M8.1,31.3c0-0.8,0.7-1.5,1.5-1.5c0.8,0,1.5,0.7,1.5,1.5c0,0.8-0.7,1.5-1.5,1.5C8.8,32.8,8.1,32.1,8.1,31.3z"/>
<radialGradient id="SVGID_5_" cx="32.1922" cy="13.013" r="1.48" gradientTransform="matrix(1 3.490598e-03 3.490598e-03 -1 -0.3163 66.2971)" gradientUnits="userSpaceOnUse">
	<stop  offset="9.000000e-02" style="stop-color:#B276AD"/>
	<stop  offset="0.3" style="stop-color:#AC6AA6"/>
	<stop  offset="0.67" style="stop-color:#9B4B94"/>
	<stop  offset="1" style="stop-color:#892A81"/>
</radialGradient>
<path class="st5" d="M30.4,53.4c0-0.8,0.7-1.5,1.5-1.5s1.5,0.7,1.5,1.5c0,0.8-0.7,1.5-1.5,1.5C31.1,54.9,30.4,54.2,30.4,53.4z"/>
<radialGradient id="SVGID_6_" cx="54.5987" cy="35.0171" r="1.4801" gradientTransform="matrix(1 3.665167e-03 3.665167e-03 -1 -0.3375 66.3025)" gradientUnits="userSpaceOnUse">
	<stop  offset="9.000000e-02" style="stop-color:#B276AD"/>
	<stop  offset="0.3" style="stop-color:#AC6AA6"/>
	<stop  offset="0.67" style="stop-color:#9B4B94"/>
	<stop  offset="1" style="stop-color:#892A81"/>
</radialGradient>
<path class="st6" d="M52.9,31.5c0-0.8,0.7-1.5,1.5-1.5c0.8,0,1.5,0.7,1.5,1.5c0,0.8-0.7,1.5-1.5,1.5C53.6,32.9,52.9,32.3,52.9,31.5z
	"/>
<radialGradient id="SVGID_7_" cx="26.3987" cy="56.2474" r="0.4099" gradientTransform="matrix(1 3.665171e-03 3.665171e-03 -1 -0.3313 66.3023)" gradientUnits="userSpaceOnUse">
	<stop  offset="9.000000e-02" style="stop-color:#B276AD"/>
	<stop  offset="0.3" style="stop-color:#AC6AA6"/>
	<stop  offset="0.67" style="stop-color:#9B4B94"/>
	<stop  offset="1" style="stop-color:#892A81"/>
</radialGradient>
<path class="st7" d="M26.2,9.8c0.2-0.1,0.4,0.1,0.5,0.3c0.1,0.2-0.1,0.4-0.3,0.5c-0.2,0.1-0.4-0.1-0.5-0.3C25.8,10,26,9.8,26.2,9.8z
	"/>
<radialGradient id="SVGID_8_" cx="20.9987" cy="54.0571" r="0.41" gradientTransform="matrix(1 3.665183e-03 3.665183e-03 -1 -0.3307 66.3062)" gradientUnits="userSpaceOnUse">
	<stop  offset="9.000000e-02" style="stop-color:#B276AD"/>
	<stop  offset="0.3" style="stop-color:#AC6AA6"/>
	<stop  offset="0.67" style="stop-color:#9B4B94"/>
	<stop  offset="1" style="stop-color:#892A81"/>
</radialGradient>
<path class="st8" d="M21.2,12.1c0.1,0.2,0,0.4-0.1,0.5c0,0,0,0,0,0c-0.2,0.1-0.4,0-0.6-0.1c-0.1-0.2,0-0.4,0.1-0.5c0,0,0,0,0,0
	C20.9,11.9,21.1,11.9,21.2,12.1z"/>
<radialGradient id="SVGID_9_" cx="16.3587" cy="50.5571" r="0.41" gradientTransform="matrix(1 3.665183e-03 3.665183e-03 -1 -0.3307 66.3062)" gradientUnits="userSpaceOnUse">
	<stop  offset="9.000000e-02" style="stop-color:#B276AD"/>
	<stop  offset="0.3" style="stop-color:#AC6AA6"/>
	<stop  offset="0.67" style="stop-color:#9B4B94"/>
	<stop  offset="1" style="stop-color:#892A81"/>
</radialGradient>
<path class="st9" d="M16.5,15.5c0.2,0.2,0.2,0.4,0,0.6c0,0,0,0,0,0c-0.2,0.2-0.4,0.2-0.6,0c0,0,0,0,0,0c-0.2-0.2-0.2-0.4,0-0.6
	c0,0,0,0,0,0C16.1,15.4,16.3,15.4,16.5,15.5C16.5,15.5,16.5,15.5,16.5,15.5z"/>
<radialGradient id="SVGID_10_" cx="12.7987" cy="46.0071" r="0.4096" gradientTransform="matrix(1 3.665183e-03 3.665183e-03 -1 -0.3307 66.3062)" gradientUnits="userSpaceOnUse">
	<stop  offset="9.000000e-02" style="stop-color:#B276AD"/>
	<stop  offset="0.3" style="stop-color:#AC6AA6"/>
	<stop  offset="0.67" style="stop-color:#9B4B94"/>
	<stop  offset="1" style="stop-color:#892A81"/>
</radialGradient>
<path class="st10" d="M12.9,20c0.2,0.1,0.3,0.4,0.2,0.5c0,0,0,0,0,0c-0.1,0.2-0.4,0.3-0.6,0.1c-0.2-0.1-0.3-0.4-0.2-0.5c0,0,0,0,0,0
	C12.4,20,12.7,19.9,12.9,20z"/>
<radialGradient id="SVGID_11_" cx="10.5587" cy="40.7071" r="0.41" gradientTransform="matrix(1 3.665306e-03 3.665306e-03 -1 -0.3248 66.3003)" gradientUnits="userSpaceOnUse">
	<stop  offset="9.000000e-02" style="stop-color:#B276AD"/>
	<stop  offset="0.3" style="stop-color:#AC6AA6"/>
	<stop  offset="0.67" style="stop-color:#9B4B94"/>
	<stop  offset="1" style="stop-color:#892A81"/>
</radialGradient>
<path class="st11" d="M10,25.5c0.1-0.2,0.3-0.3,0.5-0.3s0.3,0.3,0.3,0.5c-0.1,0.2-0.3,0.3-0.5,0.3C10.1,26,9.9,25.7,10,25.5z"/>
<radialGradient id="SVGID_12_" cx="10.5587" cy="29.3171" r="0.41" gradientTransform="matrix(1 3.665191e-03 3.665191e-03 -1 -0.3261 66.3097)" gradientUnits="userSpaceOnUse">
	<stop  offset="9.000000e-02" style="stop-color:#B276AD"/>
	<stop  offset="0.3" style="stop-color:#AC6AA6"/>
	<stop  offset="0.67" style="stop-color:#9B4B94"/>
	<stop  offset="1" style="stop-color:#892A81"/>
</radialGradient>
<path class="st12" d="M10.2,36.6c0.2-0.1,0.4,0.1,0.5,0.3s-0.1,0.4-0.3,0.5s-0.4-0.1-0.5-0.3C9.9,36.9,10,36.7,10.2,36.6z"/>
<radialGradient id="SVGID_13_" cx="12.7987" cy="24.0171" r="0.41" gradientTransform="matrix(1 3.665183e-03 3.665183e-03 -1 -0.3307 66.3062)" gradientUnits="userSpaceOnUse">
	<stop  offset="9.000000e-02" style="stop-color:#B276AD"/>
	<stop  offset="0.3" style="stop-color:#AC6AA6"/>
	<stop  offset="0.67" style="stop-color:#9B4B94"/>
	<stop  offset="1" style="stop-color:#892A81"/>
</radialGradient>
<path class="st13" d="M12.4,42c0.2-0.1,0.4,0,0.6,0.2c0.1,0.2,0,0.4-0.1,0.5c0,0,0,0,0,0c-0.2,0.1-0.4,0-0.6-0.2
	C12.1,42.4,12.2,42.1,12.4,42C12.4,42,12.4,42,12.4,42z"/>
<radialGradient id="SVGID_14_" cx="16.3587" cy="19.4671" r="0.41" gradientTransform="matrix(1 3.665183e-03 3.665183e-03 -1 -0.3307 66.3062)" gradientUnits="userSpaceOnUse">
	<stop  offset="9.000000e-02" style="stop-color:#B276AD"/>
	<stop  offset="0.3" style="stop-color:#AC6AA6"/>
	<stop  offset="0.67" style="stop-color:#9B4B94"/>
	<stop  offset="1" style="stop-color:#892A81"/>
</radialGradient>
<path class="st14" d="M15.8,46.6c0.2-0.2,0.4-0.2,0.6,0c0,0,0,0,0,0c0.2,0.2,0.2,0.4,0,0.6c0,0,0,0,0,0c-0.2,0.2-0.4,0.2-0.6,0
	c0,0,0,0,0,0C15.7,47,15.8,46.8,15.8,46.6z"/>
<radialGradient id="SVGID_15_" cx="20.9987" cy="15.9671" r="0.41" gradientTransform="matrix(1 3.665183e-03 3.665183e-03 -1 -0.3307 66.3062)" gradientUnits="userSpaceOnUse">
	<stop  offset="9.000000e-02" style="stop-color:#B276AD"/>
	<stop  offset="0.3" style="stop-color:#AC6AA6"/>
	<stop  offset="0.67" style="stop-color:#9B4B94"/>
	<stop  offset="1" style="stop-color:#892A81"/>
</radialGradient>
<path class="st15" d="M20.4,50.2c0.1-0.2,0.4-0.3,0.6-0.2c0.2,0.1,0.3,0.4,0.2,0.5c0,0,0,0,0,0c-0.1,0.2-0.4,0.3-0.6,0.2
	C20.3,50.7,20.3,50.4,20.4,50.2C20.4,50.2,20.4,50.2,20.4,50.2z"/>
<radialGradient id="SVGID_16_" cx="26.3987" cy="13.7771" r="0.41" gradientTransform="matrix(1 3.665183e-03 3.665183e-03 -1 -0.3306 66.3056)" gradientUnits="userSpaceOnUse">
	<stop  offset="9.000000e-02" style="stop-color:#B276AD"/>
	<stop  offset="0.3" style="stop-color:#AC6AA6"/>
	<stop  offset="0.67" style="stop-color:#9B4B94"/>
	<stop  offset="1" style="stop-color:#892A81"/>
</radialGradient>
<path class="st16" d="M25.7,52.5c0.1-0.2,0.3-0.3,0.5-0.3c0.2,0.1,0.3,0.3,0.3,0.5S26.2,53.1,26,53C25.8,53,25.7,52.7,25.7,52.5z"/>
<radialGradient id="SVGID_17_" cx="37.6712" cy="13.435" r="0.41" gradientTransform="matrix(1.0017 -1.356191e-03 -1.356191e-03 -1.0017 0.326 66.0734)" gradientUnits="userSpaceOnUse">
	<stop  offset="9.000000e-02" style="stop-color:#B276AD"/>
	<stop  offset="0.3" style="stop-color:#AC6AA6"/>
	<stop  offset="0.67" style="stop-color:#9B4B94"/>
	<stop  offset="1" style="stop-color:#892A81"/>
</radialGradient>
<path class="st17" d="M37.6,52.3c0.2-0.1,0.4,0.1,0.5,0.3S38,53,37.8,53.1c-0.2,0.1-0.4-0.1-0.5-0.3C37.3,52.6,37.4,52.3,37.6,52.3z
	"/>
<radialGradient id="SVGID_18_" cx="43.3987" cy="15.9771" r="0.41" gradientTransform="matrix(1 3.665183e-03 3.665183e-03 -1 -0.3307 66.3062)" gradientUnits="userSpaceOnUse">
	<stop  offset="9.000000e-02" style="stop-color:#B276AD"/>
	<stop  offset="0.3" style="stop-color:#AC6AA6"/>
	<stop  offset="0.67" style="stop-color:#9B4B94"/>
	<stop  offset="1" style="stop-color:#892A81"/>
</radialGradient>
<path class="st18" d="M42.8,50.7c-0.1-0.2,0-0.4,0.1-0.5c0,0,0,0,0,0c0.2-0.1,0.4,0,0.6,0.2c0.1,0.2,0,0.4-0.1,0.5c0,0,0,0,0,0
	C43.1,51,42.9,50.9,42.8,50.7z"/>
<radialGradient id="SVGID_19_" cx="48.0387" cy="19.4674" r="0.4099" gradientTransform="matrix(1 3.665183e-03 3.665183e-03 -1 -0.3307 66.3062)" gradientUnits="userSpaceOnUse">
	<stop  offset="9.000000e-02" style="stop-color:#B276AD"/>
	<stop  offset="0.3" style="stop-color:#AC6AA6"/>
	<stop  offset="0.67" style="stop-color:#9B4B94"/>
	<stop  offset="1" style="stop-color:#892A81"/>
</radialGradient>
<path class="st19" d="M47.5,47.3c-0.2-0.2-0.2-0.4,0-0.6c0,0,0,0,0,0c0.2-0.2,0.4-0.2,0.6,0c0,0,0,0,0,0c0.2,0.2,0.2,0.4,0,0.6
	c0,0,0,0,0,0C47.9,47.5,47.7,47.5,47.5,47.3C47.5,47.3,47.5,47.3,47.5,47.3z"/>
<radialGradient id="SVGID_20_" cx="51.598" cy="24.0171" r="0.4104" gradientTransform="matrix(1 3.665183e-03 3.665183e-03 -1 -0.3307 66.3062)" gradientUnits="userSpaceOnUse">
	<stop  offset="9.000000e-02" style="stop-color:#B276AD"/>
	<stop  offset="0.3" style="stop-color:#AC6AA6"/>
	<stop  offset="0.67" style="stop-color:#9B4B94"/>
	<stop  offset="1" style="stop-color:#892A81"/>
</radialGradient>
<path class="st20" d="M51.2,42.8c-0.2-0.1-0.3-0.4-0.2-0.5c0,0,0,0,0,0c0.1-0.2,0.4-0.3,0.6-0.2c0.2,0.1,0.3,0.4,0.2,0.5
	c0,0,0,0,0,0C51.6,42.9,51.3,42.9,51.2,42.8z"/>
<radialGradient id="SVGID_21_" cx="53.8394" cy="29.3271" r="0.4097" gradientTransform="matrix(1 3.665306e-03 3.665306e-03 -1 -0.324 66.3095)" gradientUnits="userSpaceOnUse">
	<stop  offset="9.000000e-02" style="stop-color:#B276AD"/>
	<stop  offset="0.3" style="stop-color:#AC6AA6"/>
	<stop  offset="0.67" style="stop-color:#9B4B94"/>
	<stop  offset="1" style="stop-color:#892A81"/>
</radialGradient>
<path class="st21" d="M53.2,37.1c0.1-0.2,0.3-0.3,0.5-0.3c0.2,0.1,0.3,0.3,0.3,0.5c-0.1,0.2-0.3,0.3-0.5,0.3
	C53.3,37.5,53.2,37.3,53.2,37.1z"/>
<radialGradient id="SVGID_22_" cx="53.8387" cy="40.7071" r="0.41" gradientTransform="matrix(1 3.665191e-03 3.665191e-03 -1 -0.3314 66.311)" gradientUnits="userSpaceOnUse">
	<stop  offset="9.000000e-02" style="stop-color:#B276AD"/>
	<stop  offset="0.3" style="stop-color:#AC6AA6"/>
	<stop  offset="0.67" style="stop-color:#9B4B94"/>
	<stop  offset="1" style="stop-color:#892A81"/>
</radialGradient>
<path class="st22" d="M53.6,25.4c0.2-0.1,0.4,0.1,0.5,0.3s-0.1,0.4-0.3,0.5c-0.2,0.1-0.4-0.1-0.5-0.3S53.3,25.5,53.6,25.4z"/>
<radialGradient id="SVGID_23_" cx="51.5987" cy="46.0071" r="0.41" gradientTransform="matrix(1 3.665183e-03 3.665183e-03 -1 -0.3307 66.3062)" gradientUnits="userSpaceOnUse">
	<stop  offset="9.000000e-02" style="stop-color:#B276AD"/>
	<stop  offset="0.3" style="stop-color:#AC6AA6"/>
	<stop  offset="0.67" style="stop-color:#9B4B94"/>
	<stop  offset="1" style="stop-color:#892A81"/>
</radialGradient>
<path class="st23" d="M51.6,20.8c-0.2,0.1-0.4,0-0.6-0.1c-0.1-0.2,0-0.4,0.1-0.5c0,0,0,0,0,0c0.2-0.1,0.4,0,0.6,0.1
	C51.9,20.5,51.8,20.7,51.6,20.8C51.6,20.8,51.6,20.8,51.6,20.8z"/>
<radialGradient id="SVGID_24_" cx="48.0387" cy="50.5676" r="0.4098" gradientTransform="matrix(1 3.665183e-03 3.665183e-03 -1 -0.3307 66.3062)" gradientUnits="userSpaceOnUse">
	<stop  offset="9.000000e-02" style="stop-color:#B276AD"/>
	<stop  offset="0.3" style="stop-color:#AC6AA6"/>
	<stop  offset="0.67" style="stop-color:#9B4B94"/>
	<stop  offset="1" style="stop-color:#892A81"/>
</radialGradient>
<path class="st24" d="M48.2,16.2c-0.2,0.2-0.4,0.2-0.6,0c0,0,0,0,0,0c-0.2-0.2-0.2-0.4,0-0.6c0,0,0,0,0,0c0.2-0.2,0.4-0.2,0.6,0
	c0,0,0,0,0,0C48.3,15.8,48.3,16,48.2,16.2C48.2,16.2,48.2,16.2,48.2,16.2z"/>
<radialGradient id="SVGID_25_" cx="43.3987" cy="54.0571" r="0.41" gradientTransform="matrix(1 3.665183e-03 3.665183e-03 -1 -0.3307 66.3062)" gradientUnits="userSpaceOnUse">
	<stop  offset="9.000000e-02" style="stop-color:#B276AD"/>
	<stop  offset="0.3" style="stop-color:#AC6AA6"/>
	<stop  offset="0.67" style="stop-color:#9B4B94"/>
	<stop  offset="1" style="stop-color:#892A81"/>
</radialGradient>
<path class="st25" d="M43.6,12.6c-0.1,0.2-0.4,0.3-0.6,0.1c-0.2-0.1-0.3-0.4-0.2-0.5c0,0,0,0,0,0c0.1-0.2,0.4-0.3,0.6-0.1
	C43.7,12.2,43.7,12.4,43.6,12.6C43.6,12.6,43.6,12.6,43.6,12.6z"/>
<radialGradient id="SVGID_26_" cx="37.9995" cy="56.2571" r="0.4096" gradientTransform="matrix(1 3.665183e-03 3.665183e-03 -1 -0.3241 66.3074)" gradientUnits="userSpaceOnUse">
	<stop  offset="9.000000e-02" style="stop-color:#B276AD"/>
	<stop  offset="0.3" style="stop-color:#AC6AA6"/>
	<stop  offset="0.67" style="stop-color:#9B4B94"/>
	<stop  offset="1" style="stop-color:#892A81"/>
</radialGradient>
<path class="st26" d="M37.5,10.1c0.1-0.2,0.3-0.3,0.5-0.3c0.2,0.1,0.3,0.3,0.3,0.5c-0.1,0.2-0.3,0.3-0.5,0.3
	C37.6,10.5,37.4,10.3,37.5,10.1z"/>
<linearGradient id="SVGID_27_" gradientUnits="userSpaceOnUse" x1="33.56" y1="33.805" x2="48.13" y2="33.805" gradientTransform="matrix(1 0 0 -1 0 65.73)">
	<stop  offset="0" style="stop-color:#892A81"/>
	<stop  offset="0.33" style="stop-color:#9B4B94"/>
	<stop  offset="0.7" style="stop-color:#AC6AA6"/>
	<stop  offset="0.91" style="stop-color:#B276AD"/>
</linearGradient>
<path class="st27" d="M47.6,31.3l-13.5-0.9v1.3v0.6c-0.1,0.4-0.3,0.8-0.6,1l14.1-0.9c0.3,0,0.5-0.2,0.5-0.5v-0.1
	C48.1,31.6,47.9,31.4,47.6,31.3z"/>
<linearGradient id="SVGID_28_" gradientUnits="userSpaceOnUse" x1="30.44" y1="42.3857" x2="33.65" y2="42.3857" gradientTransform="matrix(1 0 0 -1 0 65.73)">
	<stop  offset="0" style="stop-color:#892A81"/>
	<stop  offset="0.33" style="stop-color:#9B4B94"/>
	<stop  offset="0.7" style="stop-color:#AC6AA6"/>
	<stop  offset="0.91" style="stop-color:#B276AD"/>
</linearGradient>
<path class="st28" d="M33.6,31.8L33.6,31.8l-1-18.2c0-0.3-0.2-0.5-0.5-0.5H32c-0.3,0-0.5,0.2-0.5,0.5l-1,18.2l0,0c0,0,0,0.1,0,0.1
	c0,0.9,0.7,1.6,1.6,1.6c0.9,0,1.6-0.7,1.6-1.6C33.7,31.9,33.6,31.9,33.6,31.8z M32.2,32.6c-0.2,0.1-0.4,0-0.6-0.2
	c-0.1-0.2,0-0.4,0.1-0.5c0,0,0,0,0,0c0.2-0.1,0.4,0,0.6,0.2C32.5,32.2,32.4,32.5,32.2,32.6C32.3,32.6,32.3,32.6,32.2,32.6z"/>
<path class="st29" d="M32.1,2C49.4,2.1,63.4,15.6,64,32.4c0-0.3,0-0.6,0-0.9C64.1,14.2,49.8,0.1,32.1,0S0.1,14,0,31.3
	c0,0.4,0,0.8,0,1.1C0.6,15.5,14.7,1.9,32.1,2z"/>
<path class="st29" d="M31.9,61.1c15.6,0,28.3-12.3,28.3-27.6c0-0.4,0-0.8,0-1.1C59.6,47.5,47,59.3,31.9,59.1
	c-15,0.1-27.4-11.7-28.1-26.7c0,0.3,0,0.6,0,0.9C3.7,48.6,16.3,61.1,31.9,61.1z"/>
<path class="st1" d="M32.1,5.7c15-0.1,27.4,11.7,28.1,26.7c0-0.3,0-0.6,0-0.9C60.3,16.2,47.7,3.8,32.1,3.7S3.8,16,3.8,31.3
	c0,0.4,0,0.8,0,1.1C4.4,17.3,17,5.5,32.1,5.7z"/>
<path class="st1" d="M31.9,62.8C14.6,62.8,0.6,49.3,0,32.4c0,0.3,0,0.6,0,0.9c-0.1,17.3,14.2,31.5,31.9,31.5s32.1-14,32.1-31.3
	c0-0.4,0-0.8,0-1.1C63.5,49.3,49.3,62.9,31.9,62.8z"/>
</svg>
