<?xml version="1.0" encoding="utf-8"?>
<!-- Generator: Adobe Illustrator 21.0.0, SVG Export Plug-In . SVG Version: 6.00 Build 0)  -->
<svg version="1.1" id="katman_1" xmlns="http://www.w3.org/2000/svg" xmlns:xlink="http://www.w3.org/1999/xlink" x="0px" y="0px"
	 viewBox="0 0 20.8 22" style="enable-background:new 0 0 20.8 22;" xml:space="preserve">
<style type="text/css">
	.st0{fill:#B21C37;}
	.st1{fill:#4D4D4D;}
	.st2{fill:url(#SVGID_1_);}
	.st3{fill:#F0314C;}
	.st4{fill:#992035;}
	.st5{font-family:'Polt-Regular';}
	.st6{font-size:10.35px;}
	.st7{fill:#FFFFFF;}
	.st8{font-family:'Polt-ExtraBold';}
	.st9{font-size:3.97px;}
	.st10{fill:url(#SVGID_2_);}
	.st11{fill:url(#SVGID_3_);}
	.st12{opacity:0.2;enable-background:new    ;}
	.st13{opacity:0.1;fill:#FFFFFF;enable-background:new    ;}
	.st14{fill:url(#SVGID_4_);}
	.st15{fill:url(#SVGID_5_);}
	.st16{fill:url(#SVGID_6_);}
	.st17{fill:url(#SVGID_7_);}
	.st18{fill:url(#SVGID_8_);}
	.st19{fill:url(#SVGID_9_);}
	.st20{fill:url(#SVGID_10_);}
	.st21{fill:url(#SVGID_11_);}
	.st22{fill:url(#SVGID_12_);}
	.st23{fill:url(#SVGID_13_);}
	.st24{fill:url(#SVGID_14_);}
	.st25{fill:url(#SVGID_15_);}
	.st26{fill:url(#SVGID_16_);}
	.st27{fill:url(#SVGID_17_);}
	.st28{fill:url(#SVGID_18_);}
	.st29{fill:url(#SVGID_19_);}
</style>
<title>xfcalendar_4</title>
<path class="st0" d="M0,7.5V2.9c0-1.2,1-2.2,2.2-2.2l0,0h16.4c1.2,0,2.2,1,2.2,2.2c0,0,0,0,0,0v4.6H0z"/>
<path class="st1" d="M0,7.4v13.2c0,0.5,0.4,0.9,0.9,0.9h19c0.5,0,0.9-0.4,0.9-0.9V7.4H0z"/>
<radialGradient id="SVGID_1_" cx="10.15" cy="15.03" r="17.85" gradientTransform="matrix(1 0 0 -1 0 23.2)" gradientUnits="userSpaceOnUse">
	<stop  offset="0" style="stop-color:#FFFFFF"/>
	<stop  offset="0.34" style="stop-color:#FDFDFD"/>
	<stop  offset="0.54" style="stop-color:#F5F5F5"/>
	<stop  offset="0.69" style="stop-color:#E7E7E7"/>
	<stop  offset="0.83" style="stop-color:#D3D3D3"/>
	<stop  offset="0.95" style="stop-color:#BABABA"/>
	<stop  offset="1" style="stop-color:#ADADAD"/>
</radialGradient>
<path class="st2" d="M0.2,20.6c0,0.4,0.3,0.7,0.7,0.7h19c0.4,0,0.7-0.3,0.7-0.7V6.7H0.2V20.6z"/>
<path class="st3" d="M18.6,0.9H2.2c-1.1,0-2,0.9-2,2l0,0v4.4h20.4V2.9C20.6,1.8,19.7,0.9,18.6,0.9C18.6,0.9,18.6,0.9,18.6,0.9z"/>
<rect x="0.2" y="7.2" class="st4" width="20.4" height="0.2"/>
<text transform="matrix(1 0 0 1 5.19 17.1)" class="st0 st5 st6">26</text>
<text transform="matrix(1 0 0 1 2.26 6.25)" class="st7 st8 st9">ARAL</text>
<text transform="matrix(1 0 0 1 14.46 6.25)" class="st7 st8 st9">I</text>
<text transform="matrix(1 0 0 1 15.99 6.25)" class="st7 st8 st9">K</text>
<circle class="st7" cx="2.6" cy="1.6" r="0.2"/>
<circle class="st7" cx="3.6" cy="1.6" r="0.2"/>
<circle class="st7" cx="4.7" cy="1.6" r="0.2"/>
<circle class="st7" cx="5.7" cy="1.6" r="0.2"/>
<circle class="st7" cx="6.7" cy="1.6" r="0.2"/>
<circle class="st7" cx="7.8" cy="1.6" r="0.2"/>
<circle class="st7" cx="8.8" cy="1.6" r="0.2"/>
<circle class="st7" cx="9.9" cy="1.6" r="0.2"/>
<circle class="st7" cx="10.9" cy="1.6" r="0.2"/>
<circle class="st7" cx="11.9" cy="1.6" r="0.2"/>
<circle class="st7" cx="13" cy="1.6" r="0.2"/>
<circle class="st7" cx="14" cy="1.6" r="0.2"/>
<circle class="st7" cx="15.1" cy="1.6" r="0.2"/>
<circle class="st7" cx="16.1" cy="1.6" r="0.2"/>
<circle class="st7" cx="17.2" cy="1.6" r="0.2"/>
<circle class="st7" cx="18.2" cy="1.6" r="0.2"/>
<linearGradient id="SVGID_2_" gradientUnits="userSpaceOnUse" x1="18.6937" y1="3.8532" x2="16.7437" y2="5.6732" gradientTransform="matrix(1 0 0 -1 0 23.2)">
	<stop  offset="0" style="stop-color:#ADADAD"/>
	<stop  offset="0.1" style="stop-color:#BBBBBB"/>
	<stop  offset="0.33" style="stop-color:#D9D9D9"/>
	<stop  offset="0.56" style="stop-color:#EEEEEE"/>
	<stop  offset="0.79" style="stop-color:#FBFBFB"/>
	<stop  offset="1" style="stop-color:#FFFFFF"/>
</linearGradient>
<path class="st10" d="M16.7,21.3L16.6,18c0-0.4,0.3-0.7,0.7-0.7c0,0,0,0,0,0h3.3L16.7,21.3z"/>
<linearGradient id="SVGID_3_" gradientUnits="userSpaceOnUse" x1="18.7325" y1="3.8425" x2="20.6425" y2="1.9325" gradientTransform="matrix(1 0 0 -1 0 23.2)">
	<stop  offset="0" style="stop-color:#ADADAD"/>
	<stop  offset="4.000000e-02" style="stop-color:#B9B9B9"/>
	<stop  offset="0.16" style="stop-color:#D3D3D3"/>
	<stop  offset="0.28" style="stop-color:#E6E6E6"/>
	<stop  offset="0.42" style="stop-color:#F4F4F4"/>
	<stop  offset="0.6" style="stop-color:#FDFDFD"/>
	<stop  offset="0.9" style="stop-color:#FFFFFF"/>
</linearGradient>
<path class="st11" d="M16.7,21.3h3.2c0.4,0,0.7-0.3,0.7-0.7v-3.3L16.7,21.3z"/>
<path class="st12" d="M19.9,21.3h-19c-0.4,0-0.7-0.3-0.7-0.7v0.7c0,0.4,0.3,0.7,0.7,0.7h19c0.4,0,0.7-0.3,0.7-0.7v-0.7
	C20.6,21,20.3,21.3,19.9,21.3z"/>
<path class="st13" d="M18.6,0.9H2.2c-1.1,0-2,0.9-2,2l0,0v0.7c0-1.1,0.9-2,2-2h16.4c1.1,0,2,0.9,2,2V2.9C20.6,1.8,19.7,0.9,18.6,0.9
	C18.6,0.9,18.6,0.9,18.6,0.9z"/>
<linearGradient id="SVGID_4_" gradientUnits="userSpaceOnUse" x1="2.44" y1="22.325" x2="2.72" y2="22.325" gradientTransform="matrix(1 0 0 -1 0 23.2)">
	<stop  offset="0" style="stop-color:#2A0409"/>
	<stop  offset="0.1" style="stop-color:#3F1B20"/>
	<stop  offset="0.27" style="stop-color:#5C3C41"/>
	<stop  offset="0.41" style="stop-color:#6E5056"/>
	<stop  offset="0.5" style="stop-color:#75575D"/>
	<stop  offset="0.63" style="stop-color:#72545A"/>
	<stop  offset="0.73" style="stop-color:#694A50"/>
	<stop  offset="0.83" style="stop-color:#5A393F"/>
	<stop  offset="0.92" style="stop-color:#452227"/>
	<stop  offset="1" style="stop-color:#2A0409"/>
</linearGradient>
<path class="st14" d="M2.7,1.6c0,0.1-0.1,0.1-0.1,0.1l0,0l0,0c-0.1,0-0.1-0.1-0.1-0.1c0,0,0,0,0,0V0.1C2.4,0.1,2.5,0,2.6,0
	c0,0,0,0,0,0l0,0c0.1,0,0.1,0.1,0.1,0.1c0,0,0,0,0,0V1.6z"/>
<linearGradient id="SVGID_5_" gradientUnits="userSpaceOnUse" x1="3.48" y1="22.325" x2="3.76" y2="22.325" gradientTransform="matrix(1 0 0 -1 0 23.2)">
	<stop  offset="0" style="stop-color:#2A0409"/>
	<stop  offset="0.1" style="stop-color:#3F1B20"/>
	<stop  offset="0.27" style="stop-color:#5C3C41"/>
	<stop  offset="0.41" style="stop-color:#6E5056"/>
	<stop  offset="0.5" style="stop-color:#75575D"/>
	<stop  offset="0.63" style="stop-color:#72545A"/>
	<stop  offset="0.73" style="stop-color:#694A50"/>
	<stop  offset="0.83" style="stop-color:#5A393F"/>
	<stop  offset="0.92" style="stop-color:#452227"/>
	<stop  offset="1" style="stop-color:#2A0409"/>
</linearGradient>
<path class="st15" d="M3.8,1.6c0,0.1-0.1,0.1-0.1,0.1l0,0l0,0c-0.1,0-0.1-0.1-0.1-0.1c0,0,0,0,0,0V0.1C3.5,0.1,3.5,0,3.6,0
	c0,0,0,0,0,0l0,0c0.1,0,0.1,0.1,0.1,0.1c0,0,0,0,0,0V1.6z"/>
<linearGradient id="SVGID_6_" gradientUnits="userSpaceOnUse" x1="4.52" y1="22.325" x2="4.8" y2="22.325" gradientTransform="matrix(1 0 0 -1 0 23.2)">
	<stop  offset="0" style="stop-color:#2A0409"/>
	<stop  offset="0.1" style="stop-color:#3F1B20"/>
	<stop  offset="0.27" style="stop-color:#5C3C41"/>
	<stop  offset="0.41" style="stop-color:#6E5056"/>
	<stop  offset="0.5" style="stop-color:#75575D"/>
	<stop  offset="0.63" style="stop-color:#72545A"/>
	<stop  offset="0.73" style="stop-color:#694A50"/>
	<stop  offset="0.83" style="stop-color:#5A393F"/>
	<stop  offset="0.92" style="stop-color:#452227"/>
	<stop  offset="1" style="stop-color:#2A0409"/>
</linearGradient>
<path class="st16" d="M4.8,1.6c0,0.1-0.1,0.1-0.1,0.1l0,0c-0.1,0-0.1-0.1-0.1-0.1V0.1C4.5,0.1,4.6,0,4.7,0l0,0
	c0.1,0,0.1,0.1,0.1,0.1c0,0,0,0,0,0V1.6z"/>
<linearGradient id="SVGID_7_" gradientUnits="userSpaceOnUse" x1="5.56" y1="22.325" x2="5.84" y2="22.325" gradientTransform="matrix(1 0 0 -1 0 23.2)">
	<stop  offset="0" style="stop-color:#2A0409"/>
	<stop  offset="0.1" style="stop-color:#3F1B20"/>
	<stop  offset="0.27" style="stop-color:#5C3C41"/>
	<stop  offset="0.41" style="stop-color:#6E5056"/>
	<stop  offset="0.5" style="stop-color:#75575D"/>
	<stop  offset="0.63" style="stop-color:#72545A"/>
	<stop  offset="0.73" style="stop-color:#694A50"/>
	<stop  offset="0.83" style="stop-color:#5A393F"/>
	<stop  offset="0.92" style="stop-color:#452227"/>
	<stop  offset="1" style="stop-color:#2A0409"/>
</linearGradient>
<path class="st17" d="M5.8,1.6c0,0.1-0.1,0.1-0.1,0.1l0,0c-0.1,0-0.1-0.1-0.1-0.1V0.1C5.6,0.1,5.6,0,5.7,0l0,0
	c0.1,0,0.1,0.1,0.1,0.1L5.8,1.6z"/>
<linearGradient id="SVGID_8_" gradientUnits="userSpaceOnUse" x1="6.6" y1="22.325" x2="6.88" y2="22.325" gradientTransform="matrix(1 0 0 -1 0 23.2)">
	<stop  offset="0" style="stop-color:#2A0409"/>
	<stop  offset="0.1" style="stop-color:#3F1B20"/>
	<stop  offset="0.27" style="stop-color:#5C3C41"/>
	<stop  offset="0.41" style="stop-color:#6E5056"/>
	<stop  offset="0.5" style="stop-color:#75575D"/>
	<stop  offset="0.63" style="stop-color:#72545A"/>
	<stop  offset="0.73" style="stop-color:#694A50"/>
	<stop  offset="0.83" style="stop-color:#5A393F"/>
	<stop  offset="0.92" style="stop-color:#452227"/>
	<stop  offset="1" style="stop-color:#2A0409"/>
</linearGradient>
<path class="st18" d="M6.9,1.6c0,0.1-0.1,0.1-0.1,0.1l0,0c-0.1,0-0.1-0.1-0.1-0.1V0.1C6.6,0.1,6.7,0,6.7,0l0,0
	c0.1,0,0.1,0.1,0.1,0.1L6.9,1.6z"/>
<linearGradient id="SVGID_9_" gradientUnits="userSpaceOnUse" x1="7.65" y1="22.325" x2="7.93" y2="22.325" gradientTransform="matrix(1 0 0 -1 0 23.2)">
	<stop  offset="0" style="stop-color:#2A0409"/>
	<stop  offset="0.1" style="stop-color:#3F1B20"/>
	<stop  offset="0.27" style="stop-color:#5C3C41"/>
	<stop  offset="0.41" style="stop-color:#6E5056"/>
	<stop  offset="0.5" style="stop-color:#75575D"/>
	<stop  offset="0.63" style="stop-color:#72545A"/>
	<stop  offset="0.73" style="stop-color:#694A50"/>
	<stop  offset="0.83" style="stop-color:#5A393F"/>
	<stop  offset="0.92" style="stop-color:#452227"/>
	<stop  offset="1" style="stop-color:#2A0409"/>
</linearGradient>
<path class="st19" d="M7.9,1.6c0,0.1-0.1,0.1-0.1,0.1l0,0c-0.1,0-0.1-0.1-0.1-0.1V0.1C7.7,0.1,7.7,0,7.8,0l0,0
	c0.1,0,0.1,0.1,0.1,0.1V1.6z"/>
<linearGradient id="SVGID_10_" gradientUnits="userSpaceOnUse" x1="8.69" y1="22.3266" x2="8.9701" y2="22.3266" gradientTransform="matrix(1 0 0 -1 0 23.2)">
	<stop  offset="0" style="stop-color:#2A0409"/>
	<stop  offset="0.1" style="stop-color:#3F1B20"/>
	<stop  offset="0.27" style="stop-color:#5C3C41"/>
	<stop  offset="0.41" style="stop-color:#6E5056"/>
	<stop  offset="0.5" style="stop-color:#75575D"/>
	<stop  offset="0.63" style="stop-color:#72545A"/>
	<stop  offset="0.73" style="stop-color:#694A50"/>
	<stop  offset="0.83" style="stop-color:#5A393F"/>
	<stop  offset="0.92" style="stop-color:#452227"/>
	<stop  offset="1" style="stop-color:#2A0409"/>
</linearGradient>
<path class="st20" d="M9,1.6c0,0.1-0.1,0.1-0.1,0.1l0,0l0,0c-0.1,0-0.1-0.1-0.1-0.1c0,0,0,0,0,0V0.1c0-0.1,0-0.1,0.1-0.1l0,0
	C8.9,0,9,0,9,0.1c0,0,0,0,0,0V1.6z"/>
<linearGradient id="SVGID_11_" gradientUnits="userSpaceOnUse" x1="9.73" y1="22.3252" x2="10.01" y2="22.3252" gradientTransform="matrix(1 0 0 -1 0 23.2)">
	<stop  offset="0" style="stop-color:#2A0409"/>
	<stop  offset="0.1" style="stop-color:#3F1B20"/>
	<stop  offset="0.27" style="stop-color:#5C3C41"/>
	<stop  offset="0.41" style="stop-color:#6E5056"/>
	<stop  offset="0.5" style="stop-color:#75575D"/>
	<stop  offset="0.63" style="stop-color:#72545A"/>
	<stop  offset="0.73" style="stop-color:#694A50"/>
	<stop  offset="0.83" style="stop-color:#5A393F"/>
	<stop  offset="0.92" style="stop-color:#452227"/>
	<stop  offset="1" style="stop-color:#2A0409"/>
</linearGradient>
<path class="st21" d="M10,1.6c0,0.1-0.1,0.1-0.1,0.1l0,0l0,0c-0.1,0-0.1-0.1-0.1-0.1c0,0,0,0,0,0V0.1C9.7,0.1,9.8,0,9.9,0
	c0,0,0,0,0,0l0,0C9.9,0,10,0.1,10,0.1V1.6z"/>
<linearGradient id="SVGID_12_" gradientUnits="userSpaceOnUse" x1="10.77" y1="22.3297" x2="11.05" y2="22.3297" gradientTransform="matrix(1 0 0 -1 0 23.2)">
	<stop  offset="0" style="stop-color:#2A0409"/>
	<stop  offset="0.1" style="stop-color:#3F1B20"/>
	<stop  offset="0.27" style="stop-color:#5C3C41"/>
	<stop  offset="0.41" style="stop-color:#6E5056"/>
	<stop  offset="0.5" style="stop-color:#75575D"/>
	<stop  offset="0.63" style="stop-color:#72545A"/>
	<stop  offset="0.73" style="stop-color:#694A50"/>
	<stop  offset="0.83" style="stop-color:#5A393F"/>
	<stop  offset="0.92" style="stop-color:#452227"/>
	<stop  offset="1" style="stop-color:#2A0409"/>
</linearGradient>
<path class="st22" d="M11,1.6c0,0.1-0.1,0.1-0.1,0.1l0,0l0,0c-0.1,0-0.1-0.1-0.1-0.1c0,0,0,0,0,0V0.1c0-0.1,0.1-0.1,0.1-0.1
	c0,0,0,0,0.1,0l0,0C11,0,11,0.1,11,0.1V1.6z"/>
<linearGradient id="SVGID_13_" gradientUnits="userSpaceOnUse" x1="11.81" y1="22.325" x2="12.09" y2="22.325" gradientTransform="matrix(1 0 0 -1 0 23.2)">
	<stop  offset="0" style="stop-color:#2A0409"/>
	<stop  offset="0.1" style="stop-color:#3F1B20"/>
	<stop  offset="0.27" style="stop-color:#5C3C41"/>
	<stop  offset="0.41" style="stop-color:#6E5056"/>
	<stop  offset="0.5" style="stop-color:#75575D"/>
	<stop  offset="0.63" style="stop-color:#72545A"/>
	<stop  offset="0.73" style="stop-color:#694A50"/>
	<stop  offset="0.83" style="stop-color:#5A393F"/>
	<stop  offset="0.92" style="stop-color:#452227"/>
	<stop  offset="1" style="stop-color:#2A0409"/>
</linearGradient>
<path class="st23" d="M12.1,1.6c0,0.1-0.1,0.1-0.1,0.1l0,0l0,0c-0.1,0-0.1-0.1-0.1-0.1c0,0,0,0,0,0V0.1c0-0.1,0.1-0.1,0.1-0.1
	c0,0,0,0,0,0l0,0c0.1,0,0.1,0.1,0.1,0.1c0,0,0,0,0,0V1.6z"/>
<linearGradient id="SVGID_14_" gradientUnits="userSpaceOnUse" x1="12.85" y1="22.3252" x2="13.13" y2="22.3252" gradientTransform="matrix(1 0 0 -1 0 23.2)">
	<stop  offset="0" style="stop-color:#2A0409"/>
	<stop  offset="0.1" style="stop-color:#3F1B20"/>
	<stop  offset="0.27" style="stop-color:#5C3C41"/>
	<stop  offset="0.41" style="stop-color:#6E5056"/>
	<stop  offset="0.5" style="stop-color:#75575D"/>
	<stop  offset="0.63" style="stop-color:#72545A"/>
	<stop  offset="0.73" style="stop-color:#694A50"/>
	<stop  offset="0.83" style="stop-color:#5A393F"/>
	<stop  offset="0.92" style="stop-color:#452227"/>
	<stop  offset="1" style="stop-color:#2A0409"/>
</linearGradient>
<path class="st24" d="M13.1,1.6c0,0.1-0.1,0.1-0.1,0.1l0,0l0,0c-0.1,0-0.1-0.1-0.1-0.1c0,0,0,0,0,0V0.1C12.8,0.1,12.9,0,13,0
	c0,0,0,0,0,0l0,0c0.1,0,0.1,0.1,0.1,0.1c0,0,0,0,0,0L13.1,1.6z"/>
<linearGradient id="SVGID_15_" gradientUnits="userSpaceOnUse" x1="13.89" y1="22.325" x2="14.17" y2="22.325" gradientTransform="matrix(1 0 0 -1 0 23.2)">
	<stop  offset="0" style="stop-color:#2A0409"/>
	<stop  offset="0.1" style="stop-color:#3F1B20"/>
	<stop  offset="0.27" style="stop-color:#5C3C41"/>
	<stop  offset="0.41" style="stop-color:#6E5056"/>
	<stop  offset="0.5" style="stop-color:#75575D"/>
	<stop  offset="0.63" style="stop-color:#72545A"/>
	<stop  offset="0.73" style="stop-color:#694A50"/>
	<stop  offset="0.83" style="stop-color:#5A393F"/>
	<stop  offset="0.92" style="stop-color:#452227"/>
	<stop  offset="1" style="stop-color:#2A0409"/>
</linearGradient>
<path class="st25" d="M14.2,1.6c0,0.1-0.1,0.1-0.1,0.1l0,0l0,0c-0.1,0-0.1-0.1-0.1-0.1c0,0,0,0,0,0V0.1c0-0.1,0-0.1,0.1-0.1l0,0
	c0.1,0,0.1,0.1,0.1,0.1c0,0,0,0,0,0L14.2,1.6z"/>
<linearGradient id="SVGID_16_" gradientUnits="userSpaceOnUse" x1="14.93" y1="22.325" x2="15.21" y2="22.325" gradientTransform="matrix(1 0 0 -1 0 23.2)">
	<stop  offset="0" style="stop-color:#2A0409"/>
	<stop  offset="0.1" style="stop-color:#3F1B20"/>
	<stop  offset="0.27" style="stop-color:#5C3C41"/>
	<stop  offset="0.41" style="stop-color:#6E5056"/>
	<stop  offset="0.5" style="stop-color:#75575D"/>
	<stop  offset="0.63" style="stop-color:#72545A"/>
	<stop  offset="0.73" style="stop-color:#694A50"/>
	<stop  offset="0.83" style="stop-color:#5A393F"/>
	<stop  offset="0.92" style="stop-color:#452227"/>
	<stop  offset="1" style="stop-color:#2A0409"/>
</linearGradient>
<path class="st26" d="M15.2,1.6c0,0.1-0.1,0.1-0.1,0.1l0,0l0,0c-0.1,0-0.1-0.1-0.1-0.1c0,0,0,0,0,0V0.1C14.9,0.1,15,0,15.1,0
	c0,0,0,0,0,0l0,0c0.1,0,0.1,0.1,0.1,0.1c0,0,0,0,0,0V1.6z"/>
<linearGradient id="SVGID_17_" gradientUnits="userSpaceOnUse" x1="15.97" y1="22.325" x2="16.25" y2="22.325" gradientTransform="matrix(1 0 0 -1 0 23.2)">
	<stop  offset="0" style="stop-color:#2A0409"/>
	<stop  offset="0.1" style="stop-color:#3F1B20"/>
	<stop  offset="0.27" style="stop-color:#5C3C41"/>
	<stop  offset="0.41" style="stop-color:#6E5056"/>
	<stop  offset="0.5" style="stop-color:#75575D"/>
	<stop  offset="0.63" style="stop-color:#72545A"/>
	<stop  offset="0.73" style="stop-color:#694A50"/>
	<stop  offset="0.83" style="stop-color:#5A393F"/>
	<stop  offset="0.92" style="stop-color:#452227"/>
	<stop  offset="1" style="stop-color:#2A0409"/>
</linearGradient>
<path class="st27" d="M16.2,1.6c0,0.1-0.1,0.1-0.1,0.1l0,0C16,1.7,16,1.7,16,1.6V0.1C16,0.1,16,0,16.1,0l0,0c0.1,0,0.1,0.1,0.1,0.1
	V1.6z"/>
<linearGradient id="SVGID_18_" gradientUnits="userSpaceOnUse" x1="17.02" y1="22.325" x2="17.3" y2="22.325" gradientTransform="matrix(1 0 0 -1 0 23.2)">
	<stop  offset="0" style="stop-color:#2A0409"/>
	<stop  offset="0.1" style="stop-color:#3F1B20"/>
	<stop  offset="0.27" style="stop-color:#5C3C41"/>
	<stop  offset="0.41" style="stop-color:#6E5056"/>
	<stop  offset="0.5" style="stop-color:#75575D"/>
	<stop  offset="0.63" style="stop-color:#72545A"/>
	<stop  offset="0.73" style="stop-color:#694A50"/>
	<stop  offset="0.83" style="stop-color:#5A393F"/>
	<stop  offset="0.92" style="stop-color:#452227"/>
	<stop  offset="1" style="stop-color:#2A0409"/>
</linearGradient>
<path class="st28" d="M17.3,1.6c0,0.1-0.1,0.1-0.1,0.1l0,0c-0.1,0-0.1,0-0.2-0.1c0,0,0,0,0,0V0.1C17,0.1,17.1,0,17.1,0c0,0,0,0,0,0
	l0,0c0.1,0,0.1,0.1,0.1,0.1V1.6z"/>
<linearGradient id="SVGID_19_" gradientUnits="userSpaceOnUse" x1="18.06" y1="22.325" x2="18.34" y2="22.325" gradientTransform="matrix(1 0 0 -1 0 23.2)">
	<stop  offset="0" style="stop-color:#2A0409"/>
	<stop  offset="0.1" style="stop-color:#3F1B20"/>
	<stop  offset="0.27" style="stop-color:#5C3C41"/>
	<stop  offset="0.41" style="stop-color:#6E5056"/>
	<stop  offset="0.5" style="stop-color:#75575D"/>
	<stop  offset="0.63" style="stop-color:#72545A"/>
	<stop  offset="0.73" style="stop-color:#694A50"/>
	<stop  offset="0.83" style="stop-color:#5A393F"/>
	<stop  offset="0.92" style="stop-color:#452227"/>
	<stop  offset="1" style="stop-color:#2A0409"/>
</linearGradient>
<path class="st29" d="M18.3,1.6c0,0.1-0.1,0.1-0.1,0.1l0,0c-0.1,0-0.1-0.1-0.1-0.1V0.1c0-0.1,0.1-0.1,0.1-0.1l0,0
	c0.1,0,0.1,0.1,0.1,0.1V1.6z"/>
<path class="st13" d="M2.6,0C2.5,0,2.4,0.1,2.4,0.1c0,0,0,0,0,0v0.3c0-0.1,0.1-0.1,0.1-0.1c0.1,0,0.1,0.1,0.1,0.1V0.1
	C2.7,0.1,2.7,0,2.6,0z"/>
<path class="st13" d="M3.6,0C3.5,0,3.5,0.1,3.5,0.1c0,0,0,0,0,0v0.3c0-0.1,0.1-0.1,0.1-0.1c0.1,0,0.1,0.1,0.1,0.1V0.1
	C3.8,0.1,3.7,0,3.6,0z"/>
<path class="st13" d="M4.7,0C4.6,0,4.5,0.1,4.5,0.1v0.3c0-0.1,0.1-0.1,0.1-0.1c0.1,0,0.1,0.1,0.1,0.1V0.1C4.8,0.1,4.7,0,4.7,0
	C4.7,0,4.7,0,4.7,0z"/>
<path class="st13" d="M5.7,0C5.6,0,5.6,0.1,5.6,0.1v0.3c0-0.1,0.1-0.1,0.1-0.1c0.1,0,0.1,0.1,0.1,0.1V0.1C5.8,0.1,5.8,0,5.7,0
	C5.7,0,5.7,0,5.7,0z"/>
<path class="st13" d="M6.7,0C6.7,0,6.6,0.1,6.6,0.1v0.3c0-0.1,0.1-0.1,0.1-0.1c0.1,0,0.1,0.1,0.1,0.1V0.1C6.9,0.1,6.8,0,6.7,0
	C6.7,0,6.7,0,6.7,0z"/>
<path class="st13" d="M7.8,0C7.7,0,7.7,0.1,7.7,0.1v0.3c0-0.1,0.1-0.1,0.1-0.1c0.1,0,0.1,0.1,0.1,0.1V0.1C7.9,0.1,7.9,0,7.8,0
	C7.8,0,7.8,0,7.8,0z"/>
<path class="st13" d="M8.8,0C8.8,0,8.7,0.1,8.7,0.1c0,0,0,0,0,0v0.3c0-0.1,0.1-0.2,0.2-0.2C8.9,0.3,9,0.4,9,0.5V0.1
	C9,0.1,8.9,0,8.8,0C8.9,0,8.8,0,8.8,0z"/>
<path class="st13" d="M9.9,0C9.8,0,9.7,0.1,9.7,0.1c0,0,0,0,0,0v0.3c0-0.1,0.1-0.1,0.1-0.1c0.1,0,0.1,0.1,0.1,0.1V0.1
	C10,0.1,9.9,0,9.9,0z"/>
<path class="st13" d="M10.9,0c-0.1,0-0.1,0.1-0.1,0.1c0,0,0,0,0,0v0.3c0-0.1,0.1-0.1,0.1-0.1C11,0.4,11,0.4,11,0.5V0.1
	C11,0.1,11,0,10.9,0z"/>
<path class="st13" d="M11.9,0c-0.1,0-0.1,0.1-0.1,0.1c0,0,0,0,0,0v0.3c0-0.1,0.1-0.1,0.1-0.1c0.1,0,0.1,0.1,0.1,0.1V0.1
	C12.1,0.1,12,0,11.9,0z"/>
<path class="st13" d="M13,0c-0.1,0-0.1,0.1-0.1,0.1c0,0,0,0,0,0v0.3c0-0.1,0.1-0.1,0.1-0.1c0.1,0,0.1,0.1,0.1,0.1V0.1
	C13.1,0.1,13.1,0,13,0z"/>
<path class="st13" d="M14,0c-0.1,0-0.1,0.1-0.1,0.1c0,0,0,0,0,0v0.3c0-0.1,0.1-0.1,0.1-0.1c0.1,0,0.1,0.1,0.1,0.1V0.1
	C14.1,0.1,14.1,0,14,0z"/>
<path class="st13" d="M15.1,0c-0.1,0-0.1,0.1-0.1,0.1c0,0,0,0,0,0v0.3c0-0.1,0.1-0.1,0.1-0.1c0.1,0,0.1,0.1,0.1,0.1V0.1
	C15.2,0.1,15.1,0,15.1,0z"/>
<path class="st13" d="M16.1,0C16,0,16,0.1,16,0.1v0.3c0-0.1,0.1-0.1,0.1-0.1c0.1,0,0.1,0.1,0.1,0.1V0.1C16.3,0.1,16.2,0,16.1,0
	C16.1,0,16.1,0,16.1,0z"/>
<path class="st13" d="M17.2,0C17.1,0,17,0,17,0.1c0,0,0,0,0,0v0.3c0-0.1,0.1-0.1,0.1-0.1c0.1,0,0.1,0.1,0.1,0.1V0.1
	C17.3,0.1,17.2,0,17.2,0z"/>
<path class="st13" d="M18.2,0c-0.1,0-0.1,0.1-0.1,0.1v0.3c0-0.1,0.1-0.1,0.1-0.1c0.1,0,0.1,0.1,0.1,0.1V0.1C18.3,0.1,18.3,0,18.2,0
	C18.2,0,18.2,0,18.2,0z"/>
</svg>
