<?xml version="1.0" encoding="utf-8"?>
<!-- Generator: Adobe Illustrator 21.0.0, SVG Export Plug-In . SVG Version: 6.00 Build 0)  -->
<svg version="1.1" id="katman_1" xmlns="http://www.w3.org/2000/svg" xmlns:xlink="http://www.w3.org/1999/xlink" x="0px" y="0px"
	 viewBox="0 0 22 16.5" style="enable-background:new 0 0 22 16.5;" xml:space="preserve">
<style type="text/css">
	.st0{opacity:0.3;enable-background:new    ;}
	.st1{fill:url(#SVGID_1_);}
	.st2{fill:url(#SVGID_2_);}
	.st3{opacity:0.2;}
	.st4{opacity:0.1;enable-background:new    ;}
	.st5{opacity:0.1;fill:#FFFFFF;enable-background:new    ;}
	.st6{fill:#F2F2F2;}
</style>
<title>gnome-window-manager_4</title>
<path class="st0" d="M22,0.5C22,0.2,21.8,0,21.5,0c0,0,0,0,0,0H0.5C0.2,0,0,0.2,0,0.5V16h21.9V2.3H22V0.5z"/>
<linearGradient id="SVGID_1_" gradientUnits="userSpaceOnUse" x1="10.94" y1="0.2" x2="10.94" y2="14.23" gradientTransform="matrix(1 0 0 -1 0 15.73)">
	<stop  offset="0" style="stop-color:#D7D7D6"/>
	<stop  offset="6.000000e-02" style="stop-color:#DEDDDC"/>
	<stop  offset="0.22" style="stop-color:#EAE9E8"/>
	<stop  offset="0.44" style="stop-color:#F1EFEE"/>
	<stop  offset="1" style="stop-color:#F3F1F0"/>
</linearGradient>
<rect x="0.2" y="1.5" class="st1" width="21.5" height="14.3"/>
<linearGradient id="SVGID_2_" gradientUnits="userSpaceOnUse" x1="11" y1="-6.66" x2="11" y2="15.39" gradientTransform="matrix(1 0 0 -1 0 15.73)">
	<stop  offset="5.000000e-02" style="stop-color:#1A1A1A"/>
	<stop  offset="0.39" style="stop-color:#1D1D1D"/>
	<stop  offset="0.66" style="stop-color:#272727"/>
	<stop  offset="0.91" style="stop-color:#383838"/>
	<stop  offset="1" style="stop-color:#404040"/>
</linearGradient>
<path class="st2" d="M21.8,2.2V0.5c0-0.2-0.2-0.4-0.4-0.4c0,0,0,0,0,0H0.5c-0.2,0-0.4,0.2-0.4,0.4v1.6H21.8z"/>
<g class="st3">
	<path d="M19.7,1.8l0.4-0.5l-0.4-0.5h0.4l0.2,0.2l0.2-0.2h0.3l-0.4,0.5l0.4,0.5h-0.4l-0.2-0.3L20,1.8H19.7z"/>
</g>
<g class="st3">
	<path d="M18.5,1.8V1.4h-0.4V1.2h0.4V0.8h0.3v0.3h0.4v0.2h-0.4v0.4L18.5,1.8z"/>
</g>
<rect x="0.2" y="15.8" class="st4" width="21.5" height="0.7"/>
<path class="st5" d="M21.5,0.2H0.5c-0.2,0-0.4,0.2-0.4,0.4v0.7c0-0.2,0.2-0.4,0.4-0.4h20.9c0.2,0,0.4,0.2,0.4,0.4c0,0,0,0,0,0V0.5
	C21.8,0.3,21.7,0.2,21.5,0.2C21.5,0.2,21.5,0.2,21.5,0.2z"/>
<rect x="0.2" y="2.2" class="st4" width="21.7" height="0.7"/>
<path class="st6" d="M19.7,1.7l0.4-0.5l-0.4-0.5h0.4L20.3,1l0.2-0.2h0.3l-0.4,0.5l0.4,0.5h-0.4l-0.2-0.3L20,1.7H19.7z"/>
<path class="st6" d="M18.5,1.7V1.3h-0.4V1.1h0.4V0.7h0.3v0.4h0.4v0.2h-0.4v0.4L18.5,1.7z"/>
</svg>
