<?xml version="1.0" encoding="utf-8"?>
<!-- Generator: Adobe Illustrator 21.0.0, SVG Export Plug-In . SVG Version: 6.00 Build 0)  -->
<svg version="1.1" id="katman_1" xmlns="http://www.w3.org/2000/svg" xmlns:xlink="http://www.w3.org/1999/xlink" x="0px" y="0px"
	 viewBox="0 0 23.8 21.2" style="enable-background:new 0 0 23.8 21.2;" xml:space="preserve">
<style type="text/css">
	.st0{fill:#E7E9EC;}
	.st1{fill:#2C2F33;}
</style>
<path class="st0" d="M23.9,19.5L23,12.2L12.1-0.1L7,5.4V5.2c0-0.3-0.2-0.6-0.6-0.6h-2c-0.1,0-0.1,0-0.2,0C4,4.6,3.8,4.9,3.8,5l0,0.1
	V9l-2.7,3l-1.1,7.2L12.1,3.9L23.9,19.5z"/>
<polygon class="st0" points="2.8,15.8 2.8,20.5 21,20.7 21,16 12.1,4.3 "/>
<title>user-home_3</title>
<path class="st1" d="M21.2,21L2.6,20.9l0.1-5.2L12.1,4L21.2,16V21z M3,20.4l17.7,0.1v-4.4L12.1,4.7l-9,11.2L3,20.4z"/>
<path class="st1" d="M6.7,5.4V5.2C6.7,5,6.6,5,6.4,5l0,0h-2C4.2,4.9,4.1,5,4,5.1v3.2L6.7,5.4z"/>
<polygon class="st1" points="23.5,18.5 22.7,12.3 12.1,0.3 1.3,12.1 0.3,18.2 12.1,3.5 "/>
<path class="st1" d="M14.6,20.7l0.1-5.5c0-1.6-1.2-2.7-2.7-2.8l0,0l0,0c-1.6,0-2.7,1.2-2.8,2.7l-0.1,5.5L14.6,20.7z"/>
</svg>
