<?xml version="1.0" encoding="utf-8"?>
<!-- Generator: Adobe Illustrator 21.0.0, SVG Export Plug-In . SVG Version: 6.00 Build 0)  -->
<svg version="1.1" id="katman_1" xmlns="http://www.w3.org/2000/svg" xmlns:xlink="http://www.w3.org/1999/xlink" x="0px" y="0px"
	 viewBox="0 0 24 16.6" style="enable-background:new 0 0 24 16.6;" xml:space="preserve">
<style type="text/css">
	.st0{opacity:0.8;fill:#0E141E;enable-background:new    ;}
	.st1{fill:url(#_Dikdörtgen__1_);}
	.st2{opacity:0.2;fill:#0E141E;enable-background:new    ;}
	.st3{fill:url(#SVGID_1_);}
	.st4{fill:url(#_Bileşik_Yol__1_);}
	.st5{opacity:0.1;fill:#FFFFFF;enable-background:new    ;}
	.st6{opacity:0.1;enable-background:new    ;}
</style>
<title>desktop_3</title>
<path class="st0" d="M0.6,16.1c-0.3,0-0.6-0.3-0.6-0.6V0.6C0,0.3,0.3,0,0.6,0h22.7C23.7,0,24,0.3,24,0.6v14.8c0,0.4-0.3,0.6-0.6,0.6
	L0.6,16.1z M22.2,14.3V1.8H1.8v12.5L22.2,14.3z"/>
<linearGradient id="_Dikdörtgen__1_" gradientUnits="userSpaceOnUse" x1="12.005" y1="3.19" x2="12.005" y2="16.24" gradientTransform="matrix(1 0 0 -1 0 17.73)">
	<stop  offset="0" style="stop-color:#2D5778"/>
	<stop  offset="1" style="stop-color:#2A6D94"/>
</linearGradient>
<rect id="_Dikdörtgen_" x="1.5" y="1.5" class="st1" width="21" height="13.1"/>
<path class="st2" d="M3.5,10.8c-0.2,0-0.4-0.2-0.4-0.4V8.8c0-0.2,0.2-0.4,0.4-0.4h3.3L2.5,4.2C2.4,4,2.4,3.8,2.5,3.6c0,0,0,0,0,0
	l1.1-1.1c0.2-0.2,0.4-0.2,0.6,0c0,0,0,0,0,0l4.2,4.2V3.5c0-0.2,0.2-0.4,0.4-0.4h1.6c0.2,0,0.4,0.2,0.4,0.4v6.7
	c0,0.3-0.3,0.6-0.6,0.6L3.5,10.8z"/>
<linearGradient id="SVGID_1_" gradientUnits="userSpaceOnUse" x1="6.6772" y1="15.1192" x2="6.6072" y2="7.0832" gradientTransform="matrix(1 0 0 -1 0 17.73)">
	<stop  offset="0" style="stop-color:#DEDFE1"/>
	<stop  offset="1" style="stop-color:#B3B7BE"/>
</linearGradient>
<path class="st3" d="M8.7,3.5v3.7L4.1,2.7C4,2.6,3.9,2.6,3.8,2.6c0,0,0,0,0,0L2.7,3.8C2.6,3.8,2.6,4,2.7,4.1c0,0,0,0,0,0l4.6,4.6
	H3.5c-0.1,0-0.2,0.1-0.2,0.2l0,0v1.6c0,0.1,0.1,0.2,0.2,0.2l0,0h6.7c0.2,0,0.4-0.2,0.4-0.4l0,0V3.5c0-0.1-0.1-0.2-0.2-0.2l0,0H8.9
	C8.8,3.3,8.7,3.4,8.7,3.5L8.7,3.5z"/>
<linearGradient id="_Bileşik_Yol__1_" gradientUnits="userSpaceOnUse" x1="11.995" y1="1.87" x2="11.995" y2="17.5401" gradientTransform="matrix(1 0 0 -1 0 17.73)">
	<stop  offset="0" style="stop-color:#A3A4A4"/>
	<stop  offset="0.12" style="stop-color:#BBBBBB"/>
	<stop  offset="0.27" style="stop-color:#CFCECE"/>
	<stop  offset="0.43" style="stop-color:#DDDCDC"/>
	<stop  offset="0.64" style="stop-color:#E5E4E4"/>
	<stop  offset="1" style="stop-color:#E7E6E6"/>
</linearGradient>
<path id="_Bileşik_Yol_" class="st4" d="M23.4,0.2H0.6c-0.2,0-0.4,0.2-0.4,0.4c0,0,0,0,0,0v14.8c0,0.2,0.2,0.4,0.4,0.4h22.7
	c0.2,0,0.4-0.2,0.4-0.4l0,0V0.6C23.8,0.4,23.6,0.2,23.4,0.2C23.4,0.2,23.4,0.2,23.4,0.2z M22.4,14.5H1.6V1.6h20.8L22.4,14.5z"/>
<path class="st5" d="M3.3,8.8v0.8c0-0.1,0.1-0.2,0.2-0.2l0,0h3.7L6.5,8.6h-3C3.4,8.6,3.3,8.7,3.3,8.8z"/>
<path class="st5" d="M4.1,3.4L8.7,8V7.2L4.1,2.7C4,2.6,3.9,2.6,3.8,2.6c0,0,0,0,0,0L2.7,3.8C2.6,3.8,2.6,4,2.7,4.1c0,0,0,0,0,0
	l0.2,0.2l0.9-0.9C3.9,3.3,4,3.3,4.1,3.4z"/>
<path class="st5" d="M10.4,3.3H8.9c-0.1,0-0.2,0.1-0.2,0.2l0,0v0.8c0-0.1,0.1-0.2,0.2-0.2l0,0h1.6c0.1,0,0.2,0.1,0.2,0.2l0,0V3.5
	C10.7,3.4,10.6,3.3,10.4,3.3L10.4,3.3z"/>
<path class="st6" d="M10.2,10.6H3.5c-0.1,0-0.2-0.1-0.2-0.2l0,0v0.8c0,0.1,0.1,0.2,0.2,0.2l0,0h6.7c0.2,0,0.4-0.2,0.4-0.4l0,0v-0.8
	C10.7,10.4,10.5,10.6,10.2,10.6z"/>
<path class="st6" d="M7.3,8.6L2.9,4.3L2.7,4.5c-0.1,0.1-0.1,0.2,0,0.3c0,0,0,0,0,0l3.8,3.8H7.3z"/>
<rect x="1.6" y="14.5" class="st5" width="20.8" height="0.8"/>
<path class="st5" d="M23.4,0.2H0.6c-0.2,0-0.4,0.2-0.4,0.4c0,0,0,0,0,0v0.8C0.2,1.2,0.4,1,0.6,1h22.7c0.2,0,0.4,0.2,0.4,0.4
	c0,0,0,0,0,0V0.6C23.8,0.4,23.6,0.2,23.4,0.2C23.4,0.2,23.4,0.2,23.4,0.2z"/>
<path class="st6" d="M23.4,15.9H0.6c-0.2,0-0.4-0.2-0.4-0.4v0.8c0,0.2,0.2,0.4,0.4,0.4c0,0,0,0,0,0h22.7c0.2,0,0.4-0.2,0.4-0.4
	c0,0,0,0,0,0v-0.8C23.8,15.7,23.6,15.9,23.4,15.9L23.4,15.9z"/>
<rect x="1.6" y="1.6" class="st6" width="20.8" height="0.8"/>
</svg>
