<?xml version="1.0" encoding="utf-8"?>
<!-- Generator: Adobe Illustrator 21.0.0, SVG Export Plug-In . SVG Version: 6.00 Build 0)  -->
<svg version="1.1" id="katman_1" xmlns="http://www.w3.org/2000/svg" xmlns:xlink="http://www.w3.org/1999/xlink" x="0px" y="0px"
	 viewBox="0 0 23.9 24" style="enable-background:new 0 0 23.9 24;" xml:space="preserve">
<style type="text/css">
	.st0{opacity:0.7;fill:#2C5879;enable-background:new    ;}
	.st1{fill:url(#SVGID_1_);}
	.st2{fill:#F1F2F2;}
	.st3{opacity:0.1;fill:#FFFFFF;enable-background:new    ;}
	.st4{opacity:0.1;fill:#020202;enable-background:new    ;}
	.st5{fill:url(#SVGID_2_);}
	.st6{fill:url(#SVGID_3_);}
</style>
<title>web-browser_3</title>
<path class="st0" d="M11.3,22.7C5.1,22.7,0,17.6,0,11.3S5.1,0,11.3,0s11.3,5.1,11.3,11.3c0,0,0,0,0,0C22.6,17.6,17.6,22.6,11.3,22.7
	z M16,17.3c-0.7,1.6-1.7,3.1-3,4.4c2.2-0.3,4.3-1.4,5.8-3C17.9,18.1,17,17.6,16,17.3z M4,18.7c1.6,1.6,3.6,2.7,5.8,3
	c-1.3-1.3-2.4-2.7-3.1-4.4C5.7,17.6,4.8,18.1,4,18.7L4,18.7z M11.9,21.4c1.4-1.2,2.5-2.7,3.2-4.4c-1.1-0.3-2.2-0.5-3.3-0.5
	L11.9,21.4z M7.6,17c0.8,1.7,1.9,3.2,3.3,4.4v-5C9.8,16.5,8.6,16.7,7.6,17z M16.3,16.4c1.1,0.4,2.1,0.9,3,1.5
	c1.4-1.7,2.3-3.9,2.4-6.2h-4.5C17.2,13.4,16.9,14.9,16.3,16.4L16.3,16.4z M0.9,11.8C1,14.1,1.9,16.2,3.3,18c0.9-0.6,1.9-1.2,3-1.5
	c-0.6-1.5-0.9-3-0.9-4.6L0.9,11.8z M6.4,11.8c0,1.5,0.3,2.9,0.9,4.3c1.2-0.4,2.4-0.6,3.6-0.6v-3.7H6.4z M11.8,15.5
	c1.2,0,2.5,0.2,3.6,0.6c0.5-1.4,0.8-2.8,0.9-4.3h-4.5L11.8,15.5z M21.7,10.9c-0.1-2.4-1-4.6-2.6-6.4c-0.9,0.6-1.9,1.1-3,1.5
	c0.6,1.6,1,3.3,1,5L21.7,10.9z M16.3,10.9c-0.1-1.6-0.4-3.2-1-4.7c-1.1,0.3-2.3,0.5-3.5,0.6v4.1L16.3,10.9z M10.9,10.9V6.7
	c-1.2,0-2.4-0.2-3.5-0.6c-0.6,1.5-0.9,3.1-1,4.7L10.9,10.9z M5.4,10.9c0-1.7,0.4-3.4,1-5C5.4,5.5,4.4,5,3.4,4.4
	C1.9,6.2,1,8.5,0.9,10.9H5.4z M7.7,5.3c1,0.3,2.1,0.4,3.1,0.5V1.3C9.6,2.4,8.5,3.8,7.7,5.3z M11.7,5.8c1.1,0,2.1-0.2,3.1-0.5
	c-0.8-1.6-1.8-2.9-3.1-4.1V5.8z M4.1,3.8C5,4.3,5.9,4.8,6.9,5.1C7.6,3.6,8.6,2.2,9.8,1C7.7,1.3,5.7,2.3,4.1,3.8L4.1,3.8z M12.9,1
	c1.2,1.2,2.2,2.5,2.9,4c0.9-0.3,1.8-0.8,2.7-1.3C16.9,2.3,15,1.3,12.9,1z"/>
<linearGradient id="SVGID_1_" gradientUnits="userSpaceOnUse" x1="11.32" y1="1.68" x2="11.32" y2="23.07" gradientTransform="matrix(1 0 0 -1 0 23.73)">
	<stop  offset="0" style="stop-color:#2D5879"/>
	<stop  offset="1" style="stop-color:#2C6E95"/>
</linearGradient>
<path class="st1" d="M22.2,11.3c0,6-4.9,10.9-10.9,10.9S0.4,17.3,0.5,11.3c0-6,4.9-10.9,10.9-10.9c0,0,0,0,0,0
	C17.3,0.5,22.2,5.3,22.2,11.3z"/>
<path class="st2" d="M11.3,22.5c-6.2,0-11.1-5-11.1-11.1c0-6.2,5-11.1,11.1-11.1c6.2,0,11.1,5,11.1,11.1c0,0,0,0,0,0
	C22.4,17.5,17.5,22.4,11.3,22.5z M3.6,18.6c1.8,1.9,4.1,3,6.7,3.3c-1.5-1.4-2.7-3-3.5-4.9C5.7,17.4,4.6,17.9,3.6,18.6z M15.9,17
	c-0.8,1.8-2,3.5-3.5,4.9c2.5-0.2,4.9-1.4,6.6-3.2C18,17.9,17,17.4,15.9,17z M11.6,21.8c1.6-1.4,2.9-3.1,3.7-5
	c-1.2-0.4-2.5-0.6-3.7-0.6V21.8z M7.3,16.8c0.8,1.9,2.1,3.6,3.7,5v-5.5C9.8,16.3,8.5,16.5,7.3,16.8L7.3,16.8z M16.1,16.5
	c1.2,0.4,2.3,1,3.3,1.7c1.6-1.8,2.5-4.2,2.5-6.6H17C17,13.3,16.7,14.9,16.1,16.5L16.1,16.5z M0.7,11.6c0.1,2.4,1,4.8,2.5,6.6
	c1-0.7,2.2-1.3,3.3-1.7c-0.6-1.6-1-3.2-1-4.9L0.7,11.6z M11.6,15.7c1.3,0,2.7,0.2,3.9,0.6c0.6-1.5,0.9-3.1,0.9-4.8h-4.9V15.7z
	 M6.2,11.6c0,1.6,0.4,3.2,0.9,4.8c1.3-0.4,2.6-0.6,3.9-0.6v-4.1H6.2z M21.9,11.1c-0.1-2.5-1-5-2.8-6.9c-1,0.7-2.1,1.2-3.2,1.6
	c0.7,1.7,1.1,3.5,1.1,5.3H21.9z M16.5,11.1c0-1.7-0.4-3.5-1.1-5.1c-1.2,0.4-2.5,0.6-3.8,0.6v4.5L16.5,11.1z M11.1,11.1V6.6
	C9.8,6.5,8.5,6.4,7.2,6c-0.7,1.6-1.1,3.3-1.1,5.1L11.1,11.1z M5.6,11.1c0-1.8,0.4-3.6,1.1-5.3C5.6,5.4,4.5,4.9,3.5,4.2
	c-1.7,1.9-2.7,4.3-2.8,6.9H5.6z M7.5,5.5C8.6,5.8,9.8,6,11.1,6V0.8C9.5,2.1,8.3,3.7,7.5,5.5L7.5,5.5z M11.6,6c1.2,0,2.4-0.2,3.6-0.6
	c-0.9-1.8-2.1-3.4-3.6-4.6V6z M3.9,3.8c1,0.6,2,1.1,3.1,1.5c0.8-1.7,1.9-3.2,3.3-4.5C7.9,1,5.6,2.1,3.9,3.8z M12.4,0.8
	c1.4,1.3,2.5,2.8,3.3,4.5c1.1-0.4,2.1-0.9,3.1-1.5C17.1,2.1,14.8,1,12.4,0.8L12.4,0.8z"/>
<path class="st3" d="M11.3,1c6,0,10.9,4.8,11.1,10.8c0-0.1,0-0.2,0-0.4C22.6,5.2,17.8,0,11.6-0.1S0.4,4.5,0.2,10.7
	c0,0.2,0,0.4,0,0.7c0,0.1,0,0.2,0,0.4C0.4,5.7,5.3,0.9,11.3,1z"/>
<path class="st4" d="M11.3,22.5c-6,0-10.9-4.8-11.1-10.7c0,0.1,0,0.2,0,0.4C0,18.2,4.9,23.4,11,23.6c6.1,0.2,11.3-4.7,11.5-10.8
	c0-0.2,0-0.4,0-0.7c0-0.1,0-0.2,0-0.4C22.3,17.7,17.3,22.5,11.3,22.5z"/>
<path class="st4" d="M13.3,22.1h-2.6c-0.4,0-0.7-0.3-0.7-0.7v0.8c0,0.4,0.3,0.7,0.7,0.7h2.6c0.4,0,0.7-0.3,0.7-0.7v-0.8
	C14,21.8,13.7,22.1,13.3,22.1z"/>
<path class="st4" d="M22.8,13.4v-0.8c0,0.4-0.3,0.7-0.7,0.7h-5.2l0.8,0.8h4.5C22.5,14.1,22.8,13.8,22.8,13.4z"/>
<path class="st4" d="M23.7,21.2L21.9,23c-0.3,0.3-0.7,0.3-1,0L14,16.2v0.8l6.9,6.9c0.3,0.3,0.7,0.3,1,0l1.8-1.8
	c0.2-0.2,0.3-0.6,0.1-0.9C23.8,21.1,23.7,21.2,23.7,21.2z"/>
<linearGradient id="SVGID_2_" gradientUnits="userSpaceOnUse" x1="10.6717" y1="14.8648" x2="22.4417" y2="0.6748" gradientTransform="matrix(1 0 0 -1 0 23.73)">
	<stop  offset="0" style="stop-color:#2C6E95"/>
	<stop  offset="0.54" style="stop-color:#2D6083"/>
	<stop  offset="1" style="stop-color:#2D5879"/>
</linearGradient>
<path class="st5" d="M21.4,23.2c-0.2,0-0.4-0.1-0.5-0.2L14,16.2v5.2c0,0.4-0.3,0.7-0.7,0.7h-2.6c-0.4,0-0.7-0.3-0.7-0.7v-11
	c0-0.6,0.4-1.1,1-1.1c0,0,0,0,0,0h11c0.4,0,0.7,0.3,0.7,0.7v2.6c0,0.4-0.3,0.7-0.7,0.7h-5.2l6.9,6.9c0.3,0.3,0.3,0.7,0,1L21.9,23
	C21.8,23.1,21.6,23.2,21.4,23.2z"/>
<linearGradient id="SVGID_3_" gradientUnits="userSpaceOnUse" x1="12.6353" y1="13.7335" x2="22.4153" y2="-1.1765" gradientTransform="matrix(1 0 0 -1 0 23.73)">
	<stop  offset="0" style="stop-color:#E8E6E5"/>
	<stop  offset="0.25" style="stop-color:#E4E2E1"/>
	<stop  offset="0.48" style="stop-color:#D9D7D6"/>
	<stop  offset="0.72" style="stop-color:#C5C4C4"/>
	<stop  offset="0.95" style="stop-color:#AAAAAA"/>
	<stop  offset="1" style="stop-color:#A3A3A3"/>
</linearGradient>
<path class="st6" d="M13.6,21.4v-6.1l7.5,7.5c0.1,0.1,0.3,0.1,0.5,0c0,0,0,0,0,0l1.8-1.8c0.1-0.1,0.1-0.3,0-0.5c0,0,0,0,0,0
	l-7.5-7.5h6.1c0.2,0,0.3-0.2,0.3-0.3l0,0V10c0-0.2-0.2-0.3-0.3-0.3l0,0H11c-0.4,0-0.7,0.3-0.7,0.7v11c0,0.2,0.2,0.3,0.3,0.3l0,0h2.6
	C13.4,21.7,13.6,21.6,13.6,21.4C13.6,21.4,13.6,21.4,13.6,21.4z"/>
<path class="st3" d="M11,10.4h11c0.2,0,0.3,0.2,0.3,0.3l0,0V10c0-0.2-0.2-0.3-0.3-0.3l0,0H11c-0.4,0-0.7,0.3-0.7,0.7v0.8
	C10.3,10.7,10.6,10.4,11,10.4z"/>
</svg>
