<?xml version="1.0" encoding="utf-8"?>
<!-- Generator: Adobe Illustrator 21.0.0, SVG Export Plug-In . SVG Version: 6.00 Build 0)  -->
<svg version="1.1" id="katman_1" xmlns="http://www.w3.org/2000/svg" xmlns:xlink="http://www.w3.org/1999/xlink" x="0px" y="0px"
	 viewBox="0 0 47.5 48" style="enable-background:new 0 0 47.5 48;" xml:space="preserve">
<style type="text/css">
	.st0{fill:url(#_Yol__1_);}
	.st1{fill:#FFFFFF;}
	.st2{opacity:0.5;fill:#20396E;enable-background:new    ;}
	.st3{fill:#EAF6FE;}
	.st4{fill:none;}
	.st5{opacity:0.1;fill:#FFFFFF;enable-background:new    ;}
	.st6{opacity:0.2;enable-background:new    ;}
</style>
<title>preferences-desktop_1</title>
<linearGradient id="_Yol__1_" gradientUnits="userSpaceOnUse" x1="23.745" y1="2.63" x2="23.745" y2="45.71" gradientTransform="matrix(1 0 0 -1 0 47.73)">
	<stop  offset="0" style="stop-color:#2D5778"/>
	<stop  offset="0.39" style="stop-color:#2D5A7C"/>
	<stop  offset="0.74" style="stop-color:#2B6286"/>
	<stop  offset="1" style="stop-color:#2A6D94"/>
</linearGradient>
<path id="_Yol_" class="st0" d="M2.9,43.9V3c0,0,0-0.1,0.1-0.1h41.5c0,0,0.1,0,0.1,0.1c0,0,0,0,0,0v40.9L2.9,43.9L2.9,43.9z"/>
<rect x="33.5" y="21.5" class="st1" width="3.2" height="22.5"/>
<rect x="33.5" y="2.6" class="st1" width="3.2" height="9"/>
<rect x="21.9" y="32.3" class="st1" width="3.2" height="11.8"/>
<rect x="21.9" y="2.9" class="st1" width="3.2" height="19.5"/>
<rect x="10.2" y="22.1" class="st1" width="3.2" height="21.9"/>
<rect x="10.2" y="2.9" class="st1" width="3.2" height="9"/>
<rect x="33.2" y="21.2" class="st2" width="3.9" height="23.3"/>
<rect x="33.5" y="21.5" class="st3" width="3.2" height="22.5"/>
<rect x="33.2" y="2.2" class="st2" width="3.9" height="9.8"/>
<rect x="33.5" y="2.6" class="st3" width="3.2" height="9"/>
<rect x="21.5" y="31.9" class="st2" width="3.9" height="12.5"/>
<rect x="21.9" y="32.3" class="st3" width="3.2" height="11.8"/>
<rect x="21.5" y="2.5" class="st2" width="3.9" height="20.2"/>
<rect x="21.9" y="2.9" class="st3" width="3.2" height="19.5"/>
<rect x="9.9" y="21.7" class="st2" width="3.9" height="22.7"/>
<rect x="10.2" y="22.1" class="st3" width="3.2" height="21.9"/>
<rect x="9.9" y="2.6" class="st2" width="3.9" height="9.7"/>
<rect x="10.2" y="2.9" class="st3" width="3.2" height="9"/>
<rect x="2.1" y="1.8" class="st4" width="43.3" height="43.3"/>
<rect x="3.1" y="43.7" class="st1" width="41.2" height="0.7"/>
<path class="st1" d="M46.1,0.4H1.3c-0.5,0-0.9,0.4-0.9,0.9V2c0-0.5,0.4-0.9,0.9-0.9h44.9C46.6,1.1,47,1.5,47,2V1.3
	C47,0.8,46.6,0.4,46.1,0.4C46.2,0.4,46.2,0.4,46.1,0.4z"/>
<path class="st2" d="M1.3,46.9c-0.7,0-1.3-0.6-1.3-1.2c0,0,0,0,0,0V1.3C0,0.6,0.6,0,1.3,0h44.9c0.7,0,1.3,0.5,1.3,1.2v44.3
	c0,0.7-0.6,1.3-1.2,1.3c0,0,0,0,0,0L1.3,46.9z M43.9,43.4L44,3.5H3.5v39.9L43.9,43.4z"/>
<path id="_Bileşik_Yol_" class="st3" d="M46.1,0.4H1.3c-0.5,0-0.9,0.4-0.9,0.9v44.3c0,0.5,0.4,0.9,0.9,0.9c0,0,0,0,0,0h45
	c0.5,0,0.9-0.4,0.9-0.9c0,0,0,0,0,0V1.3C47.1,0.8,46.6,0.4,46.1,0.4z M44.3,43.7H3.1V3.1l0,0h41.2l0,0V43.7z"/>
<circle class="st2" cx="11.8" cy="18.8" r="4.8"/>
<circle class="st3" cx="11.8" cy="18.8" r="4.5"/>
<circle class="st2" cx="23.5" cy="29.3" r="4.8"/>
<circle class="st3" cx="23.5" cy="29.3" r="4.5"/>
<circle class="st2" cx="35.1" cy="18.8" r="4.8"/>
<circle class="st3" cx="35.1" cy="18.8" r="4.5"/>
<polygon class="st5" points="44.3,43.7 44.3,43.7 3.1,43.7 3.1,45.2 44.3,45.2 44.3,43.7 "/>
<path class="st5" d="M46.1,0.4H1.3c-0.5,0-0.9,0.4-0.9,0.9v1.5c0-0.5,0.4-0.9,0.9-0.9h44.9c0.5,0,0.9,0.4,1,0.9V1.3
	C47.1,0.8,46.7,0.4,46.1,0.4z"/>
<path class="st6" d="M41.7,4.6h2.7V3.1l0,0H3.2l0,0v1.5l0,0L41.7,4.6L41.7,4.6z"/>
<path class="st6" d="M46.2,46.5h-45c-0.5,0-0.9-0.4-0.9-0.9c0,0,0,0,0,0v1.5c0,0.5,0.4,0.9,0.9,0.9c0,0,0,0,0,0h45
	c0.5,0,0.9-0.4,0.9-0.9c0,0,0,0,0,0v-1.5C47.1,46.1,46.7,46.5,46.2,46.5C46.2,46.5,46.2,46.5,46.2,46.5z"/>
<path class="st5" d="M11.8,15.8c2.2,0,4,1.6,4.4,3.7c0.4-2.4-1.2-4.7-3.6-5.2S7.8,15.6,7.4,18c-0.1,0.5-0.1,1,0,1.5
	C7.8,17.4,9.6,15.8,11.8,15.8z"/>
<path class="st6" d="M11.8,23.2c-2.2,0-4-1.6-4.4-3.7C7,22,8.6,24.3,11,24.7s4.7-1.2,5.2-3.6c0.1-0.5,0.1-1,0-1.5
	C15.8,21.7,14,23.2,11.8,23.2z"/>
<path class="st5" d="M23.5,26.4c2.2,0,4,1.6,4.4,3.7c0.4-2.4-1.2-4.7-3.6-5.2c-2.4-0.4-4.7,1.2-5.2,3.6c-0.1,0.5-0.1,1,0,1.5
	C19.5,27.9,21.3,26.4,23.5,26.4z"/>
<path class="st6" d="M23.5,33.8c-2.2,0-4-1.6-4.4-3.7c-0.4,2.4,1.2,4.7,3.6,5.2c2.4,0.4,4.7-1.2,5.2-3.6c0.1-0.5,0.1-1,0-1.5
	C27.5,32.2,25.7,33.8,23.5,33.8z"/>
<path class="st5" d="M35.1,15.8c2.2,0,4,1.6,4.4,3.7c0.4-2.4-1.2-4.7-3.6-5.2c-2.4-0.4-4.7,1.2-5.2,3.6c-0.1,0.5-0.1,1,0,1.5
	C31.1,17.4,32.9,15.8,35.1,15.8z"/>
<path class="st6" d="M35.1,23.2c-2.2,0-4-1.6-4.4-3.7c-0.4,2.4,1.2,4.7,3.6,5.2s4.7-1.2,5.2-3.6c0.1-0.5,0.1-1,0-1.5
	C39.2,21.7,37.3,23.2,35.1,23.2z"/>
</svg>
