<?xml version="1.0" encoding="utf-8"?>
<!-- Generator: Adobe Illustrator 21.0.0, SVG Export Plug-In . SVG Version: 6.00 Build 0)  -->
<svg version="1.1" id="katman_1" xmlns="http://www.w3.org/2000/svg" xmlns:xlink="http://www.w3.org/1999/xlink" x="0px" y="0px"
	 viewBox="0 0 46.9 48" style="enable-background:new 0 0 46.9 48;" xml:space="preserve">
<style type="text/css">
	.st0{opacity:0.7;fill:#603813;enable-background:new    ;}
	.st1{fill:url(#_Dikdörtgen__1_);}
	.st2{opacity:0.1;fill:#FFFFFF;enable-background:new    ;}
	.st3{opacity:0.2;enable-background:new    ;}
	.st4{fill:#FFFFFF;}
</style>
<title>system-suspend_1</title>
<path class="st0" d="M23.4,46.9C10.5,46.9,0,36.4,0,23.4S10.5,0,23.4,0s23.4,10.5,23.4,23.4l0,0C46.9,36.4,36.4,46.9,23.4,46.9z"/>
<radialGradient id="_Dikdörtgen__1_" cx="22.81" cy="117.36" r="23.845" gradientTransform="matrix(1 0 0 1 -9.000015e-02 -93.96)" gradientUnits="userSpaceOnUse">
	<stop  offset="0" style="stop-color:#F9CA8D"/>
	<stop  offset="7.000000e-02" style="stop-color:#F9C781"/>
	<stop  offset="0.38" style="stop-color:#F7BB50"/>
	<stop  offset="0.53" style="stop-color:#F7B63D"/>
	<stop  offset="0.66" style="stop-color:#F7B539"/>
	<stop  offset="0.77" style="stop-color:#F7B12E"/>
	<stop  offset="0.89" style="stop-color:#F6AA1B"/>
	<stop  offset="1" style="stop-color:#F6A001"/>
	<stop  offset="1" style="stop-color:#F6A000"/>
</radialGradient>
<path id="_Dikdörtgen_" class="st1" d="M46.5,23.4L46.5,23.4c0,12.7-10.3,23.1-23.1,23.1l0,0c-12.7,0-23.1-10.3-23.1-23.1l0,0
	c0-12.7,10.3-23.1,23.1-23.1l0,0C36.2,0.4,46.5,10.7,46.5,23.4z"/>
<path class="st2" d="M46.5,23.4c0-12.7-10.3-23.1-23-23.1l0,0l0,0c-12.7,0-23.1,10.3-23.1,23l0,0l0,0c0,0.2,0,0.5,0,0.8
	C0.8,11.7,11,1.8,23.4,1.8l0,0c12.4,0,22.6,9.9,23,22.3c0-0.2,0-0.5,0-0.8h0.1V23.4z"/>
<path class="st3" d="M23.4,46.5L23.4,46.5c-12.4,0-22.6-9.9-23-22.3c0,0.2,0,0.5,0,0.8l0,0c0,12.7,10.3,23,23,23.1l0,0
	c12.7,0,23.1-10.3,23.1-23.1l0,0l0,0c0-0.2,0-0.5,0-0.8C46.1,36.6,35.9,46.5,23.4,46.5z"/>
<path class="st3" d="M36.8,31.1c1.3-2.4,2-5.2,1.8-7.9c-0.1,2.9-1.1,5.7-2.8,8.1L36.8,31.1z"/>
<path class="st3" d="M34.4,20.9c-0.7-5.6-5.6-9.8-11.3-9.6L23,8.7h0l0.1,4.1c5.7-0.2,10.6,3.9,11.3,9.6c0,0.2,0,0.4,0.1,0.7
	C34.5,22.4,34.5,21.7,34.4,20.9z"/>
<path class="st3" d="M39.7,33.3l-6.5,0.9l-2,0.3c-0.3,0-0.6-0.2-0.6-0.5l-0.3-2l-0.7-5.3c-0.1,0-0.2,0.2-0.2,0.3l0.9,6.5l0.3,2
	c0,0.3,0.3,0.5,0.6,0.5l2-0.3l6.5-0.9c0.1,0,0.2-0.2,0.2-0.3L39.7,33.3L39.7,33.3z"/>
<path class="st3" d="M25.5,37.4l-0.4-2.6H25l0.5,4.1c1.6-0.2,3.1-0.7,4.5-1.3l-0.6-1.2C28.2,36.8,26.9,37.2,25.5,37.4z"/>
<path class="st3" d="M20.8,37.2C19.5,37,18.2,36.6,17,36l-0.6,1.2c1.4,0.8,2.9,1.3,4.5,1.6l0.8-4l-0.3-0.1L20.8,37.2z"/>
<path class="st3" d="M12.6,32.8c-0.8-0.8-1.4-1.7-2-2.7L10,30.4c0.7,1.4,1.6,2.7,2.7,3.9l3-2.8c-0.2-0.3-0.5-0.5-0.7-0.8L12.6,32.8z
	"/>
<path class="st3" d="M8.6,24.3c0-0.4-0.1-0.7-0.1-1.1c0,0.2,0,0.4,0,0.6c0,0.7,0,1.3,0.1,2V26l4.1-0.6c-0.1-0.5-0.1-1-0.1-1.5l0,0
	l-4,0.6V24.3z"/>
<path class="st3" d="M13.9,17.2L11,15.6c-0.2,0.4-0.5,0.7-0.7,1.1l3.6,2c0.6-1,1.3-2,2.1-2.8l-0.7-0.8
	C14.7,15.8,14.3,16.4,13.9,17.2z"/>
<path class="st3" d="M18.8,12.5L17.6,10L17,10.3l1.8,3.7c1-0.5,2.1-0.8,3.3-1l-0.2-1.5C20.8,11.7,19.8,12,18.8,12.5z"/>
<path class="st4" d="M39.7,31c0-0.1-0.2-0.2-0.3-0.2l-3.6,0.5c4.9-6.7,3.4-16.2-3.3-21.1c-2.7-2-6.1-3-9.5-2.9l0.1,4.1
	c6.1-0.2,11.2,4.5,11.4,10.6c0.1,2.1-0.5,4.2-1.5,6c-0.2,0.2-0.3,0.5-0.5,0.7L32,25.1c0-0.1-0.2-0.2-0.3-0.2l-2,0.3
	c-0.1,0-0.2,0.2-0.2,0.3l0.9,6.5l0.3,2c0,0.3,0.3,0.5,0.6,0.5l2-0.3l6.5-0.9c0.1,0,0.2-0.2,0.2-0.3L39.7,31z"/>
<path class="st4" d="M25,33.3l0.5,4.1c1.6-0.2,3.1-0.7,4.5-1.3l-1.8-3.7C27.3,32.8,26.1,33.1,25,33.3z"/>
<path class="st4" d="M16.4,35.7c1.4,0.8,2.9,1.3,4.5,1.6l0.8-4c-1.1-0.2-2.2-0.6-3.2-1.2L16.4,35.7z"/>
<path class="st4" d="M9.9,28.9c0.7,1.4,1.6,2.7,2.7,3.9l3-2.8c-0.8-0.8-1.5-1.8-2-2.8L9.9,28.9z"/>
<path class="st4" d="M12.6,22.4c0-0.7,0.1-1.3,0.2-2l-4.1-0.7c-0.3,1.5-0.3,3.1-0.1,4.7v0.1l4.1-0.6C12.6,23.3,12.6,22.8,12.6,22.4z
	"/>
<path class="st4" d="M10.2,15.2l3.6,2c0.6-1,1.3-2,2.1-2.8l-2.9-3C12,12.5,11,13.8,10.2,15.2z"/>
<path class="st4" d="M17,8.8l1.8,3.7c1-0.5,2.1-0.8,3.3-1l-0.5-4.1C20,7.6,18.4,8.1,17,8.8z"/>
</svg>
