<?xml version="1.0" encoding="utf-8"?>
<!-- Generator: Adobe Illustrator 21.0.0, SVG Export Plug-In . SVG Version: 6.00 Build 0)  -->
<svg version="1.1" id="katman_1" xmlns="http://www.w3.org/2000/svg" xmlns:xlink="http://www.w3.org/1999/xlink" x="0px" y="0px"
	 viewBox="0 0 37 48" style="enable-background:new 0 0 37 48;" xml:space="preserve">
<style type="text/css">
	.st0{opacity:0.2;enable-background:new    ;}
	.st1{fill:url(#SVGID_1_);}
	.st2{opacity:0.1;enable-background:new    ;}
	.st3{fill:#F5F5F5;}
	.st4{opacity:0.1;fill:#FFFFFF;enable-background:new    ;}
	.st5{opacity:0.5;enable-background:new    ;}
</style>
<title>libreoffice-base_3</title>
<path class="st0" d="M0,43.8v1.7C0,46.9,1.1,48,2.5,48c0,0,0,0,0,0h32c1.4,0,2.5-1.1,2.5-2.5c0,0,0,0,0,0v-1.7
	c0,1.4-1.1,2.5-2.5,2.5c0,0,0,0,0,0h-32C1.1,46.3,0,45.2,0,43.8C0,43.8,0,43.8,0,43.8z"/>
<linearGradient id="SVGID_1_" gradientUnits="userSpaceOnUse" x1="18.525" y1="2.13" x2="18.525" y2="49.29" gradientTransform="matrix(1 0 0 -1 0 49.29)">
	<stop  offset="0" style="stop-color:#B91D50"/>
	<stop  offset="1" style="stop-color:#E72063"/>
</linearGradient>
<path class="st1" d="M37,44.6V2.5c0-1.4-1.1-2.5-2.5-2.5c0,0,0,0,0,0h-32C1.1,0,0,1.1,0,2.5c0,0,0,0,0,0v42.1c0,1.4,1.1,2.5,2.5,2.5
	c0,0,0,0,0,0h32C35.9,47.2,37.1,46,37,44.6C37.1,44.6,37.1,44.6,37,44.6z"/>
<path class="st2" d="M3.4,4.2v40.4h30.3V18.4L19.5,4.2H3.4z M24.3,4.2l9.4,9.4V4.2H24.3z"/>
<path class="st3" d="M3.4,3.4v40.4h30.3V17.5L19.5,3.4H3.4z M24.3,3.4l9.4,9.4V3.4H24.3z"/>
<path class="st4" d="M2.5,0C1.1,0,0,1.1,0,2.5c0,0,0,0,0,0v0.8C0,2,1.1,0.8,2.5,0.8c0,0,0,0,0,0h32c1.4,0,2.5,1.1,2.5,2.5
	c0,0,0,0,0,0V2.5c0-1.4-1.1-2.5-2.5-2.5c0,0,0,0,0,0H2.5z"/>
<path class="st5" d="M18.5,18.5L18.5,18.5c-3.5,0-6.6,1.2-7.8,2.9c-0.1,0.1-0.2,0.3-0.3,0.4c-0.1,0.1-0.1,0.3-0.2,0.4v0.1
	c0,0.1-0.1,0.2-0.1,0.3c-0.1,0.3-0.1,0.6,0,0.9c0,0.1,0.1,0.3,0.1,0.4c0.1,0.1,0.1,0.3,0.2,0.4c0.1,0.1,0.2,0.3,0.3,0.4
	c1.3,1.8,4.4,2.9,7.8,2.9s6.5-1.1,7.8-2.9l0,0c0.1-0.1,0.2-0.2,0.2-0.4v-0.1c0.1-0.1,0.1-0.2,0.1-0.3l0.1-0.1c0-0.1,0-0.2,0.1-0.3
	c0-0.1,0-0.1,0-0.2c0.1-0.3,0.1-0.6,0-0.9c-0.1-0.5-0.3-0.9-0.6-1.3C25.1,19.7,22.1,18.5,18.5,18.5z"/>
<path class="st5" d="M10.7,26.9c-0.4,0.4-0.6,1-0.6,1.6c0,2.4,3.8,4.3,8.4,4.3s8.4-1.9,8.4-4.3l0,0c0-0.6-0.2-1.2-0.6-1.6
	c-1.3,1.6-4.3,2.7-7.8,2.7S12,28.6,10.7,26.9z"/>
<path class="st5" d="M10.7,32c-0.4,0.4-0.6,1-0.6,1.6c0,2.4,3.8,4.3,8.4,4.3l0,0c4.6,0,8.4-1.9,8.4-4.3c0-0.6-0.2-1.2-0.6-1.6
	c-1.3,1.6-4.3,2.7-7.8,2.7S12,33.6,10.7,32z"/>
<path class="st4" d="M10.4,23.4c0.1-0.2,0.2-0.3,0.3-0.4C12,21.2,15,20,18.5,20l0,0c3.5,0,6.6,1.2,7.8,2.9c0.2,0.3,0.4,0.6,0.5,1
	v-0.1c0-0.1,0-0.1,0-0.2c0.1-0.3,0.1-0.6,0-0.9c-0.1-0.5-0.3-0.9-0.6-1.3c-1.2-1.7-4.3-2.9-7.8-2.9l0,0c-3.5,0-6.6,1.2-7.8,2.9
	c-0.1,0.1-0.2,0.3-0.3,0.4c-0.1,0.1-0.1,0.3-0.2,0.4v0.1c0,0.1-0.1,0.2-0.1,0.3c-0.1,0.3-0.1,0.6,0,0.9c0,0.1,0,0.2,0.1,0.3v-0.1
	C10.3,23.6,10.4,23.5,10.4,23.4z"/>
<path class="st0" d="M26.8,23.9V24l-0.1,0.1c0,0.1-0.1,0.2-0.1,0.3v0.1c-0.1,0.1-0.1,0.2-0.2,0.4l0,0c-1.4,1.8-4.4,2.9-7.9,2.9
	s-6.5-1.2-7.8-2.9c-0.1-0.1-0.2-0.3-0.3-0.4c-0.1-0.1-0.1-0.3-0.2-0.4c0,0,0-0.1,0-0.1l0,0c0,0.1-0.1,0.2-0.1,0.3
	c-0.1,0.3-0.1,0.6,0,0.9c0,0.1,0.1,0.3,0.1,0.4c0.1,0.1,0.1,0.3,0.2,0.4c0.1,0.1,0.2,0.3,0.3,0.4c1.3,1.8,4.4,2.9,7.8,2.9
	s6.5-1.1,7.8-2.9l0,0c0.1-0.1,0.2-0.2,0.2-0.4v-0.1c0.1-0.1,0.1-0.2,0.1-0.3l0.1-0.1c0-0.1,0-0.2,0.1-0.3c0-0.1,0-0.1,0-0.2
	C26.9,24.7,26.9,24.3,26.8,23.9L26.8,23.9z"/>
<path class="st4" d="M27,28.5c0-0.6-0.2-1.2-0.6-1.6c-1.3,1.6-4.3,2.7-7.8,2.7s-6.5-1.1-7.8-2.7c-0.4,0.4-0.6,1-0.6,1.6
	c0,0.3,0,0.5,0.1,0.8c0.1-0.3,0.3-0.6,0.5-0.9c1.3,1.6,4.4,2.7,7.8,2.7s6.5-1.1,7.8-2.7c0.2,0.3,0.4,0.5,0.5,0.9
	C26.9,29.1,26.9,28.8,27,28.5L27,28.5z"/>
<path class="st0" d="M18.5,32.8c-4.1,0-7.6-1.5-8.3-3.5c-0.1,0.2-0.1,0.5-0.1,0.8c0,2.4,3.8,4.3,8.4,4.3s8.4-1.9,8.4-4.3l0,0
	c0-0.3-0.1-0.5-0.1-0.8C26.1,31.3,22.7,32.8,18.5,32.8z"/>
<path class="st4" d="M18.5,36.2c3.4,0,6.5-1.1,7.8-2.7c0.2,0.3,0.4,0.5,0.5,0.9c0.1-0.2,0.1-0.5,0.1-0.8c0-0.6-0.2-1.2-0.6-1.6
	c-1.3,1.6-4.3,2.7-7.8,2.7S12,33.6,10.7,32c-0.4,0.4-0.6,1-0.6,1.6c0,0.3,0,0.5,0.1,0.8c0.1-0.3,0.3-0.6,0.5-0.9
	C12,35.1,15.1,36.2,18.5,36.2z"/>
<path class="st0" d="M18.5,37.9L18.5,37.9c-4.1,0-7.6-1.5-8.3-3.5c-0.1,0.2-0.1,0.5-0.1,0.8c0,2.4,3.8,4.3,8.4,4.3l0,0
	c4.6,0,8.4-1.9,8.4-4.3c0-0.3-0.1-0.5-0.1-0.8C26.1,36.4,22.7,37.9,18.5,37.9z"/>
</svg>
