<?xml version="1.0" encoding="utf-8"?>
<!-- Generator: Adobe Illustrator 21.0.0, SVG Export Plug-In . SVG Version: 6.00 Build 0)  -->
<svg version="1.1" id="katman_1" xmlns="http://www.w3.org/2000/svg" xmlns:xlink="http://www.w3.org/1999/xlink" x="0px" y="0px"
	 viewBox="0 0 64 61.6" style="enable-background:new 0 0 64 61.6;" xml:space="preserve">
<style type="text/css">
	.st0{opacity:0.2;enable-background:new    ;}
	.st1{fill:#793D1A;}
	.st2{fill:url(#SVGID_1_);}
	.st3{fill:url(#SVGID_2_);}
	.st4{fill:url(#SVGID_3_);}
	.st5{opacity:0.1;enable-background:new    ;}
	.st6{opacity:0.1;fill:#FFFFFF;enable-background:new    ;}
	.st7{fill:url(#SVGID_4_);}
	.st8{fill:url(#SVGID_5_);}
</style>
<title>user-bookmarks_2</title>
<polygon class="st0" points="58.6,55.3 64,46.9 62.7,46.9 58.6,53.3 "/>
<path class="st1" d="M63.5,5.9c0-0.8-0.7-1.5-1.5-1.5H38.6V1.5C38.6,0.7,37.9,0,37,0c0,0,0,0,0,0H19.9c-0.9,0-1.5,0.7-1.5,1.5v2.8
	h-4.2c-0.9,0-1.6,0.7-1.6,1.6l0,0v5.3l-1.6-0.7C9.5,9.7,7.8,9.2,6.1,8.9c-1.1,0-3.5,2-4.1,2.9c-0.8,1-1.5,2.1-2,3.3
	c-0.4,1.2,1.5,4.7,2.3,5.9l1.1,1.7l-2.9,4.8c-0.1,0.2-0.2,0.5-0.2,0.8v11.1c0,0.4,0.2,0.8,0.4,1.1l5.8,6L9.6,53
	c0.3,0.5,0.8,0.9,1.4,0.9l47.2-0.1h0.6l4.5-6.8l0.2-0.5V5.9z"/>
<linearGradient id="SVGID_1_" gradientUnits="userSpaceOnUse" x1="38.065" y1="16.72" x2="38.065" y2="65.82" gradientTransform="matrix(1 0 0 -1 0 63.29)">
	<stop  offset="0" style="stop-color:#793D1A;stop-opacity:0.8"/>
	<stop  offset="1" style="stop-color:#C96E28"/>
</linearGradient>
<path class="st2" d="M38.1,4.6v-3c0-0.6-0.4-1.1-1-1.1c0,0,0,0-0.1,0H19.9c-0.6,0-1.1,0.5-1.1,1.1v3c0,0.1-0.1,0.3-0.3,0.3l0,0h-4.4
	c-0.6,0-1.1,0.5-1.1,1.1v0v40.6H63V5.9c0-0.6-0.4-1-1-1.1H38.3C38.2,4.8,38.1,4.7,38.1,4.6z"/>
<linearGradient id="SVGID_2_" gradientUnits="userSpaceOnUse" x1="65.6992" y1="8.8391" x2="58.2592" y2="15.6691" gradientTransform="matrix(1 0 0 -1 0 63.29)">
	<stop  offset="0" style="stop-color:#C96E28"/>
	<stop  offset="1" style="stop-color:#793D1A;stop-opacity:0.8"/>
</linearGradient>
<polygon class="st3" points="58.5,53.4 63,46.5 56,46.5 "/>
<linearGradient id="SVGID_3_" gradientUnits="userSpaceOnUse" x1="29.5635" y1="10.33" x2="29.5635" y2="54.01" gradientTransform="matrix(1 0 0 -1 0 63.29)">
	<stop  offset="0" style="stop-color:#A3A4A4"/>
	<stop  offset="0.12" style="stop-color:#BABABA"/>
	<stop  offset="0.27" style="stop-color:#CECECE"/>
	<stop  offset="0.44" style="stop-color:#DCDBDB"/>
	<stop  offset="0.64" style="stop-color:#E4E4E4"/>
	<stop  offset="0.99" style="stop-color:#E7E6E6"/>
</linearGradient>
<path class="st4" d="M57.5,8.5h-38c-1.5,1.3-3.4,4.2-3.5,4.3c-0.2,0.1-0.4,0.1-0.6,0.2l-3.2-1.5l-1.2-0.6c-1.5-0.7-3.1-1.2-4.7-1.5
	c-0.9-0.1-3.1,1.8-3.8,2.7c-0.8,1-1.4,2-1.8,3.1c-0.3,0.8,1.2,3.9,2.2,5.4L4,22.6l-3,5.1c-0.1,0.2-0.2,0.4-0.1,0.5v11.1
	c0,0.3,0.1,0.5,0.3,0.7l5.8,6c0,0,0.1,0.1,0.1,0.1l3.1,6.5c0.2,0.4,0.6,0.6,1,0.6l47.5-0.1V9.6c0-0.6-0.5-1.1-1.1-1.1
	C57.5,8.5,57.5,8.5,57.5,8.5z"/>
<path class="st5" d="M59.1,6.8h-38c-0.6,0.5-1.1,1.1-1.6,1.7h37.9c0.6,0,1.1,0.5,1.1,1.1v0v43.8l1.7-2.5v-43
	C60.2,7.3,59.7,6.9,59.1,6.8z"/>
<path class="st6" d="M19.9,2.4H37c0.6,0,1.1,0.5,1.1,1c0,0,0,0,0,0v-2c0-0.6-0.5-1-1.1-1H19.9c-0.6,0-1.1,0.5-1.1,1.1v2
	C18.8,3,19.3,2.5,19.9,2.4C19.9,2.4,19.9,2.4,19.9,2.4z"/>
<path class="st6" d="M14.2,6.8h4.4c0.1,0,0.3-0.1,0.3-0.3v-2c0,0.1-0.1,0.3-0.3,0.3l0,0h-4.4c-0.6,0-1.1,0.5-1.1,1.1v0v2
	C13.1,7.3,13.6,6.8,14.2,6.8L14.2,6.8z"/>
<path class="st6" d="M62,4.8H38.3c-0.1,0-0.3-0.1-0.3-0.3v2c0,0.1,0.1,0.3,0.3,0.3H62c0.5,0,1,0.5,1,1v-2C63,5.3,62.5,4.9,62,4.8z"
	/>
<path class="st6" d="M57.5,8.5h-38c-1.5,1.3-3.4,4.2-3.5,4.3c-0.2,0.1-0.4,0.1-0.6,0.2l-3.2-1.5l-1.2-0.6c-1.5-0.7-3.1-1.2-4.7-1.5
	c-0.9-0.1-3.1,1.8-3.8,2.7c-0.8,1-1.4,2-1.8,3.1c0,0.5,0,1,0.2,1.4c0.4-0.9,1-1.8,1.6-2.6c0.7-0.9,3-2.8,3.8-2.7
	c1.6,0.3,3.2,0.8,4.7,1.5l1.2,0.6l3.2,1.5c0.2-0.1,0.4-0.1,0.6-0.2c0.2,0,2-3,3.5-4.3h38c0.6,0,1.1,0.5,1.1,1.1v0v-2
	C58.5,9,58,8.5,57.5,8.5z"/>
<path class="st0" d="M10.1,52.8L7,46.3c0-0.1-0.1-0.1-0.1-0.1l-5.8-6c-0.2-0.2-0.3-0.5-0.3-0.7v2c0,0.3,0.1,0.5,0.3,0.7l5.8,6
	c0,0,0.1,0.1,0.1,0.1l3.1,6.5c0.2,0.4,0.6,0.6,1,0.6l47.5-0.1v-2l-47.5,0.1C10.7,53.5,10.3,53.2,10.1,52.8z"/>
<linearGradient id="SVGID_4_" gradientUnits="userSpaceOnUse" x1="41.9752" y1="8.66" x2="41.9752" y2="44.75" gradientTransform="matrix(1 0 0 -1 0 63.29)">
	<stop  offset="0" style="stop-color:#793D1A"/>
	<stop  offset="1" style="stop-color:#C96E28;stop-opacity:0.9"/>
</linearGradient>
<path class="st7" d="M53.9,59.8c-0.4,0-0.8-0.1-1.2-0.3l-9.8-5.2c-0.6-0.3-1.3-0.3-1.9,0l-9.8,5.2c-0.4,0.2-0.8,0.3-1.2,0.3
	c-0.8,0-1.5-0.3-2-0.9c-0.5-0.6-0.7-1.4-0.6-2.1l1.9-10.9c0.1-0.7-0.1-1.4-0.6-1.8l-7.9-7.7c-1-1-1-2.7,0-3.7
	c0.4-0.4,0.9-0.7,1.5-0.8l11-1.6c0.7-0.1,1.3-0.5,1.6-1.1l4.9-9.9c0.6-1.3,2.2-1.8,3.5-1.2c0.5,0.3,0.9,0.7,1.2,1.2l4.9,9.9
	c0.3,0.6,0.9,1,1.6,1.1l11,1.6c1.4,0.2,2.4,1.5,2.2,3c-0.1,0.6-0.3,1.1-0.8,1.5l-8,7.8c-0.5,0.5-0.7,1.2-0.6,1.8l1.9,10.9
	c0.1,0.8-0.1,1.5-0.6,2.1C55.4,59.4,54.7,59.8,53.9,59.8z"/>
<linearGradient id="SVGID_5_" gradientUnits="userSpaceOnUse" x1="56.8718" y1="3.5234" x2="20.3518" y2="49.0134" gradientTransform="matrix(1 0 0 -1 0 63.29)">
	<stop  offset="0" style="stop-color:#896307"/>
	<stop  offset="0.12" style="stop-color:#A77D07"/>
	<stop  offset="0.27" style="stop-color:#C69807"/>
	<stop  offset="0.43" style="stop-color:#DFAC07"/>
	<stop  offset="0.6" style="stop-color:#F0BB07"/>
	<stop  offset="0.78" style="stop-color:#FBC407"/>
	<stop  offset="1" style="stop-color:#FEC707"/>
</linearGradient>
<path class="st8" d="M44,19.3l4.9,9.9c0.3,0.7,1,1.2,1.8,1.3l11,1.6c1.3,0.2,2.2,1.4,2,2.7c-0.1,0.5-0.3,0.9-0.6,1.3l-8,7.8
	c-0.5,0.5-0.8,1.3-0.7,2.1l1.9,10.9c0.2,1.3-0.6,2.5-1.9,2.7c-0.5,0.1-1,0-1.5-0.2L43,54.1c-0.7-0.4-1.5-0.4-2.2,0L31,59.2
	c-1.1,0.6-2.6,0.2-3.2-1c-0.2-0.5-0.3-1-0.2-1.5l1.9-10.9c0.1-0.8-0.1-1.5-0.7-2.1L20.9,36c-0.9-0.9-1-2.4-0.1-3.3
	c0.4-0.4,0.8-0.6,1.4-0.7l11-1.6c0.8-0.1,1.4-0.6,1.8-1.3l4.9-9.9c0.6-1.2,2-1.6,3.1-1.1C43.5,18.4,43.9,18.7,44,19.3L44,19.3z"/>
<path class="st6" d="M54.3,47.9L56.1,58c0.2-0.4,0.2-0.8,0.1-1.3l-1.7-10.1C54.3,47,54.3,47.5,54.3,47.9z"/>
<path class="st6" d="M22.2,34.1l11-1.6c0.8-0.1,1.4-0.6,1.8-1.3l4.9-9.9c0.6-1.2,2-1.6,3.1-1.1c0.5,0.2,0.8,0.6,1.1,1.1l4.9,9.9
	c0.3,0.7,1,1.2,1.8,1.3l11,1.6c0.8,0.1,1.4,0.6,1.8,1.3c0.6-1.2,0.1-2.6-1.1-3.1c-0.2-0.1-0.5-0.2-0.7-0.2l-11-1.6
	c-0.8-0.1-1.4-0.6-1.8-1.3l-5-9.9c-0.6-1.2-2-1.6-3.1-1.1c-0.5,0.2-0.8,0.6-1.1,1.1l-4.9,9.9c-0.3,0.7-1,1.2-1.8,1.3l-11,1.6
	c-1.3,0.2-2.2,1.4-2,2.7c0,0.2,0.1,0.5,0.2,0.7C20.7,34.7,21.4,34.2,22.2,34.1z"/>
<path class="st6" d="M29.4,46.7l-1.7,10.1c-0.1,0.4,0,0.8,0.1,1.2l1.7-10.1C29.6,47.5,29.5,47,29.4,46.7z"/>
<path class="st5" d="M28.9,43.8L20.9,36c-0.2-0.2-0.3-0.4-0.5-0.6c-0.5,0.9-0.3,2,0.5,2.7l7.9,7.7c0.2,0.2,0.4,0.5,0.5,0.8l0.1-0.8
	C29.6,45.1,29.4,44.3,28.9,43.8z"/>
<path class="st5" d="M63,36l-8,7.8c-0.5,0.5-0.8,1.3-0.7,2.1l0.1,0.8c0.1-0.3,0.3-0.6,0.5-0.8l8-7.7c0.7-0.7,0.9-1.8,0.5-2.7
	C63.3,35.6,63.2,35.8,63,36z"/>
<path class="st5" d="M52.8,59.2L43,54.1c-0.7-0.4-1.5-0.4-2.2,0L31,59.2c-1.2,0.6-2.6,0.1-3.1-1c0-0.1-0.1-0.1-0.1-0.2l-0.1,0.8
	c-0.2,1.3,0.6,2.5,1.9,2.7c0.5,0.1,1,0,1.5-0.2l9.8-5.2c0.7-0.4,1.5-0.4,2.2,0l9.8,5.2c1.1,0.6,2.6,0.2,3.2-1c0.2-0.5,0.3-1,0.2-1.5
	L56.1,58c-0.5,1.2-1.8,1.8-3,1.3C53,59.3,52.9,59.3,52.8,59.2z"/>
</svg>
