<?xml version="1.0" encoding="utf-8"?>
<!-- Generator: Adobe Illustrator 21.0.0, SVG Export Plug-In . SVG Version: 6.00 Build 0)  -->
<svg version="1.1" id="katman_1" xmlns="http://www.w3.org/2000/svg" xmlns:xlink="http://www.w3.org/1999/xlink" x="0px" y="0px"
	 viewBox="0 0 16 12.5" style="enable-background:new 0 0 16 12.5;" xml:space="preserve">
<style type="text/css">
	.st0{fill:#4D4D4D;}
	.st1{fill:url(#SVGID_1_);}
	.st2{fill:#FFFFFF;}
	.st3{opacity:0.7;fill:#FFFFFF;enable-background:new    ;}
	.st4{opacity:0.2;enable-background:new    ;}
	.st5{fill:url(#SVGID_2_);}
	.st6{opacity:0.3;fill:url(#SVGID_3_);enable-background:new    ;}
	.st7{opacity:0.2;fill:#FFFFFF;enable-background:new    ;}
	.st8{fill:url(#SVGID_4_);}
	.st9{fill:url(#SVGID_5_);}
	.st10{fill:url(#SVGID_6_);}
	.st11{fill:url(#SVGID_7_);}
	.st12{fill:url(#SVGID_8_);}
	.st13{fill:url(#SVGID_9_);}
	.st14{fill:url(#SVGID_10_);}
	.st15{fill:url(#SVGID_11_);}
	.st16{fill:url(#SVGID_12_);}
	.st17{fill:url(#SVGID_13_);}
	.st18{fill:url(#SVGID_14_);}
	.st19{fill:url(#SVGID_15_);}
	.st20{fill:url(#SVGID_16_);}
	.st21{fill:url(#SVGID_17_);}
	.st22{fill:url(#SVGID_18_);}
	.st23{fill:url(#SVGID_19_);}
	.st24{fill:url(#SVGID_20_);}
	.st25{fill:url(#SVGID_21_);}
	.st26{fill:url(#SVGID_22_);}
	.st27{fill:url(#SVGID_23_);}
	.st28{fill:url(#SVGID_24_);}
	.st29{fill:url(#SVGID_25_);}
	.st30{fill:url(#SVGID_26_);}
	.st31{fill:url(#SVGID_27_);}
	.st32{fill:url(#SVGID_28_);}
	.st33{fill:url(#SVGID_29_);}
	.st34{fill:url(#SVGID_30_);}
	.st35{fill:url(#SVGID_31_);}
	.st36{fill:url(#SVGID_32_);}
	.st37{fill:url(#SVGID_33_);}
	.st38{fill:url(#SVGID_34_);}
	.st39{fill:url(#SVGID_35_);}
	.st40{fill:url(#SVGID_36_);}
	.st41{fill:url(#SVGID_37_);}
	.st42{fill:url(#SVGID_38_);}
	.st43{fill:url(#SVGID_39_);}
	.st44{fill:url(#SVGID_40_);}
	.st45{fill:url(#SVGID_41_);}
	.st46{fill:url(#SVGID_42_);}
	.st47{fill:url(#SVGID_43_);}
	.st48{fill:url(#SVGID_44_);}
	.st49{fill:url(#SVGID_45_);}
	.st50{fill:url(#SVGID_46_);}
	.st51{fill:url(#SVGID_47_);}
	.st52{fill:url(#SVGID_48_);}
	.st53{fill:url(#SVGID_49_);}
	.st54{fill:url(#SVGID_50_);}
	.st55{fill:url(#SVGID_51_);}
	.st56{fill:url(#SVGID_52_);}
	.st57{fill:url(#SVGID_53_);}
	.st58{fill:url(#SVGID_54_);}
	.st59{fill:url(#SVGID_55_);}
	.st60{fill:url(#SVGID_56_);}
	.st61{fill:url(#SVGID_57_);}
	.st62{fill:url(#SVGID_58_);}
	.st63{fill:url(#SVGID_59_);}
	.st64{fill:url(#SVGID_60_);}
	.st65{fill:url(#SVGID_61_);}
	.st66{fill:url(#SVGID_62_);}
	.st67{fill:url(#SVGID_63_);}
	.st68{fill:url(#SVGID_64_);}
	.st69{fill:url(#SVGID_65_);}
	.st70{fill:url(#SVGID_66_);}
	.st71{fill:url(#SVGID_67_);}
	.st72{fill:url(#SVGID_68_);}
	.st73{fill:url(#SVGID_69_);}
	.st74{fill:url(#SVGID_70_);}
	.st75{fill:url(#SVGID_71_);}
	.st76{fill:url(#SVGID_72_);}
	.st77{fill:url(#SVGID_73_);}
	.st78{fill:url(#SVGID_74_);}
	.st79{fill:url(#SVGID_75_);}
	.st80{fill:url(#SVGID_76_);}
	.st81{fill:url(#SVGID_77_);}
	.st82{fill:url(#SVGID_78_);}
	.st83{fill:url(#SVGID_79_);}
	.st84{fill:url(#SVGID_80_);}
	.st85{fill:url(#SVGID_81_);}
	.st86{fill:url(#SVGID_82_);}
	.st87{fill:url(#SVGID_83_);}
	.st88{fill:url(#SVGID_84_);}
	.st89{fill:url(#SVGID_85_);}
	.st90{fill:url(#SVGID_86_);}
	.st91{fill:url(#SVGID_87_);}
	.st92{fill:url(#SVGID_88_);}
	.st93{fill:url(#SVGID_89_);}
	.st94{fill:url(#SVGID_90_);}
	.st95{fill:url(#SVGID_91_);}
	.st96{fill:url(#SVGID_92_);}
	.st97{fill:url(#SVGID_93_);}
	.st98{fill:url(#SVGID_94_);}
	.st99{fill:url(#SVGID_95_);}
	.st100{fill:url(#SVGID_96_);}
	.st101{fill:url(#SVGID_97_);}
	.st102{fill:url(#SVGID_98_);}
	.st103{fill:url(#SVGID_99_);}
	.st104{fill:url(#SVGID_100_);}
	.st105{fill:url(#SVGID_101_);}
	.st106{fill:url(#SVGID_102_);}
	.st107{fill:url(#SVGID_103_);}
	.st108{fill:url(#SVGID_104_);}
	.st109{fill:url(#SVGID_105_);}
	.st110{fill:url(#SVGID_106_);}
	.st111{fill:url(#SVGID_107_);}
	.st112{fill:url(#SVGID_108_);}
	.st113{fill:url(#SVGID_109_);}
	.st114{fill:url(#SVGID_110_);}
	.st115{fill:url(#SVGID_111_);}
	.st116{fill:url(#SVGID_112_);}
	.st117{fill:url(#SVGID_113_);}
	.st118{fill:url(#SVGID_114_);}
	.st119{fill:url(#SVGID_115_);}
	.st120{fill:url(#SVGID_116_);}
	.st121{fill:url(#SVGID_117_);}
	.st122{fill:url(#SVGID_118_);}
	.st123{fill:url(#SVGID_119_);}
	.st124{fill:url(#SVGID_120_);}
	.st125{fill:url(#SVGID_121_);}
	.st126{fill:url(#SVGID_122_);}
	.st127{fill:url(#SVGID_123_);}
	.st128{fill:url(#SVGID_124_);}
	.st129{fill:url(#SVGID_125_);}
	.st130{fill:url(#SVGID_126_);}
	.st131{fill:url(#SVGID_127_);}
	.st132{fill:url(#SVGID_128_);}
	.st133{fill:url(#SVGID_129_);}
	.st134{fill:url(#SVGID_130_);}
	.st135{fill:url(#SVGID_131_);}
	.st136{fill:url(#SVGID_132_);}
	.st137{fill:url(#SVGID_133_);}
	.st138{fill:url(#SVGID_134_);}
	.st139{fill:url(#SVGID_135_);}
	.st140{fill:url(#SVGID_136_);}
	.st141{fill:url(#SVGID_137_);}
	.st142{fill:url(#SVGID_138_);}
	.st143{fill:url(#SVGID_139_);}
	.st144{fill:url(#SVGID_140_);}
	.st145{fill:url(#SVGID_141_);}
	.st146{fill:url(#SVGID_142_);}
	.st147{fill:url(#SVGID_143_);}
	.st148{fill:url(#SVGID_144_);}
	.st149{fill:url(#SVGID_145_);}
</style>
<title>input-keyboard_5</title>
<path class="st0" d="M0.6,4.2h14.8c0.3,0,0.6,0.3,0.6,0.6v6.7c0,0.3-0.3,0.6-0.6,0.6H0.6c-0.3,0-0.6-0.3-0.6-0.6V4.8
	C0,4.4,0.3,4.2,0.6,4.2z"/>
<path class="st0" d="M8,4.7C7.3,4,7.3,2.9,8,2.2c0,0,0,0,0,0l0.4-0.4c0.7-0.6,0.8-0.7,0.4-1.5L8.7,0.3L9.2,0l0.1,0.1
	c0.7,1.1,0.2,1.5-0.5,2.2L8.4,2.6c-0.4,0.5-0.4,1.2,0,1.7l0.1,0.1L8,4.7L8,4.7z"/>
<linearGradient id="SVGID_1_" gradientUnits="userSpaceOnUse" x1="8.5358" y1="9.15" x2="8.5358" y2="13.56" gradientTransform="matrix(1 0 0 -1 0 13.73)">
	<stop  offset="0" style="stop-color:#CCCCCC"/>
	<stop  offset="1" style="stop-color:#F7F7F7"/>
</linearGradient>
<path class="st1" d="M8.1,4.6C7.4,4,7.4,3,8.1,2.3c0,0,0,0,0,0L8.5,2c0.7-0.6,0.9-0.8,0.4-1.6l0.3-0.2c0.6,1,0.3,1.4-0.4,2L8.3,2.5
	C7.8,3,7.8,3.9,8.3,4.4L8.1,4.6z"/>
<path class="st2" d="M9.1,0.4c0.2,0.2,0.3,0.5,0.3,0.8c0-0.4-0.1-0.7-0.3-1L8.9,0.3L9,0.5L9.1,0.4z"/>
<path class="st3" d="M8.1,2.6l0.4-0.4c0.5-0.5,0.7-0.7,0.6-1C9.1,1.5,8.8,1.7,8.5,2L8.1,2.4C7.8,2.7,7.6,3.1,7.6,3.5
	C7.6,3.2,7.8,2.8,8.1,2.6z"/>
<path class="st4" d="M8.2,4.5l0.1-0.1C8.1,4.1,8,3.8,7.9,3.5C7.9,3.9,8,4.2,8.2,4.5z"/>
<linearGradient id="SVGID_2_" gradientUnits="userSpaceOnUse" x1="7.995" y1="1.76" x2="7.995" y2="9.46" gradientTransform="matrix(1 0 0 -1 0 13.73)">
	<stop  offset="0" style="stop-color:#CCCCCC"/>
	<stop  offset="1" style="stop-color:#F7F7F7"/>
</linearGradient>
<path class="st5" d="M0.6,4.3h14.8c0.3,0,0.5,0.2,0.5,0.5v6.7c0,0.3-0.2,0.5-0.5,0.5H0.6c-0.3,0-0.5-0.2-0.5-0.5V4.8
	C0.1,4.5,0.3,4.3,0.6,4.3z"/>
<linearGradient id="SVGID_3_" gradientUnits="userSpaceOnUse" x1="7.995" y1="1.76" x2="7.995" y2="9.46" gradientTransform="matrix(1 0 0 -1 0 13.73)">
	<stop  offset="0" style="stop-color:#666666"/>
	<stop  offset="6.000000e-02" style="stop-color:#E6E6E6"/>
	<stop  offset="0.17" style="stop-color:#B3B3B3"/>
	<stop  offset="1" style="stop-color:#CCCCCC"/>
</linearGradient>
<path class="st6" d="M0.6,4.3h14.8c0.3,0,0.5,0.2,0.5,0.5v6.7c0,0.3-0.2,0.5-0.5,0.5H0.6c-0.3,0-0.5-0.2-0.5-0.5V4.8
	C0.1,4.5,0.3,4.3,0.6,4.3z"/>
<path class="st7" d="M15.4,4.3H0.6c-0.3,0-0.5,0.2-0.5,0.5c0,0,0,0,0,0v0.5c0-0.3,0.2-0.5,0.5-0.5l0,0h14.8c0.3,0,0.5,0.2,0.5,0.5
	V4.8C15.9,4.5,15.7,4.3,15.4,4.3z"/>
<path class="st4" d="M15.4,12H0.6c-0.3,0-0.5-0.2-0.5-0.5V12c0,0.3,0.2,0.5,0.5,0.5h14.8c0.3,0,0.5-0.2,0.5-0.5v-0.5
	C15.9,11.8,15.7,12,15.4,12C15.4,12,15.4,12,15.4,12z"/>
<linearGradient id="SVGID_4_" gradientUnits="userSpaceOnUse" x1="5.93" y1="8.23" x2="5.93" y2="8.83" gradientTransform="matrix(1 0 0 -1 0 13.73)">
	<stop  offset="0" style="stop-color:#1A1A1A"/>
	<stop  offset="1" style="stop-color:#595959"/>
</linearGradient>
<path class="st8" d="M5.6,5.5C5.5,5.5,5.5,5.5,5.6,5.5C5.5,5.4,5.5,5.4,5.6,5.5L5.5,5c0,0,0-0.1,0.1-0.1c0,0,0,0,0,0h0.7
	c0,0,0.1,0,0.1,0.1c0,0,0,0,0,0v0.4c0,0,0,0.1-0.1,0.1c0,0,0,0,0,0H5.6z"/>
<linearGradient id="SVGID_5_" gradientUnits="userSpaceOnUse" x1="4.98" y1="8.23" x2="4.98" y2="8.83" gradientTransform="matrix(1 0 0 -1 0 13.73)">
	<stop  offset="0" style="stop-color:#1A1A1A"/>
	<stop  offset="1" style="stop-color:#595959"/>
</linearGradient>
<path class="st9" d="M4.6,5.5C4.6,5.5,4.5,5.5,4.6,5.5C4.5,5.4,4.5,5.4,4.6,5.5L4.5,5c0,0,0-0.1,0.1-0.1c0,0,0,0,0,0h0.7
	c0,0,0.1,0,0.1,0.1c0,0,0,0,0,0v0.4c0,0,0,0.1-0.1,0.1c0,0,0,0,0,0H4.6z"/>
<linearGradient id="SVGID_6_" gradientUnits="userSpaceOnUse" x1="4.04" y1="8.23" x2="4.04" y2="8.83" gradientTransform="matrix(1 0 0 -1 0 13.73)">
	<stop  offset="0" style="stop-color:#1A1A1A"/>
	<stop  offset="1" style="stop-color:#595959"/>
</linearGradient>
<path class="st10" d="M3.7,5.5C3.6,5.5,3.6,5.5,3.7,5.5C3.6,5.4,3.6,5.4,3.7,5.5L3.6,5c0,0,0-0.1,0.1-0.1c0,0,0,0,0,0h0.7
	c0,0,0.1,0,0.1,0.1c0,0,0,0,0,0v0.4c0,0,0,0.1-0.1,0.1c0,0,0,0,0,0H3.7z"/>
<linearGradient id="SVGID_7_" gradientUnits="userSpaceOnUse" x1="3.09" y1="8.23" x2="3.09" y2="8.83" gradientTransform="matrix(1 0 0 -1 0 13.73)">
	<stop  offset="0" style="stop-color:#1A1A1A"/>
	<stop  offset="1" style="stop-color:#595959"/>
</linearGradient>
<path class="st11" d="M2.7,5.5C2.7,5.5,2.6,5.5,2.7,5.5C2.6,5.4,2.6,5.4,2.7,5.5L2.6,5c0,0,0-0.1,0.1-0.1c0,0,0,0,0,0h0.7
	c0,0,0.1,0,0.1,0.1c0,0,0,0,0,0v0.4c0,0,0,0.1-0.1,0.1c0,0,0,0,0,0H2.7z"/>
<linearGradient id="SVGID_8_" gradientUnits="userSpaceOnUse" x1="10.23" y1="8.23" x2="10.23" y2="8.83" gradientTransform="matrix(1 0 0 -1 0 13.73)">
	<stop  offset="0" style="stop-color:#1A1A1A"/>
	<stop  offset="1" style="stop-color:#595959"/>
</linearGradient>
<path class="st12" d="M9.9,5.5C9.8,5.5,9.8,5.5,9.9,5.5C9.8,5.4,9.8,5.4,9.9,5.5L9.8,5c0,0,0-0.1,0.1-0.1c0,0,0,0,0,0h0.7
	c0,0,0.1,0,0.1,0.1c0,0,0,0,0,0v0.4c0,0,0,0.1-0.1,0.1c0,0,0,0,0,0H9.9z"/>
<linearGradient id="SVGID_9_" gradientUnits="userSpaceOnUse" x1="9.29" y1="8.23" x2="9.29" y2="8.83" gradientTransform="matrix(1 0 0 -1 0 13.73)">
	<stop  offset="0" style="stop-color:#1A1A1A"/>
	<stop  offset="1" style="stop-color:#595959"/>
</linearGradient>
<path class="st13" d="M8.9,5.5C8.9,5.5,8.8,5.5,8.9,5.5C8.8,5.4,8.8,5.4,8.9,5.5L8.8,5c0,0,0-0.1,0.1-0.1c0,0,0,0,0,0h0.7
	c0,0,0.1,0,0.1,0.1c0,0,0,0,0,0v0.4c0,0,0,0.1-0.1,0.1c0,0,0,0,0,0H8.9z"/>
<linearGradient id="SVGID_10_" gradientUnits="userSpaceOnUse" x1="8.3603" y1="8.23" x2="8.3603" y2="8.83" gradientTransform="matrix(1 0 0 -1 0 13.73)">
	<stop  offset="0" style="stop-color:#1A1A1A"/>
	<stop  offset="1" style="stop-color:#595959"/>
</linearGradient>
<path class="st14" d="M8,5.5C8,5.5,7.9,5.5,8,5.5C7.9,5.4,7.9,5.4,8,5.5L7.9,5c0,0,0-0.1,0.1-0.1c0,0,0,0,0,0h0.7
	c0,0,0.1,0.1,0.1,0.1v0.4c0,0,0,0.1-0.1,0.1c0,0,0,0,0,0H8z"/>
<linearGradient id="SVGID_11_" gradientUnits="userSpaceOnUse" x1="7.37" y1="8.23" x2="7.37" y2="8.83" gradientTransform="matrix(1 0 0 -1 0 13.73)">
	<stop  offset="0" style="stop-color:#1A1A1A"/>
	<stop  offset="1" style="stop-color:#595959"/>
</linearGradient>
<path class="st15" d="M7,5.5C7,5.5,6.9,5.5,7,5.5C6.9,5.4,6.9,5.4,7,5.5L6.9,5c0,0,0-0.1,0.1-0.1c0,0,0,0,0,0h0.7c0,0,0.1,0,0.1,0.1
	c0,0,0,0,0,0v0.4c0,0,0,0.1-0.1,0.1c0,0,0,0,0,0H7z"/>
<linearGradient id="SVGID_12_" gradientUnits="userSpaceOnUse" x1="14.545" y1="8.23" x2="14.545" y2="8.83" gradientTransform="matrix(1 0 0 -1 0 13.73)">
	<stop  offset="0" style="stop-color:#1A1A1A"/>
	<stop  offset="1" style="stop-color:#595959"/>
</linearGradient>
<path class="st16" d="M14.2,5.5C14.1,5.5,14.1,5.5,14.2,5.5C14.1,5.4,14.1,5.4,14.2,5.5L14.1,5c0,0,0-0.1,0.1-0.1c0,0,0,0,0,0h0.7
	c0,0,0.1,0,0.1,0.1c0,0,0,0,0,0v0.4c0,0,0,0.1-0.1,0.1c0,0,0,0,0,0H14.2z"/>
<linearGradient id="SVGID_13_" gradientUnits="userSpaceOnUse" x1="13.5773" y1="8.23" x2="13.5773" y2="8.83" gradientTransform="matrix(1 0 0 -1 0 13.73)">
	<stop  offset="0" style="stop-color:#1A1A1A"/>
	<stop  offset="1" style="stop-color:#595959"/>
</linearGradient>
<path class="st17" d="M13.2,5.5C13.2,5.5,13.1,5.5,13.2,5.5C13.1,5.4,13.1,5.4,13.2,5.5L13.1,5c0,0,0-0.1,0.1-0.1c0,0,0,0,0,0H14
	c0,0,0,0.1,0,0.1v0.4c0,0,0,0.1-0.1,0.1c0,0,0,0,0,0H13.2z"/>
<linearGradient id="SVGID_14_" gradientUnits="userSpaceOnUse" x1="12.635" y1="8.23" x2="12.635" y2="8.83" gradientTransform="matrix(1 0 0 -1 0 13.73)">
	<stop  offset="0" style="stop-color:#1A1A1A"/>
	<stop  offset="1" style="stop-color:#595959"/>
</linearGradient>
<path class="st18" d="M12.3,5.5C12.2,5.5,12.2,5.5,12.3,5.5C12.2,5.4,12.2,5.4,12.3,5.5L12.2,5c0,0,0-0.1,0.1-0.1c0,0,0,0,0,0H13
	c0,0,0.1,0,0.1,0.1c0,0,0,0,0,0v0.4c0,0,0,0.1-0.1,0.1c0,0,0,0,0,0H12.3z"/>
<linearGradient id="SVGID_15_" gradientUnits="userSpaceOnUse" x1="11.695" y1="8.23" x2="11.695" y2="8.83" gradientTransform="matrix(1 0 0 -1 0 13.73)">
	<stop  offset="0" style="stop-color:#1A1A1A"/>
	<stop  offset="1" style="stop-color:#595959"/>
</linearGradient>
<path class="st19" d="M11.3,4.9H12c0.1,0,0.1,0,0.1,0.1v0.4c0,0.1,0,0.1-0.1,0.1h-0.7c-0.1,0-0.1,0-0.1-0.1V5
	C11.2,4.9,11.3,4.9,11.3,4.9z"/>
<linearGradient id="SVGID_16_" gradientUnits="userSpaceOnUse" x1="1.4492" y1="8.23" x2="1.4492" y2="8.83" gradientTransform="matrix(1 0 0 -1 0 13.73)">
	<stop  offset="0" style="stop-color:#1A1A1A"/>
	<stop  offset="1" style="stop-color:#595959"/>
</linearGradient>
<path class="st20" d="M1.1,5.5C1,5.5,1,5.5,1.1,5.5C1,5.4,1,5.4,1,5.4V5c0,0,0-0.1,0.1-0.1c0,0,0,0,0,0h0.7c0,0,0.1,0,0.1,0.1
	c0,0,0,0,0,0v0.4c0,0,0,0.1-0.1,0.1c0,0,0,0,0,0H1.1z"/>
<linearGradient id="SVGID_17_" gradientUnits="userSpaceOnUse" x1="5.9278" y1="8.29" x2="5.9278" y2="8.77" gradientTransform="matrix(1 0 0 -1 0 13.73)">
	<stop  offset="0" style="stop-color:#CCCCCC"/>
	<stop  offset="1" style="stop-color:#F7F7F7"/>
</linearGradient>
<path class="st21" d="M5.6,5h0.7l0,0v0.4l0,0H5.6l0,0V5C5.6,5,5.6,5,5.6,5z"/>
<linearGradient id="SVGID_18_" gradientUnits="userSpaceOnUse" x1="4.9778" y1="8.29" x2="4.9778" y2="8.77" gradientTransform="matrix(1 0 0 -1 0 13.73)">
	<stop  offset="0" style="stop-color:#CCCCCC"/>
	<stop  offset="1" style="stop-color:#F7F7F7"/>
</linearGradient>
<path class="st22" d="M4.6,5h0.7l0,0v0.4l0,0H4.6l0,0V5C4.6,5,4.6,5,4.6,5z"/>
<linearGradient id="SVGID_19_" gradientUnits="userSpaceOnUse" x1="4.0356" y1="8.29" x2="4.0356" y2="8.77" gradientTransform="matrix(1 0 0 -1 0 13.73)">
	<stop  offset="0" style="stop-color:#CCCCCC"/>
	<stop  offset="1" style="stop-color:#F7F7F7"/>
</linearGradient>
<path class="st23" d="M3.7,5h0.7l0,0v0.4l0,0H3.7l0,0V5C3.7,5,3.7,5,3.7,5z"/>
<linearGradient id="SVGID_20_" gradientUnits="userSpaceOnUse" x1="3.0878" y1="8.29" x2="3.0878" y2="8.77" gradientTransform="matrix(1 0 0 -1 0 13.73)">
	<stop  offset="0" style="stop-color:#CCCCCC"/>
	<stop  offset="1" style="stop-color:#F7F7F7"/>
</linearGradient>
<path class="st24" d="M2.7,5h0.7l0,0v0.4l0,0H2.7l0,0V5C2.7,5,2.7,5,2.7,5z"/>
<linearGradient id="SVGID_21_" gradientUnits="userSpaceOnUse" x1="10.2278" y1="8.29" x2="10.2278" y2="8.77" gradientTransform="matrix(1 0 0 -1 0 13.73)">
	<stop  offset="0" style="stop-color:#CCCCCC"/>
	<stop  offset="1" style="stop-color:#F7F7F7"/>
</linearGradient>
<path class="st25" d="M9.9,5h0.7l0,0v0.4l0,0H9.9l0,0V5C9.9,5,9.9,5,9.9,5z"/>
<linearGradient id="SVGID_22_" gradientUnits="userSpaceOnUse" x1="9.2856" y1="8.29" x2="9.2856" y2="8.77" gradientTransform="matrix(1 0 0 -1 0 13.73)">
	<stop  offset="0" style="stop-color:#CCCCCC"/>
	<stop  offset="1" style="stop-color:#F7F7F7"/>
</linearGradient>
<path class="st26" d="M8.9,5h0.7l0,0v0.4l0,0H8.9l0,0V5C8.9,5,8.9,5,8.9,5z"/>
<linearGradient id="SVGID_23_" gradientUnits="userSpaceOnUse" x1="8.37" y1="8.29" x2="8.37" y2="8.77" gradientTransform="matrix(1 0 0 -1 0 13.73)">
	<stop  offset="0" style="stop-color:#CCCCCC"/>
	<stop  offset="1" style="stop-color:#F7F7F7"/>
</linearGradient>
<path class="st27" d="M8,5h0.7l0,0v0.4l0,0H8l0,0V5L8,5z"/>
<linearGradient id="SVGID_24_" gradientUnits="userSpaceOnUse" x1="7.37" y1="8.29" x2="7.37" y2="8.77" gradientTransform="matrix(1 0 0 -1 0 13.73)">
	<stop  offset="0" style="stop-color:#CCCCCC"/>
	<stop  offset="1" style="stop-color:#F7F7F7"/>
</linearGradient>
<path class="st28" d="M7,5h0.7l0,0v0.4l0,0H7l0,0V5L7,5z"/>
<linearGradient id="SVGID_25_" gradientUnits="userSpaceOnUse" x1="14.5356" y1="8.29" x2="14.5356" y2="8.77" gradientTransform="matrix(1 0 0 -1 0 13.73)">
	<stop  offset="0" style="stop-color:#CCCCCC"/>
	<stop  offset="1" style="stop-color:#F7F7F7"/>
</linearGradient>
<path class="st29" d="M14.2,5h0.7l0,0v0.4l0,0h-0.7l0,0V5C14.2,5,14.1,5,14.2,5z"/>
<linearGradient id="SVGID_26_" gradientUnits="userSpaceOnUse" x1="13.6093" y1="8.29" x2="13.6093" y2="8.77" gradientTransform="matrix(1 0 0 -1 0 13.73)">
	<stop  offset="0" style="stop-color:#CCCCCC"/>
	<stop  offset="1" style="stop-color:#F7F7F7"/>
</linearGradient>
<path class="st30" d="M13.2,5H14l0,0v0.4l0,0h-0.7l0,0L13.2,5C13.3,5,13.2,5,13.2,5z"/>
<linearGradient id="SVGID_27_" gradientUnits="userSpaceOnUse" x1="12.63" y1="8.29" x2="12.63" y2="8.77" gradientTransform="matrix(1 0 0 -1 0 13.73)">
	<stop  offset="0" style="stop-color:#CCCCCC"/>
	<stop  offset="1" style="stop-color:#F7F7F7"/>
</linearGradient>
<path class="st31" d="M12.3,5H13l0,0v0.4l0,0h-0.7l0,0L12.3,5C12.3,5,12.3,5,12.3,5z"/>
<linearGradient id="SVGID_28_" gradientUnits="userSpaceOnUse" x1="11.6978" y1="8.29" x2="11.6978" y2="8.77" gradientTransform="matrix(1 0 0 -1 0 13.73)">
	<stop  offset="0" style="stop-color:#CCCCCC"/>
	<stop  offset="1" style="stop-color:#F7F7F7"/>
</linearGradient>
<path class="st32" d="M11.3,5h0.7l0,0v0.4l0,0h-0.7l0,0V5C11.3,5,11.3,5,11.3,5z"/>
<linearGradient id="SVGID_29_" gradientUnits="userSpaceOnUse" x1="1.4578" y1="8.29" x2="1.4578" y2="8.77" gradientTransform="matrix(1 0 0 -1 0 13.73)">
	<stop  offset="0" style="stop-color:#CCCCCC"/>
	<stop  offset="1" style="stop-color:#F7F7F7"/>
</linearGradient>
<path class="st33" d="M1.1,5h0.7l0,0v0.4l0,0H1.1l0,0V5C1.1,5,1.1,5,1.1,5z"/>
<path class="st2" d="M5.6,5.2h0.7l0,0V5l0,0H5.6l0,0V5.2C5.6,5.3,5.6,5.2,5.6,5.2z"/>
<path class="st2" d="M4.6,5.2h0.7l0,0V5l0,0H4.6l0,0V5.2C4.6,5.3,4.6,5.2,4.6,5.2z"/>
<path class="st2" d="M3.7,5.2h0.7l0,0V5l0,0H3.7l0,0V5.2C3.7,5.3,3.7,5.2,3.7,5.2z"/>
<path class="st2" d="M2.7,5.2h0.7l0,0V5l0,0H2.7l0,0V5.2C2.7,5.3,2.7,5.2,2.7,5.2z"/>
<path class="st2" d="M9.9,5.2h0.7l0,0V5l0,0H9.9l0,0V5.2C9.9,5.3,9.9,5.2,9.9,5.2z"/>
<path class="st2" d="M8.9,5.2h0.7l0,0V5l0,0H8.9l0,0V5.2C8.9,5.3,8.9,5.2,8.9,5.2z"/>
<path class="st2" d="M8,5.2h0.7l0,0V5l0,0H8l0,0V5.2L8,5.2z"/>
<path class="st2" d="M7,5.2h0.7l0,0V5l0,0H7l0,0V5.2L7,5.2z"/>
<path class="st2" d="M14.2,5.2h0.7l0,0V5l0,0h-0.7l0,0V5.2C14.2,5.3,14.1,5.2,14.2,5.2z"/>
<path class="st2" d="M13.2,5.2H14l0,0V5l0,0h-0.7l0,0L13.2,5.2C13.3,5.3,13.2,5.2,13.2,5.2z"/>
<path class="st2" d="M12.3,5.2H13l0,0V5l0,0h-0.7l0,0L12.3,5.2C12.3,5.3,12.3,5.2,12.3,5.2z"/>
<path class="st2" d="M11.3,5.2h0.7l0,0V5l0,0h-0.7l0,0V5.2C11.3,5.3,11.3,5.2,11.3,5.2z"/>
<path class="st2" d="M1.1,5.2h0.7l0,0V5l0,0H1.1l0,0V5.2C1.1,5.3,1.1,5.2,1.1,5.2z"/>
<path class="st4" d="M4.8,11H4.1l0,0v0.2l0,0h0.7l0,0V11L4.8,11z"/>
<path class="st4" d="M3.8,11H3.1l0,0v0.2l0,0h0.7l0,0V11L3.8,11z"/>
<path class="st4" d="M2.8,11H2.1l0,0v0.2l0,0h0.7l0,0V11L2.8,11z"/>
<path class="st4" d="M1.9,11H1.1l0,0v0.2l0,0h0.7l0,0V11L1.9,11z"/>
<path class="st4" d="M14.9,11h-0.7l0,0v0.2l0,0h0.7l0,0C14.9,11.3,14.9,11,14.9,11z"/>
<path class="st4" d="M13.9,11h-0.7l0,0v0.2l0,0h0.7l0,0C13.9,11.3,13.9,11,13.9,11z"/>
<path class="st4" d="M12.9,11h-0.7l0,0v0.2l0,0h0.7l0,0C12.9,11.3,12.9,11,12.9,11z"/>
<path class="st4" d="M11.9,11h-0.7l0,0v0.2l0,0h0.7l0,0C11.9,11.3,11.9,11,11.9,11z"/>
<path class="st4" d="M2.4,8.1L2.4,8.1V7.8l0,0H1.1l0,0V8l0,0L2.4,8.1L2.4,8.1z"/>
<path class="st4" d="M2.8,9.1V8.9l0,0H1.1l0,0v0.2l0,0L2.8,9.1L2.8,9.1z"/>
<path class="st4" d="M3.3,10.2L3.3,10.2V9.9l0,0H1.1l0,0v0.2l0,0L3.3,10.2L3.3,10.2z"/>
<path class="st4" d="M14.9,10.2L14.9,10.2L14.9,10.2V9.9l0,0h-2.2l0,0v0.2l0,0L14.9,10.2L14.9,10.2z"/>
<path class="st4" d="M14.9,9.1C14.9,9.1,14.9,9.1,14.9,9.1V8.8c0,0,0,0.1-0.1,0.1h0h-1.6c0,0-0.1,0-0.1-0.1v0v0.2l0,0L14.9,9.1
	L14.9,9.1z"/>
<path class="st4" d="M5.6,5.7h0.7l0,0V5.4l0,0H5.6l0,0V5.7C5.6,5.6,5.6,5.7,5.6,5.7z"/>
<path class="st4" d="M4.6,5.7h0.7l0,0V5.4l0,0H4.6l0,0V5.7C4.6,5.6,4.6,5.7,4.6,5.7z"/>
<path class="st4" d="M3.7,5.7h0.7l0,0V5.4l0,0H3.7l0,0V5.7C3.7,5.6,3.7,5.7,3.7,5.7z"/>
<path class="st4" d="M2.7,5.7h0.7l0,0V5.4l0,0H2.7l0,0V5.7C2.7,5.6,2.7,5.7,2.7,5.7z"/>
<path class="st4" d="M9.9,5.7h0.7l0,0V5.4l0,0H9.9l0,0V5.7C9.9,5.6,9.9,5.7,9.9,5.7z"/>
<path class="st4" d="M8.9,5.7h0.7l0,0V5.4l0,0H8.9l0,0V5.7C8.9,5.6,8.9,5.7,8.9,5.7z"/>
<path class="st4" d="M8,5.7h0.7l0,0V5.4l0,0H8l0,0V5.7L8,5.7z"/>
<path class="st4" d="M7,5.7h0.7l0,0V5.4l0,0H7l0,0V5.7L7,5.7z"/>
<path class="st4" d="M14.2,5.7h0.7l0,0V5.4l0,0h-0.7l0,0V5.7C14.2,5.6,14.1,5.7,14.2,5.7z"/>
<path class="st4" d="M13.2,5.7H14l0,0V5.4l0,0h-0.7l0,0L13.2,5.7C13.3,5.6,13.2,5.7,13.2,5.7z"/>
<path class="st4" d="M12.3,5.7H13l0,0V5.4l0,0h-0.7l0,0L12.3,5.7C12.3,5.6,12.3,5.7,12.3,5.7z"/>
<path class="st4" d="M11.3,5.7h0.7l0,0V5.4l0,0h-0.7l0,0V5.7C11.3,5.6,11.3,5.7,11.3,5.7z"/>
<path class="st4" d="M1.1,5.7h0.7l0,0V5.4l0,0H1.1l0,0V5.7C1.1,5.6,1.1,5.7,1.1,5.7z"/>
<path class="st4" d="M14.9,7L14.9,7V6.7l0,0h-0.7l0,0V7l0,0H14.9L14.9,7z"/>
<path class="st4" d="M13.4,7h0.5l0,0V6.7l0,0h-0.7l0,0V7l0,0H13.4L13.4,7z"/>
<path class="st4" d="M12.4,7h0.5l0,0V6.7l0,0h-0.7l0,0V7l0,0H12.4L12.4,7z"/>
<path class="st4" d="M11.4,7h0.5l0,0V6.7l0,0h-0.7l0,0V7l0,0H11.4L11.4,7z"/>
<path class="st4" d="M10.4,7h0.5l0,0V6.7l0,0h-0.7l0,0V7l0,0H10.4L10.4,7z"/>
<path class="st4" d="M9.4,7h0.5l0,0V6.7l0,0H9.1l0,0V7l0,0H9.4L9.4,7z"/>
<path class="st4" d="M8.4,7h0.5l0,0V6.7l0,0H8.1l0,0V7l0,0H8.4L8.4,7z"/>
<path class="st4" d="M7.4,7h0.5l0,0V6.7l0,0H7.1l0,0V7l0,0H7.4L7.4,7z"/>
<path class="st4" d="M6.4,7h0.5l0,0V6.7l0,0H6.1l0,0V7l0,0H6.4L6.4,7z"/>
<path class="st4" d="M5.4,7h0.5l0,0V6.7l0,0H5.1l0,0V7l0,0H5.4L5.4,7z"/>
<path class="st4" d="M4.4,7h0.5l0,0V6.7l0,0H4.1l0,0V7l0,0H4.4L4.4,7z"/>
<path class="st4" d="M3.4,7h0.5l0,0V6.7l0,0H3.1l0,0V7l0,0H3.4L3.4,7z"/>
<path class="st4" d="M2.4,7h0.5l0,0V6.7l0,0H2.1l0,0V7l0,0H2.4L2.4,7z"/>
<path class="st4" d="M1.9,7L1.9,7V6.7l0,0H1.1l0,0V7l0,0H1.9L1.9,7z"/>
<path class="st4" d="M13.4,8.1L13.4,8.1V7.8l0,0h-0.7l0,0V8l0,0L13.4,8.1L13.4,8.1z"/>
<path class="st4" d="M12.4,8V7.8l0,0h-0.7l0,0V8l0,0H12.4L12.4,8z"/>
<path class="st4" d="M11.4,8V7.8l0,0h-0.7l0,0V8l0,0H11.4L11.4,8z"/>
<path class="st4" d="M10.4,8V7.8l0,0H9.6l0,0V8l0,0H10.4L10.4,8z"/>
<path class="st4" d="M9.4,8V7.8l0,0H8.6l0,0V8l0,0H9.4L9.4,8z"/>
<path class="st4" d="M8.4,8V7.8l0,0H7.6l0,0V8l0,0H8.4L8.4,8z"/>
<path class="st4" d="M7.4,8V7.8l0,0H6.6l0,0V8l0,0H7.4L7.4,8z"/>
<path class="st4" d="M6.4,8V7.8l0,0H5.6l0,0V8l0,0H6.4L6.4,8z"/>
<path class="st4" d="M5.4,8V7.8l0,0H4.6l0,0V8l0,0H5.4L5.4,8z"/>
<path class="st4" d="M4.4,8V7.8l0,0H3.6l0,0V8l0,0H4.4L4.4,8z"/>
<path class="st4" d="M2.8,8.1h0.5l0,0V7.8l0,0H2.6l0,0V8l0,0L2.8,8.1L2.8,8.1z"/>
<path class="st4" d="M12.4,9.2h0.5l0,0V8.9l0,0h-0.7l0,0v0.2l0,0L12.4,9.2L12.4,9.2z"/>
<path class="st4" d="M11.4,9.2h0.5l0,0V8.9l0,0h-0.7l0,0v0.2l0,0L11.4,9.2L11.4,9.2z"/>
<path class="st4" d="M10.4,9.2h0.5l0,0V8.9l0,0h-0.7l0,0v0.2l0,0L10.4,9.2L10.4,9.2z"/>
<path class="st4" d="M9.4,9.2h0.5l0,0V8.9l0,0H9.1l0,0v0.2l0,0L9.4,9.2L9.4,9.2z"/>
<path class="st4" d="M8.4,9.2h0.5l0,0V8.9l0,0H8.1l0,0v0.2l0,0L8.4,9.2L8.4,9.2z"/>
<path class="st4" d="M7.4,9.2h0.5l0,0V8.9l0,0H7.1l0,0v0.2l0,0L7.4,9.2L7.4,9.2z"/>
<path class="st4" d="M6.4,9.2h0.5l0,0V8.9l0,0H6.1l0,0v0.2l0,0L6.4,9.2L6.4,9.2z"/>
<path class="st4" d="M5.4,9.2h0.5l0,0V8.9l0,0H5.1l0,0v0.2l0,0L5.4,9.2L5.4,9.2z"/>
<path class="st4" d="M4.4,9.2h0.5l0,0V8.9l0,0H4.1l0,0v0.2l0,0L4.4,9.2L4.4,9.2z"/>
<path class="st4" d="M3.3,9.2h0.5l0,0V8.9l0,0H3.1l0,0v0.2l0,0L3.3,9.2L3.3,9.2z"/>
<path class="st4" d="M12.4,10.2L12.4,10.2V9.9l0,0h-0.7l0,0v0.2l0,0L12.4,10.2L12.4,10.2z"/>
<path class="st4" d="M11.4,10.2L11.4,10.2V9.9l0,0h-0.7l0,0v0.2l0,0L11.4,10.2L11.4,10.2z"/>
<path class="st4" d="M10.4,10.2V9.9l0,0H9.6l0,0v0.2l0,0H10.4L10.4,10.2z"/>
<path class="st4" d="M9.4,10.2V9.9l0,0H8.6l0,0v0.2l0,0H9.4L9.4,10.2z"/>
<path class="st4" d="M8.4,10.2V9.9l0,0H7.6l0,0v0.2l0,0H8.4L8.4,10.2z"/>
<path class="st4" d="M7.4,10.2V9.9l0,0H6.6l0,0v0.2l0,0H7.4L7.4,10.2z"/>
<path class="st4" d="M6.4,10.2V9.9l0,0H5.6l0,0v0.2l0,0H6.4L6.4,10.2z"/>
<path class="st4" d="M5.4,10.2L5.4,10.2V9.9l0,0H4.6l0,0v0.2l0,0L5.4,10.2L5.4,10.2z"/>
<path class="st4" d="M4.4,10.2L4.4,10.2V9.9l0,0H3.6l0,0v0.2l0,0L4.4,10.2L4.4,10.2z"/>
<path class="st4" d="M10.8,11H5.2l0,0v0.2l0,0h5.6l0,0V11L10.8,11z"/>
<linearGradient id="SVGID_30_" gradientUnits="userSpaceOnUse" x1="14.51" y1="6.92" x2="14.51" y2="7.86" gradientTransform="matrix(1 0 0 -1 0 13.73)">
	<stop  offset="0" style="stop-color:#1A1A1A"/>
	<stop  offset="1" style="stop-color:#595959"/>
</linearGradient>
<path class="st34" d="M14.1,5.9h0.7c0.1,0,0.1,0,0.1,0.1v0.7c0,0.1,0,0.1-0.1,0.1h-0.7c-0.1,0-0.1,0-0.1-0.1V6
	C14,5.9,14.1,5.9,14.1,5.9z"/>
<linearGradient id="SVGID_31_" gradientUnits="userSpaceOnUse" x1="13.51" y1="6.92" x2="13.51" y2="7.86" gradientTransform="matrix(1 0 0 -1 0 13.73)">
	<stop  offset="0" style="stop-color:#1A1A1A"/>
	<stop  offset="1" style="stop-color:#595959"/>
</linearGradient>
<path class="st35" d="M13.1,5.9h0.7c0.1,0,0.1,0,0.1,0.1v0.7c0,0.1,0,0.1-0.1,0.1h-0.7c-0.1,0-0.1,0-0.1-0.1V6
	C13,5.9,13.1,5.9,13.1,5.9z"/>
<linearGradient id="SVGID_32_" gradientUnits="userSpaceOnUse" x1="12.5" y1="6.92" x2="12.5" y2="7.86" gradientTransform="matrix(1 0 0 -1 0 13.73)">
	<stop  offset="0" style="stop-color:#1A1A1A"/>
	<stop  offset="1" style="stop-color:#595959"/>
</linearGradient>
<path class="st36" d="M12.1,5.9h0.7c0.1,0,0.1,0,0.1,0.1v0.7c0,0.1,0,0.1-0.1,0.1h-0.7c-0.1,0-0.1,0-0.1-0.1V6
	C12,5.9,12.1,5.9,12.1,5.9z"/>
<linearGradient id="SVGID_33_" gradientUnits="userSpaceOnUse" x1="11.5" y1="6.92" x2="11.5" y2="7.86" gradientTransform="matrix(1 0 0 -1 0 13.73)">
	<stop  offset="0" style="stop-color:#1A1A1A"/>
	<stop  offset="1" style="stop-color:#595959"/>
</linearGradient>
<path class="st37" d="M11.1,5.9h0.7c0.1,0,0.1,0,0.1,0.1v0.7c0,0.1,0,0.1-0.1,0.1h-0.7c-0.1,0-0.1,0-0.1-0.1V6
	C11,5.9,11.1,5.9,11.1,5.9z"/>
<linearGradient id="SVGID_34_" gradientUnits="userSpaceOnUse" x1="10.5" y1="6.92" x2="10.5" y2="7.86" gradientTransform="matrix(1 0 0 -1 0 13.73)">
	<stop  offset="0" style="stop-color:#1A1A1A"/>
	<stop  offset="1" style="stop-color:#595959"/>
</linearGradient>
<path class="st38" d="M10.1,5.9h0.7c0.1,0,0.1,0,0.1,0.1v0.7c0,0.1,0,0.1-0.1,0.1h-0.7c-0.1,0-0.1,0-0.1-0.1V6
	C10,5.9,10.1,5.9,10.1,5.9z"/>
<linearGradient id="SVGID_35_" gradientUnits="userSpaceOnUse" x1="9.5" y1="6.92" x2="9.5" y2="7.86" gradientTransform="matrix(1 0 0 -1 0 13.73)">
	<stop  offset="0" style="stop-color:#1A1A1A"/>
	<stop  offset="1" style="stop-color:#595959"/>
</linearGradient>
<path class="st39" d="M9.1,5.9h0.7c0.1,0,0.1,0,0.1,0.1v0.7c0,0.1,0,0.1-0.1,0.1H9.1C9.1,6.8,9,6.8,9,6.7V6C9,5.9,9.1,5.9,9.1,5.9z"
	/>
<linearGradient id="SVGID_36_" gradientUnits="userSpaceOnUse" x1="8.5" y1="6.92" x2="8.5" y2="7.86" gradientTransform="matrix(1 0 0 -1 0 13.73)">
	<stop  offset="0" style="stop-color:#1A1A1A"/>
	<stop  offset="1" style="stop-color:#595959"/>
</linearGradient>
<path class="st40" d="M8.1,5.9h0.7C8.9,5.9,9,5.9,9,6v0.7c0,0.1,0,0.1-0.1,0.1H8.1C8.1,6.8,8,6.8,8,6.7V6C8,5.9,8.1,5.9,8.1,5.9z"/>
<linearGradient id="SVGID_37_" gradientUnits="userSpaceOnUse" x1="7.5" y1="6.92" x2="7.5" y2="7.86" gradientTransform="matrix(1 0 0 -1 0 13.73)">
	<stop  offset="0" style="stop-color:#1A1A1A"/>
	<stop  offset="1" style="stop-color:#595959"/>
</linearGradient>
<path class="st41" d="M7.1,5.9h0.7C7.9,5.9,8,5.9,8,6v0.7c0,0.1,0,0.1-0.1,0.1H7.1C7.1,6.8,7,6.8,7,6.7V6C7,5.9,7.1,5.9,7.1,5.9z"/>
<linearGradient id="SVGID_38_" gradientUnits="userSpaceOnUse" x1="6.5" y1="6.92" x2="6.5" y2="7.86" gradientTransform="matrix(1 0 0 -1 0 13.73)">
	<stop  offset="0" style="stop-color:#1A1A1A"/>
	<stop  offset="1" style="stop-color:#595959"/>
</linearGradient>
<path class="st42" d="M6.1,5.9h0.7C6.9,5.9,7,5.9,7,6v0.7c0,0.1,0,0.1-0.1,0.1H6.1C6.1,6.8,6,6.8,6,6.7V6C6,5.9,6.1,5.9,6.1,5.9z"/>
<linearGradient id="SVGID_39_" gradientUnits="userSpaceOnUse" x1="5.49" y1="6.92" x2="5.49" y2="7.86" gradientTransform="matrix(1 0 0 -1 0 13.73)">
	<stop  offset="0" style="stop-color:#1A1A1A"/>
	<stop  offset="1" style="stop-color:#595959"/>
</linearGradient>
<path class="st43" d="M5.1,5.9h0.7C5.9,5.9,6,5.9,6,6v0.7c0,0.1,0,0.1-0.1,0.1H5.1C5.1,6.8,5,6.8,5,6.7V6C5,5.9,5.1,5.9,5.1,5.9z"/>
<linearGradient id="SVGID_40_" gradientUnits="userSpaceOnUse" x1="4.49" y1="6.92" x2="4.49" y2="7.86" gradientTransform="matrix(1 0 0 -1 0 13.73)">
	<stop  offset="0" style="stop-color:#1A1A1A"/>
	<stop  offset="1" style="stop-color:#595959"/>
</linearGradient>
<path class="st44" d="M4.1,5.9h0.7C4.9,5.9,5,5.9,5,6v0.7c0,0.1,0,0.1-0.1,0.1H4.1C4.1,6.8,4,6.8,4,6.7V6C4,5.9,4.1,5.9,4.1,5.9z"/>
<linearGradient id="SVGID_41_" gradientUnits="userSpaceOnUse" x1="3.49" y1="6.92" x2="3.49" y2="7.86" gradientTransform="matrix(1 0 0 -1 0 13.73)">
	<stop  offset="0" style="stop-color:#1A1A1A"/>
	<stop  offset="1" style="stop-color:#595959"/>
</linearGradient>
<path class="st45" d="M3.1,5.9h0.7C3.9,5.9,4,5.9,4,6v0.7c0,0.1,0,0.1-0.1,0.1H3.1C3.1,6.8,3,6.8,3,6.7V6C3,5.9,3.1,5.9,3.1,5.9z"/>
<linearGradient id="SVGID_42_" gradientUnits="userSpaceOnUse" x1="2.49" y1="6.92" x2="2.49" y2="7.86" gradientTransform="matrix(1 0 0 -1 0 13.73)">
	<stop  offset="0" style="stop-color:#1A1A1A"/>
	<stop  offset="1" style="stop-color:#595959"/>
</linearGradient>
<path class="st46" d="M2.1,5.9h0.7C2.9,5.9,3,5.9,3,6v0.7c0,0.1,0,0.1-0.1,0.1H2.1C2.1,6.8,2,6.8,2,6.7V6C2,5.9,2.1,5.9,2.1,5.9z"/>
<linearGradient id="SVGID_43_" gradientUnits="userSpaceOnUse" x1="1.49" y1="6.92" x2="1.49" y2="7.86" gradientTransform="matrix(1 0 0 -1 0 13.73)">
	<stop  offset="0" style="stop-color:#1A1A1A"/>
	<stop  offset="1" style="stop-color:#595959"/>
</linearGradient>
<path class="st47" d="M1.1,5.9h0.7C1.9,5.9,2,5.9,2,6v0.7c0,0.1,0,0.1-0.1,0.1H1.1C1.1,6.8,1,6.8,1,6.7V6C1,5.9,1.1,5.9,1.1,5.9z"/>
<linearGradient id="SVGID_44_" gradientUnits="userSpaceOnUse" x1="14.1" y1="7.39" x2="14.92" y2="7.39" gradientTransform="matrix(1 0 0 -1 0 13.73)">
	<stop  offset="0" style="stop-color:#CCCCCC"/>
	<stop  offset="1" style="stop-color:#F7F7F7"/>
</linearGradient>
<path class="st48" d="M14.2,5.9h0.7c0,0,0.1,0,0.1,0.1v0.7c0,0,0,0.1-0.1,0.1h-0.7c0,0-0.1,0-0.1-0.1L14.2,5.9
	C14.1,6,14.1,5.9,14.2,5.9z"/>
<linearGradient id="SVGID_45_" gradientUnits="userSpaceOnUse" x1="13.09" y1="7.39" x2="13.92" y2="7.39" gradientTransform="matrix(1 0 0 -1 0 13.73)">
	<stop  offset="0" style="stop-color:#CCCCCC"/>
	<stop  offset="1" style="stop-color:#F7F7F7"/>
</linearGradient>
<path class="st49" d="M13.1,5.9h0.7c0,0,0.1,0,0.1,0.1v0.7c0,0,0,0.1-0.1,0.1h-0.7c0,0-0.1,0-0.1-0.1L13.1,5.9
	C13.1,6,13.1,5.9,13.1,5.9z"/>
<linearGradient id="SVGID_46_" gradientUnits="userSpaceOnUse" x1="12.09" y1="7.39" x2="12.92" y2="7.39" gradientTransform="matrix(1 0 0 -1 0 13.73)">
	<stop  offset="0" style="stop-color:#CCCCCC"/>
	<stop  offset="1" style="stop-color:#F7F7F7"/>
</linearGradient>
<path class="st50" d="M12.1,5.9h0.7c0,0,0.1,0,0.1,0.1v0.7c0,0,0,0.1-0.1,0.1h-0.7c0,0-0.1,0-0.1-0.1L12.1,5.9
	C12.1,6,12.1,5.9,12.1,5.9z"/>
<linearGradient id="SVGID_47_" gradientUnits="userSpaceOnUse" x1="11.09" y1="7.39" x2="11.92" y2="7.39" gradientTransform="matrix(1 0 0 -1 0 13.73)">
	<stop  offset="0" style="stop-color:#CCCCCC"/>
	<stop  offset="1" style="stop-color:#F7F7F7"/>
</linearGradient>
<path class="st51" d="M11.1,5.9h0.7c0,0,0.1,0,0.1,0.1v0.7c0,0,0,0.1-0.1,0.1h-0.7c0,0-0.1,0-0.1-0.1L11.1,5.9
	C11.1,6,11.1,5.9,11.1,5.9z"/>
<linearGradient id="SVGID_48_" gradientUnits="userSpaceOnUse" x1="10.09" y1="7.39" x2="10.92" y2="7.39" gradientTransform="matrix(1 0 0 -1 0 13.73)">
	<stop  offset="0" style="stop-color:#CCCCCC"/>
	<stop  offset="1" style="stop-color:#F7F7F7"/>
</linearGradient>
<path class="st52" d="M10.1,5.9h0.7c0,0,0.1,0,0.1,0.1v0.7c0,0,0,0.1-0.1,0.1h-0.7c0,0-0.1,0-0.1-0.1L10.1,5.9
	C10.1,6,10.1,5.9,10.1,5.9z"/>
<linearGradient id="SVGID_49_" gradientUnits="userSpaceOnUse" x1="9.09" y1="7.39" x2="9.91" y2="7.39" gradientTransform="matrix(1 0 0 -1 0 13.73)">
	<stop  offset="0" style="stop-color:#CCCCCC"/>
	<stop  offset="1" style="stop-color:#F7F7F7"/>
</linearGradient>
<path class="st53" d="M9.1,5.9h0.7c0,0,0.1,0,0.1,0.1v0.7c0,0,0,0.1-0.1,0.1H9.1c0,0-0.1,0-0.1-0.1L9.1,5.9C9.1,6,9.1,5.9,9.1,5.9z"
	/>
<linearGradient id="SVGID_50_" gradientUnits="userSpaceOnUse" x1="8.09" y1="7.39" x2="8.91" y2="7.39" gradientTransform="matrix(1 0 0 -1 0 13.73)">
	<stop  offset="0" style="stop-color:#CCCCCC"/>
	<stop  offset="1" style="stop-color:#F7F7F7"/>
</linearGradient>
<path class="st54" d="M8.1,5.9h0.7c0,0,0.1,0,0.1,0.1v0.7c0,0,0,0.1-0.1,0.1H8.1c0,0-0.1,0-0.1-0.1L8.1,5.9C8.1,6,8.1,5.9,8.1,5.9z"
	/>
<linearGradient id="SVGID_51_" gradientUnits="userSpaceOnUse" x1="7.09" y1="7.39" x2="7.91" y2="7.39" gradientTransform="matrix(1 0 0 -1 0 13.73)">
	<stop  offset="0" style="stop-color:#CCCCCC"/>
	<stop  offset="1" style="stop-color:#F7F7F7"/>
</linearGradient>
<path class="st55" d="M7.1,5.9h0.7c0,0,0.1,0,0.1,0.1v0.7c0,0,0,0.1-0.1,0.1H7.1c0,0-0.1,0-0.1-0.1L7.1,5.9C7.1,6,7.1,5.9,7.1,5.9z"
	/>
<linearGradient id="SVGID_52_" gradientUnits="userSpaceOnUse" x1="6.09" y1="7.39" x2="6.91" y2="7.39" gradientTransform="matrix(1 0 0 -1 0 13.73)">
	<stop  offset="0" style="stop-color:#CCCCCC"/>
	<stop  offset="1" style="stop-color:#F7F7F7"/>
</linearGradient>
<path class="st56" d="M6.1,5.9h0.7c0,0,0.1,0,0.1,0.1v0.7c0,0,0,0.1-0.1,0.1H6.1c0,0-0.1,0-0.1-0.1L6.1,5.9C6.1,6,6.1,5.9,6.1,5.9z"
	/>
<linearGradient id="SVGID_53_" gradientUnits="userSpaceOnUse" x1="5.08" y1="7.39" x2="5.91" y2="7.39" gradientTransform="matrix(1 0 0 -1 0 13.73)">
	<stop  offset="0" style="stop-color:#CCCCCC"/>
	<stop  offset="1" style="stop-color:#F7F7F7"/>
</linearGradient>
<path class="st57" d="M5.1,5.9h0.7c0,0,0.1,0,0.1,0.1v0.7c0,0,0,0.1-0.1,0.1H5.1c0,0-0.1,0-0.1-0.1L5.1,5.9C5.1,6,5.1,5.9,5.1,5.9z"
	/>
<linearGradient id="SVGID_54_" gradientUnits="userSpaceOnUse" x1="4.08" y1="7.39" x2="4.91" y2="7.39" gradientTransform="matrix(1 0 0 -1 0 13.73)">
	<stop  offset="0" style="stop-color:#CCCCCC"/>
	<stop  offset="1" style="stop-color:#F7F7F7"/>
</linearGradient>
<path class="st58" d="M4.1,5.9h0.7c0,0,0.1,0,0.1,0.1v0.7c0,0,0,0.1-0.1,0.1H4.1c0,0-0.1,0-0.1-0.1L4.1,5.9C4.1,6,4.1,5.9,4.1,5.9z"
	/>
<linearGradient id="SVGID_55_" gradientUnits="userSpaceOnUse" x1="3.08" y1="7.39" x2="3.91" y2="7.39" gradientTransform="matrix(1 0 0 -1 0 13.73)">
	<stop  offset="0" style="stop-color:#CCCCCC"/>
	<stop  offset="1" style="stop-color:#F7F7F7"/>
</linearGradient>
<path class="st59" d="M3.1,5.9h0.7c0,0,0,0,0,0.1v0.7c0,0,0,0.1,0,0.1H3.1c0,0,0,0,0-0.1L3.1,5.9C3.1,6,3.1,5.9,3.1,5.9z"/>
<linearGradient id="SVGID_56_" gradientUnits="userSpaceOnUse" x1="2.08" y1="7.39" x2="2.91" y2="7.39" gradientTransform="matrix(1 0 0 -1 0 13.73)">
	<stop  offset="0" style="stop-color:#CCCCCC"/>
	<stop  offset="1" style="stop-color:#F7F7F7"/>
</linearGradient>
<path class="st60" d="M2.1,5.9h0.7c0,0,0,0,0,0.1v0.7c0,0,0,0.1,0,0.1H2.1c0,0,0,0,0-0.1L2.1,5.9C2.1,6,2.1,5.9,2.1,5.9z"/>
<linearGradient id="SVGID_57_" gradientUnits="userSpaceOnUse" x1="1.08" y1="7.39" x2="1.9" y2="7.39" gradientTransform="matrix(1 0 0 -1 0 13.73)">
	<stop  offset="0" style="stop-color:#CCCCCC"/>
	<stop  offset="1" style="stop-color:#F7F7F7"/>
</linearGradient>
<path class="st61" d="M1.1,5.9h0.7c0,0,0,0,0,0.1v0.7c0,0,0,0.1,0,0.1H1.1c0,0,0,0,0-0.1L1.1,5.9C1.1,6,1.1,5.9,1.1,5.9z"/>
<path class="st2" d="M14.1,6.2h0.7l0,0V6l0,0h-0.7l0,0L14.1,6.2L14.1,6.2z"/>
<path class="st2" d="M13.1,6.2h0.7l0,0V6l0,0h-0.7l0,0L13.1,6.2L13.1,6.2z"/>
<path class="st2" d="M12.1,6.2h0.7l0,0V6l0,0h-0.7l0,0L12.1,6.2L12.1,6.2z"/>
<path class="st2" d="M11.1,6.2h0.7l0,0V6l0,0h-0.7l0,0L11.1,6.2L11.1,6.2z"/>
<path class="st2" d="M10.1,6v0.2l0,0h0.7l0,0V6l0,0H10.1L10.1,6z"/>
<path class="st2" d="M9.1,5.9L9.1,5.9v0.2l0,0h0.7l0,0V6l0,0L9.1,5.9z"/>
<path class="st2" d="M8.1,6v0.2l0,0h0.7l0,0V6l0,0H8.1L8.1,6z"/>
<path class="st2" d="M7.1,6v0.2l0,0h0.7l0,0V6l0,0H7.1L7.1,6z"/>
<path class="st2" d="M6.1,6v0.2l0,0h0.7l0,0V6l0,0H6.1L6.1,6z"/>
<path class="st2" d="M5.1,5.9L5.1,5.9v0.2l0,0h0.7l0,0V6l0,0L5.1,5.9z"/>
<path class="st2" d="M4.1,5.9L4.1,5.9v0.2l0,0h0.7l0,0V6l0,0L4.1,5.9z"/>
<path class="st2" d="M3.1,5.9L3.1,5.9v0.2l0,0h0.7l0,0V6l0,0L3.1,5.9z"/>
<path class="st2" d="M2.1,6.2h0.7l0,0V6l0,0H2.1l0,0V6.2L2.1,6.2z"/>
<path class="st2" d="M1.1,5.9L1.1,5.9v0.2l0,0h0.7l0,0V6l0,0L1.1,5.9z"/>
<linearGradient id="SVGID_58_" gradientUnits="userSpaceOnUse" x1="12.5" y1="4.77" x2="12.5" y2="5.71" gradientTransform="matrix(1 0 0 -1 0 13.73)">
	<stop  offset="0" style="stop-color:#1A1A1A"/>
	<stop  offset="1" style="stop-color:#595959"/>
</linearGradient>
<path class="st62" d="M12.1,8h0.7c0.1,0,0.1,0,0.1,0.1v0.7c0,0.1,0,0.1-0.1,0.1h-0.7c-0.1,0-0.1,0-0.1-0.1V8.1C12,8.1,12.1,8,12.1,8
	z"/>
<linearGradient id="SVGID_59_" gradientUnits="userSpaceOnUse" x1="11.5" y1="4.77" x2="11.5" y2="5.71" gradientTransform="matrix(1 0 0 -1 0 13.73)">
	<stop  offset="0" style="stop-color:#1A1A1A"/>
	<stop  offset="1" style="stop-color:#595959"/>
</linearGradient>
<path class="st63" d="M11.1,8h0.7c0.1,0,0.1,0,0.1,0.1v0.7c0,0.1,0,0.1-0.1,0.1h-0.7c-0.1,0-0.1,0-0.1-0.1V8.1C11,8.1,11.1,8,11.1,8
	z"/>
<linearGradient id="SVGID_60_" gradientUnits="userSpaceOnUse" x1="10.5" y1="4.77" x2="10.5" y2="5.71" gradientTransform="matrix(1 0 0 -1 0 13.73)">
	<stop  offset="0" style="stop-color:#1A1A1A"/>
	<stop  offset="1" style="stop-color:#595959"/>
</linearGradient>
<path class="st64" d="M10.1,8h0.7c0.1,0,0.1,0,0.1,0.1v0.7c0,0.1,0,0.1-0.1,0.1h-0.7c-0.1,0-0.1,0-0.1-0.1V8.1C10,8.1,10.1,8,10.1,8
	z"/>
<linearGradient id="SVGID_61_" gradientUnits="userSpaceOnUse" x1="9.5" y1="4.77" x2="9.5" y2="5.71" gradientTransform="matrix(1 0 0 -1 0 13.73)">
	<stop  offset="0" style="stop-color:#1A1A1A"/>
	<stop  offset="1" style="stop-color:#595959"/>
</linearGradient>
<path class="st65" d="M9.1,8h0.7c0.1,0,0.1,0,0.1,0.1v0.7C10,8.9,9.9,9,9.9,9H9.1C9.1,9,9,8.9,9,8.9V8.1C9,8.1,9.1,8,9.1,8z"/>
<linearGradient id="SVGID_62_" gradientUnits="userSpaceOnUse" x1="8.5" y1="4.77" x2="8.5" y2="5.71" gradientTransform="matrix(1 0 0 -1 0 13.73)">
	<stop  offset="0" style="stop-color:#1A1A1A"/>
	<stop  offset="1" style="stop-color:#595959"/>
</linearGradient>
<path class="st66" d="M8.1,8h0.7C8.9,8,9,8.1,9,8.1v0.7C9,8.9,8.9,9,8.9,9H8.1C8.1,9,8,8.9,8,8.9V8.1C8,8.1,8.1,8,8.1,8z"/>
<linearGradient id="SVGID_63_" gradientUnits="userSpaceOnUse" x1="7.5" y1="4.77" x2="7.5" y2="5.71" gradientTransform="matrix(1 0 0 -1 0 13.73)">
	<stop  offset="0" style="stop-color:#1A1A1A"/>
	<stop  offset="1" style="stop-color:#595959"/>
</linearGradient>
<path class="st67" d="M7.1,8h0.7C7.9,8,8,8.1,8,8.1v0.7C8,8.9,7.9,9,7.9,9H7.1C7.1,9,7,8.9,7,8.9V8.1C7,8.1,7.1,8,7.1,8z"/>
<linearGradient id="SVGID_64_" gradientUnits="userSpaceOnUse" x1="6.5" y1="4.77" x2="6.5" y2="5.71" gradientTransform="matrix(1 0 0 -1 0 13.73)">
	<stop  offset="0" style="stop-color:#1A1A1A"/>
	<stop  offset="1" style="stop-color:#595959"/>
</linearGradient>
<path class="st68" d="M6.1,8h0.7C6.9,8,7,8.1,7,8.1v0.7C7,8.9,6.9,9,6.9,9H6.1C6.1,9,6,8.9,6,8.9V8.1C6,8.1,6.1,8,6.1,8z"/>
<linearGradient id="SVGID_65_" gradientUnits="userSpaceOnUse" x1="5.49" y1="4.77" x2="5.49" y2="5.71" gradientTransform="matrix(1 0 0 -1 0 13.73)">
	<stop  offset="0" style="stop-color:#1A1A1A"/>
	<stop  offset="1" style="stop-color:#595959"/>
</linearGradient>
<path class="st69" d="M5.1,8h0.7C5.9,8,6,8.1,6,8.1v0.7C6,8.9,5.9,9,5.8,9H5.1C5.1,9,5,8.9,5,8.9V8.1C5,8.1,5.1,8,5.1,8z"/>
<linearGradient id="SVGID_66_" gradientUnits="userSpaceOnUse" x1="4.49" y1="4.77" x2="4.49" y2="5.71" gradientTransform="matrix(1 0 0 -1 0 13.73)">
	<stop  offset="0" style="stop-color:#1A1A1A"/>
	<stop  offset="1" style="stop-color:#595959"/>
</linearGradient>
<path class="st70" d="M4.1,8h0.7C4.9,8,5,8.1,5,8.1v0.7C5,8.9,4.9,9,4.8,9H4.1C4.1,9,4,8.9,4,8.9V8.1C4,8.1,4.1,8,4.1,8z"/>
<linearGradient id="SVGID_67_" gradientUnits="userSpaceOnUse" x1="3.49" y1="4.77" x2="3.49" y2="5.71" gradientTransform="matrix(1 0 0 -1 0 13.73)">
	<stop  offset="0" style="stop-color:#1A1A1A"/>
	<stop  offset="1" style="stop-color:#595959"/>
</linearGradient>
<path class="st71" d="M3.1,8h0.7C3.9,8,4,8.1,4,8.1v0.7C4,8.9,3.9,9,3.9,9H3.1C3.1,9,3,8.9,3,8.9V8.1C3,8.1,3.1,8,3.1,8z"/>
<linearGradient id="SVGID_68_" gradientUnits="userSpaceOnUse" x1="12.09" y1="5.24" x2="12.92" y2="5.24" gradientTransform="matrix(1 0 0 -1 0 13.73)">
	<stop  offset="0" style="stop-color:#CCCCCC"/>
	<stop  offset="1" style="stop-color:#F7F7F7"/>
</linearGradient>
<path class="st72" d="M12.1,8.1h0.7c0,0,0.1,0,0.1,0.1v0.7c0,0,0,0.1-0.1,0.1h-0.7c0,0-0.1,0-0.1-0.1L12.1,8.1
	C12.1,8.1,12.1,8.1,12.1,8.1z"/>
<linearGradient id="SVGID_69_" gradientUnits="userSpaceOnUse" x1="11.09" y1="5.24" x2="11.92" y2="5.24" gradientTransform="matrix(1 0 0 -1 0 13.73)">
	<stop  offset="0" style="stop-color:#CCCCCC"/>
	<stop  offset="1" style="stop-color:#F7F7F7"/>
</linearGradient>
<path class="st73" d="M11.1,8.1h0.7c0,0,0.1,0,0.1,0.1v0.7c0,0,0,0.1-0.1,0.1h-0.7c0,0-0.1,0-0.1-0.1L11.1,8.1
	C11.1,8.1,11.1,8.1,11.1,8.1z"/>
<linearGradient id="SVGID_70_" gradientUnits="userSpaceOnUse" x1="10.09" y1="5.24" x2="10.92" y2="5.24" gradientTransform="matrix(1 0 0 -1 0 13.73)">
	<stop  offset="0" style="stop-color:#CCCCCC"/>
	<stop  offset="1" style="stop-color:#F7F7F7"/>
</linearGradient>
<path class="st74" d="M10.1,8.1h0.7c0,0,0.1,0,0.1,0.1v0.7c0,0,0,0.1-0.1,0.1h-0.7c0,0-0.1,0-0.1-0.1L10.1,8.1
	C10.1,8.1,10.1,8.1,10.1,8.1z"/>
<linearGradient id="SVGID_71_" gradientUnits="userSpaceOnUse" x1="9.09" y1="5.24" x2="9.91" y2="5.24" gradientTransform="matrix(1 0 0 -1 0 13.73)">
	<stop  offset="0" style="stop-color:#CCCCCC"/>
	<stop  offset="1" style="stop-color:#F7F7F7"/>
</linearGradient>
<path class="st75" d="M9.1,8.1h0.7c0,0,0.1,0,0.1,0.1v0.7c0,0,0,0.1-0.1,0.1H9.1c0,0-0.1,0-0.1-0.1L9.1,8.1C9.1,8.1,9.1,8.1,9.1,8.1
	z"/>
<linearGradient id="SVGID_72_" gradientUnits="userSpaceOnUse" x1="8.09" y1="5.24" x2="8.91" y2="5.24" gradientTransform="matrix(1 0 0 -1 0 13.73)">
	<stop  offset="0" style="stop-color:#CCCCCC"/>
	<stop  offset="1" style="stop-color:#F7F7F7"/>
</linearGradient>
<path class="st76" d="M8.1,8.1h0.7c0,0,0.1,0,0.1,0.1v0.7c0,0,0,0.1-0.1,0.1H8.1c0,0-0.1,0-0.1-0.1L8.1,8.1C8.1,8.1,8.1,8.1,8.1,8.1
	z"/>
<linearGradient id="SVGID_73_" gradientUnits="userSpaceOnUse" x1="7.09" y1="5.24" x2="7.91" y2="5.24" gradientTransform="matrix(1 0 0 -1 0 13.73)">
	<stop  offset="0" style="stop-color:#CCCCCC"/>
	<stop  offset="1" style="stop-color:#F7F7F7"/>
</linearGradient>
<path class="st77" d="M7.1,8.1h0.7c0,0,0.1,0,0.1,0.1v0.7c0,0,0,0.1-0.1,0.1H7.1c0,0-0.1,0-0.1-0.1L7.1,8.1C7.1,8.1,7.1,8.1,7.1,8.1
	z"/>
<linearGradient id="SVGID_74_" gradientUnits="userSpaceOnUse" x1="6.09" y1="5.24" x2="6.91" y2="5.24" gradientTransform="matrix(1 0 0 -1 0 13.73)">
	<stop  offset="0" style="stop-color:#CCCCCC"/>
	<stop  offset="1" style="stop-color:#F7F7F7"/>
</linearGradient>
<path class="st78" d="M6.1,8.1h0.7c0,0,0.1,0,0.1,0.1v0.7c0,0,0,0.1-0.1,0.1H6.1c0,0-0.1,0-0.1-0.1L6.1,8.1C6.1,8.1,6.1,8.1,6.1,8.1
	z"/>
<linearGradient id="SVGID_75_" gradientUnits="userSpaceOnUse" x1="5.08" y1="5.24" x2="5.91" y2="5.24" gradientTransform="matrix(1 0 0 -1 0 13.73)">
	<stop  offset="0" style="stop-color:#CCCCCC"/>
	<stop  offset="1" style="stop-color:#F7F7F7"/>
</linearGradient>
<path class="st79" d="M5.1,8.1h0.7c0,0,0.1,0,0.1,0.1v0.7c0,0,0,0.1-0.1,0.1H5.1c0,0-0.1,0-0.1-0.1L5.1,8.1C5.1,8.1,5.1,8.1,5.1,8.1
	z"/>
<linearGradient id="SVGID_76_" gradientUnits="userSpaceOnUse" x1="4.08" y1="5.24" x2="4.91" y2="5.24" gradientTransform="matrix(1 0 0 -1 0 13.73)">
	<stop  offset="0" style="stop-color:#CCCCCC"/>
	<stop  offset="1" style="stop-color:#F7F7F7"/>
</linearGradient>
<path class="st80" d="M4.1,8.1h0.7c0,0,0.1,0,0.1,0.1v0.7c0,0,0,0.1-0.1,0.1H4.1c0,0-0.1,0-0.1-0.1L4.1,8.1C4.1,8.1,4.1,8.1,4.1,8.1
	z"/>
<linearGradient id="SVGID_77_" gradientUnits="userSpaceOnUse" x1="3.08" y1="5.24" x2="3.91" y2="5.24" gradientTransform="matrix(1 0 0 -1 0 13.73)">
	<stop  offset="0" style="stop-color:#CCCCCC"/>
	<stop  offset="1" style="stop-color:#F7F7F7"/>
</linearGradient>
<path class="st81" d="M3.1,8.1h0.7c0,0,0,0,0,0.1v0.7c0,0,0,0.1,0,0.1H3.1c0,0,0,0,0-0.1L3.1,8.1C3.1,8.1,3.1,8.1,3.1,8.1z"/>
<linearGradient id="SVGID_78_" gradientUnits="userSpaceOnUse" x1="2.205" y1="3.7" x2="2.205" y2="4.65" gradientTransform="matrix(1 0 0 -1 0 13.73)">
	<stop  offset="0" style="stop-color:#1A1A1A"/>
	<stop  offset="1" style="stop-color:#595959"/>
</linearGradient>
<path class="st82" d="M1,9.8V9.3c0-0.1,0.1-0.3,0.3-0.3h1.9c0.1,0,0.3,0.1,0.3,0.3v0.4c0,0.1-0.1,0.3-0.3,0.3H1.3
	C1.1,10,1,9.9,1,9.8z"/>
<linearGradient id="SVGID_79_" gradientUnits="userSpaceOnUse" x1="2.205" y1="3.76" x2="2.205" y2="4.59" gradientTransform="matrix(1 0 0 -1 0 13.73)">
	<stop  offset="0" style="stop-color:#CCCCCC"/>
	<stop  offset="1" style="stop-color:#F7F7F7"/>
</linearGradient>
<path class="st83" d="M1.2,9.1h2c0.1,0,0.2,0.1,0.2,0.2v0.5c0,0.1-0.1,0.2-0.2,0.2h-2c-0.1,0-0.2-0.1-0.2-0.2V9.3
	C1.1,9.2,1.1,9.1,1.2,9.1z"/>
<linearGradient id="SVGID_80_" gradientUnits="userSpaceOnUse" x1="13.795" y1="3.7" x2="13.795" y2="4.65" gradientTransform="matrix(1 0 0 -1 0 13.73)">
	<stop  offset="0" style="stop-color:#1A1A1A"/>
	<stop  offset="1" style="stop-color:#595959"/>
</linearGradient>
<path class="st84" d="M12.6,9.8V9.3c0-0.1,0.1-0.3,0.3-0.3h1.9c0.1,0,0.3,0.1,0.3,0.3v0.4c0,0.1-0.1,0.3-0.3,0.3h-1.9
	C12.7,10,12.6,9.9,12.6,9.8z"/>
<linearGradient id="SVGID_81_" gradientUnits="userSpaceOnUse" x1="4.48" y1="2.62" x2="4.48" y2="3.57" gradientTransform="matrix(1 0 0 -1 0 13.73)">
	<stop  offset="0" style="stop-color:#1A1A1A"/>
	<stop  offset="1" style="stop-color:#595959"/>
</linearGradient>
<path class="st85" d="M4.1,10.2h0.7c0.1,0,0.1,0,0.1,0.1V11c0,0.1,0,0.1-0.1,0.1H4.1c-0.1,0-0.1,0-0.1-0.1v-0.7
	C4,10.2,4.1,10.2,4.1,10.2z"/>
<linearGradient id="SVGID_82_" gradientUnits="userSpaceOnUse" x1="3.48" y1="2.62" x2="3.48" y2="3.57" gradientTransform="matrix(1 0 0 -1 0 13.73)">
	<stop  offset="0" style="stop-color:#1A1A1A"/>
	<stop  offset="1" style="stop-color:#595959"/>
</linearGradient>
<path class="st86" d="M3.1,10.2h0.7c0.1,0,0.1,0,0.1,0.1V11c0,0.1,0,0.1-0.1,0.1H3.1c-0.1,0-0.1,0-0.1-0.1v-0.7
	C3,10.2,3.1,10.2,3.1,10.2z"/>
<linearGradient id="SVGID_83_" gradientUnits="userSpaceOnUse" x1="2.48" y1="2.62" x2="2.48" y2="3.57" gradientTransform="matrix(1 0 0 -1 0 13.73)">
	<stop  offset="0" style="stop-color:#1A1A1A"/>
	<stop  offset="1" style="stop-color:#595959"/>
</linearGradient>
<path class="st87" d="M2.1,10.2h0.7c0.1,0,0.1,0,0.1,0.1V11c0,0.1,0,0.1-0.1,0.1H2.1c-0.1,0-0.1,0-0.1-0.1v-0.7
	C2,10.2,2.1,10.2,2.1,10.2z"/>
<linearGradient id="SVGID_84_" gradientUnits="userSpaceOnUse" x1="1.48" y1="2.62" x2="1.48" y2="3.57" gradientTransform="matrix(1 0 0 -1 0 13.73)">
	<stop  offset="0" style="stop-color:#1A1A1A"/>
	<stop  offset="1" style="stop-color:#595959"/>
</linearGradient>
<path class="st88" d="M1.1,10.2h0.7c0.1,0,0.1,0,0.1,0.1V11c0,0.1,0,0.1-0.1,0.1H1.1c-0.1,0-0.1,0-0.1-0.1v-0.7
	C1,10.2,1.1,10.2,1.1,10.2z"/>
<linearGradient id="SVGID_85_" gradientUnits="userSpaceOnUse" x1="4.07" y1="3.1" x2="4.9" y2="3.1" gradientTransform="matrix(1 0 0 -1 0 13.73)">
	<stop  offset="0" style="stop-color:#CCCCCC"/>
	<stop  offset="1" style="stop-color:#F7F7F7"/>
</linearGradient>
<path class="st89" d="M4.1,10.2h0.7c0,0,0.1,0,0.1,0.1V11c0,0,0,0.1-0.1,0.1H4.1c0,0-0.1,0-0.1-0.1L4.1,10.2
	C4.1,10.2,4.1,10.2,4.1,10.2z"/>
<linearGradient id="SVGID_86_" gradientUnits="userSpaceOnUse" x1="3.07" y1="3.1" x2="3.9" y2="3.1" gradientTransform="matrix(1 0 0 -1 0 13.73)">
	<stop  offset="0" style="stop-color:#CCCCCC"/>
	<stop  offset="1" style="stop-color:#F7F7F7"/>
</linearGradient>
<path class="st90" d="M3.1,10.2h0.7c0,0,0,0,0,0.1V11c0,0,0,0.1,0,0.1H3.1c0,0,0,0,0-0.1L3.1,10.2C3.1,10.2,3.1,10.2,3.1,10.2z"/>
<linearGradient id="SVGID_87_" gradientUnits="userSpaceOnUse" x1="2.07" y1="3.1" x2="2.9" y2="3.1" gradientTransform="matrix(1 0 0 -1 0 13.73)">
	<stop  offset="0" style="stop-color:#CCCCCC"/>
	<stop  offset="1" style="stop-color:#F7F7F7"/>
</linearGradient>
<path class="st91" d="M2.1,10.2h0.7c0,0,0,0,0,0.1V11c0,0,0,0.1,0,0.1H2.1c0,0,0,0,0-0.1L2.1,10.2C2.1,10.2,2.1,10.2,2.1,10.2z"/>
<linearGradient id="SVGID_88_" gradientUnits="userSpaceOnUse" x1="1.07" y1="3.1" x2="1.89" y2="3.1" gradientTransform="matrix(1 0 0 -1 0 13.73)">
	<stop  offset="0" style="stop-color:#CCCCCC"/>
	<stop  offset="1" style="stop-color:#F7F7F7"/>
</linearGradient>
<path class="st92" d="M1.1,10.2h0.7c0,0,0,0,0,0.1V11c0,0,0,0.1,0,0.1H1.1c0,0,0,0,0-0.1L1.1,10.2C1.1,10.2,1.1,10.2,1.1,10.2z"/>
<linearGradient id="SVGID_89_" gradientUnits="userSpaceOnUse" x1="14.52" y1="2.62" x2="14.52" y2="3.57" gradientTransform="matrix(1 0 0 -1 0 13.73)">
	<stop  offset="0" style="stop-color:#1A1A1A"/>
	<stop  offset="1" style="stop-color:#595959"/>
</linearGradient>
<path class="st93" d="M14.2,10.2h0.7c0.1,0,0.1,0,0.1,0.1V11c0,0.1,0,0.1-0.1,0.1h-0.7c-0.1,0-0.1,0-0.1-0.1v-0.7
	C14.1,10.2,14.1,10.2,14.2,10.2z"/>
<linearGradient id="SVGID_90_" gradientUnits="userSpaceOnUse" x1="13.52" y1="2.62" x2="13.52" y2="3.57" gradientTransform="matrix(1 0 0 -1 0 13.73)">
	<stop  offset="0" style="stop-color:#1A1A1A"/>
	<stop  offset="1" style="stop-color:#595959"/>
</linearGradient>
<path class="st94" d="M13.2,10.2h0.7c0.1,0,0.1,0,0.1,0.1V11c0,0.1,0,0.1-0.1,0.1h-0.7c-0.1,0-0.1,0-0.1-0.1v-0.7
	C13.1,10.2,13.1,10.2,13.2,10.2z"/>
<linearGradient id="SVGID_91_" gradientUnits="userSpaceOnUse" x1="12.51" y1="2.62" x2="12.51" y2="3.57" gradientTransform="matrix(1 0 0 -1 0 13.73)">
	<stop  offset="0" style="stop-color:#1A1A1A"/>
	<stop  offset="1" style="stop-color:#595959"/>
</linearGradient>
<path class="st95" d="M12.1,10.2h0.7c0.1,0,0.1,0,0.1,0.1V11c0,0.1,0,0.1-0.1,0.1h-0.7c-0.1,0-0.1,0-0.1-0.1v-0.7
	C12,10.2,12.1,10.2,12.1,10.2z"/>
<linearGradient id="SVGID_92_" gradientUnits="userSpaceOnUse" x1="11.51" y1="2.62" x2="11.51" y2="3.57" gradientTransform="matrix(1 0 0 -1 0 13.73)">
	<stop  offset="0" style="stop-color:#1A1A1A"/>
	<stop  offset="1" style="stop-color:#595959"/>
</linearGradient>
<path class="st96" d="M11.1,10.2h0.7c0.1,0,0.1,0,0.1,0.1V11c0,0.1,0,0.1-0.1,0.1h-0.7c-0.1,0-0.1,0-0.1-0.1v-0.7
	C11,10.2,11.1,10.2,11.1,10.2z"/>
<linearGradient id="SVGID_93_" gradientUnits="userSpaceOnUse" x1="14.11" y1="3.1" x2="14.93" y2="3.1" gradientTransform="matrix(1 0 0 -1 0 13.73)">
	<stop  offset="0" style="stop-color:#CCCCCC"/>
	<stop  offset="1" style="stop-color:#F7F7F7"/>
</linearGradient>
<path class="st97" d="M14.2,10.2h0.7c0,0,0.1,0,0.1,0.1V11c0,0,0,0.1-0.1,0.1h-0.7c0,0-0.1,0-0.1-0.1L14.2,10.2
	C14.1,10.2,14.1,10.2,14.2,10.2z"/>
<linearGradient id="SVGID_94_" gradientUnits="userSpaceOnUse" x1="13.1" y1="3.1" x2="13.93" y2="3.1" gradientTransform="matrix(1 0 0 -1 0 13.73)">
	<stop  offset="0" style="stop-color:#CCCCCC"/>
	<stop  offset="1" style="stop-color:#F7F7F7"/>
</linearGradient>
<path class="st98" d="M13.2,10.2h0.7c0,0,0.1,0,0.1,0.1V11c0,0,0,0.1-0.1,0.1h-0.7c0,0-0.1,0-0.1-0.1L13.2,10.2
	C13.1,10.2,13.1,10.2,13.2,10.2z"/>
<linearGradient id="SVGID_95_" gradientUnits="userSpaceOnUse" x1="12.1" y1="3.1" x2="12.93" y2="3.1" gradientTransform="matrix(1 0 0 -1 0 13.73)">
	<stop  offset="0" style="stop-color:#CCCCCC"/>
	<stop  offset="1" style="stop-color:#F7F7F7"/>
</linearGradient>
<path class="st99" d="M12.2,10.2h0.7c0,0,0.1,0,0.1,0.1V11c0,0,0,0.1-0.1,0.1h-0.7c0,0-0.1,0-0.1-0.1L12.2,10.2
	C12.1,10.2,12.1,10.2,12.2,10.2z"/>
<linearGradient id="SVGID_96_" gradientUnits="userSpaceOnUse" x1="11.1" y1="3.1" x2="11.93" y2="3.1" gradientTransform="matrix(1 0 0 -1 0 13.73)">
	<stop  offset="0" style="stop-color:#CCCCCC"/>
	<stop  offset="1" style="stop-color:#F7F7F7"/>
</linearGradient>
<path class="st100" d="M11.2,10.2h0.7c0,0,0.1,0,0.1,0.1V11c0,0,0,0.1-0.1,0.1h-0.7c0,0-0.1,0-0.1-0.1L11.2,10.2
	C11.1,10.2,11.1,10.2,11.2,10.2z"/>
<linearGradient id="SVGID_97_" gradientUnits="userSpaceOnUse" x1="8.005" y1="2.62" x2="8.005" y2="3.58" gradientTransform="matrix(1 0 0 -1 0 13.73)">
	<stop  offset="0" style="stop-color:#1A1A1A"/>
	<stop  offset="1" style="stop-color:#595959"/>
</linearGradient>
<path class="st101" d="M5.1,10.9v-0.4c0-0.1,0.1-0.3,0.3-0.3h5.3c0.1,0,0.3,0.1,0.3,0.3v0.4c0,0.1-0.1,0.3-0.3,0.3H5.3
	C5.2,11.1,5.1,11,5.1,10.9z"/>
<linearGradient id="SVGID_98_" gradientUnits="userSpaceOnUse" x1="8.005" y1="2.68" x2="8.005" y2="3.52" gradientTransform="matrix(1 0 0 -1 0 13.73)">
	<stop  offset="0" style="stop-color:#CCCCCC"/>
	<stop  offset="1" style="stop-color:#F7F7F7"/>
</linearGradient>
<path class="st102" d="M5.3,10.2h5.4c0.1,0,0.2,0.1,0.2,0.2v0.5c0,0.1-0.1,0.2-0.2,0.2H5.3c-0.1,0-0.2-0.1-0.2-0.2v-0.5
	C5.1,10.3,5.2,10.2,5.3,10.2z"/>
<path class="st2" d="M4.6,10.2H4.1l0,0v0.2l0,0h0.7l0,0v-0.2l0,0H4.6z"/>
<path class="st2" d="M3.6,10.2H3.1l0,0v0.2l0,0h0.7l0,0v-0.2l0,0H3.6z"/>
<path class="st2" d="M2.1,10.3v0.2l0,0h0.7l0,0v-0.2l0,0H2.1L2.1,10.3z"/>
<path class="st2" d="M1.1,10.3v0.2l0,0h0.7l0,0v-0.2l0,0H1.1L1.1,10.3z"/>
<path class="st2" d="M14.9,10.2h-0.7l0,0v0.2l0,0h0.7l0,0C14.9,10.5,14.9,10.2,14.9,10.2z"/>
<path class="st2" d="M13.1,10.3v0.2l0,0h0.7l0,0v-0.2l0,0H13.1L13.1,10.3z"/>
<path class="st2" d="M12.7,10.2h-0.6l0,0v0.2l0,0h0.7l0,0v-0.2l0,0C12.9,10.2,12.7,10.2,12.7,10.2z"/>
<path class="st2" d="M11.6,10.2h-0.5l0,0v0.2l0,0h0.7l0,0v-0.2l0,0C11.9,10.2,11.6,10.2,11.6,10.2z"/>
<path class="st2" d="M10.6,10.2H5.2l0,0v0.2l0,0h5.6l0,0v-0.2l0,0H10.6L10.6,10.2z"/>
<linearGradient id="SVGID_99_" gradientUnits="userSpaceOnUse" x1="13.795" y1="3.76" x2="13.795" y2="4.59" gradientTransform="matrix(1 0 0 -1 0 13.73)">
	<stop  offset="0" style="stop-color:#CCCCCC"/>
	<stop  offset="1" style="stop-color:#F7F7F7"/>
</linearGradient>
<path class="st103" d="M12.8,9.1h1.9c0.1,0,0.2,0.1,0.2,0.2v0.5c0,0.1-0.1,0.2-0.2,0.2h-1.9c-0.1,0-0.2-0.1-0.2-0.2V9.3
	C12.7,9.2,12.7,9.1,12.8,9.1z"/>
<linearGradient id="SVGID_100_" gradientUnits="userSpaceOnUse" x1="12" y1="3.7" x2="12" y2="4.64" gradientTransform="matrix(1 0 0 -1 0 13.73)">
	<stop  offset="0" style="stop-color:#1A1A1A"/>
	<stop  offset="1" style="stop-color:#595959"/>
</linearGradient>
<path class="st104" d="M11.6,9.1h0.7c0.1,0,0.1,0,0.1,0.1v0.7c0,0.1,0,0.1-0.1,0.1h-0.7c-0.1,0-0.1,0-0.1-0.1V9.2
	C11.5,9.1,11.6,9.1,11.6,9.1z"/>
<linearGradient id="SVGID_101_" gradientUnits="userSpaceOnUse" x1="11" y1="3.7" x2="11" y2="4.64" gradientTransform="matrix(1 0 0 -1 0 13.73)">
	<stop  offset="0" style="stop-color:#1A1A1A"/>
	<stop  offset="1" style="stop-color:#595959"/>
</linearGradient>
<path class="st105" d="M10.6,9.1h0.7c0.1,0,0.1,0,0.1,0.1v0.7c0,0.1,0,0.1-0.1,0.1h-0.7c-0.1,0-0.1,0-0.1-0.1V9.2
	C10.5,9.1,10.6,9.1,10.6,9.1z"/>
<linearGradient id="SVGID_102_" gradientUnits="userSpaceOnUse" x1="10" y1="3.7" x2="10" y2="4.64" gradientTransform="matrix(1 0 0 -1 0 13.73)">
	<stop  offset="0" style="stop-color:#1A1A1A"/>
	<stop  offset="1" style="stop-color:#595959"/>
</linearGradient>
<path class="st106" d="M9.6,9.1h0.7c0.1,0,0.1,0,0.1,0.1v0.7c0,0.1,0,0.1-0.1,0.1H9.6c-0.1,0-0.1,0-0.1-0.1V9.2
	C9.5,9.1,9.6,9.1,9.6,9.1z"/>
<linearGradient id="SVGID_103_" gradientUnits="userSpaceOnUse" x1="9" y1="3.7" x2="9" y2="4.64" gradientTransform="matrix(1 0 0 -1 0 13.73)">
	<stop  offset="0" style="stop-color:#1A1A1A"/>
	<stop  offset="1" style="stop-color:#595959"/>
</linearGradient>
<path class="st107" d="M8.6,9.1h0.7c0.1,0,0.1,0,0.1,0.1v0.7c0,0.1,0,0.1-0.1,0.1H8.6c-0.1,0-0.1,0-0.1-0.1V9.2
	C8.5,9.1,8.6,9.1,8.6,9.1z"/>
<linearGradient id="SVGID_104_" gradientUnits="userSpaceOnUse" x1="8" y1="3.7" x2="8" y2="4.64" gradientTransform="matrix(1 0 0 -1 0 13.73)">
	<stop  offset="0" style="stop-color:#1A1A1A"/>
	<stop  offset="1" style="stop-color:#595959"/>
</linearGradient>
<path class="st108" d="M7.6,9.1h0.7c0.1,0,0.1,0,0.1,0.1v0.7c0,0.1,0,0.1-0.1,0.1H7.6c-0.1,0-0.1,0-0.1-0.1V9.2
	C7.5,9.1,7.6,9.1,7.6,9.1z"/>
<linearGradient id="SVGID_105_" gradientUnits="userSpaceOnUse" x1="7" y1="3.7" x2="7" y2="4.64" gradientTransform="matrix(1 0 0 -1 0 13.73)">
	<stop  offset="0" style="stop-color:#1A1A1A"/>
	<stop  offset="1" style="stop-color:#595959"/>
</linearGradient>
<path class="st109" d="M6.6,9.1h0.7c0.1,0,0.1,0,0.1,0.1v0.7c0,0.1,0,0.1-0.1,0.1H6.6c-0.1,0-0.1,0-0.1-0.1V9.2
	C6.5,9.1,6.6,9.1,6.6,9.1z"/>
<linearGradient id="SVGID_106_" gradientUnits="userSpaceOnUse" x1="6" y1="3.7" x2="6" y2="4.64" gradientTransform="matrix(1 0 0 -1 0 13.73)">
	<stop  offset="0" style="stop-color:#1A1A1A"/>
	<stop  offset="1" style="stop-color:#595959"/>
</linearGradient>
<path class="st110" d="M5.6,9.1h0.7c0.1,0,0.1,0,0.1,0.1v0.7c0,0.1,0,0.1-0.1,0.1H5.6c-0.1,0-0.1,0-0.1-0.1V9.2
	C5.5,9.1,5.6,9.1,5.6,9.1z"/>
<linearGradient id="SVGID_107_" gradientUnits="userSpaceOnUse" x1="4.99" y1="3.7" x2="4.99" y2="4.64" gradientTransform="matrix(1 0 0 -1 0 13.73)">
	<stop  offset="0" style="stop-color:#1A1A1A"/>
	<stop  offset="1" style="stop-color:#595959"/>
</linearGradient>
<path class="st111" d="M4.6,9.1h0.7c0.1,0,0.1,0,0.1,0.1v0.7c0,0.1,0,0.1-0.1,0.1H4.6c-0.1,0-0.1,0-0.1-0.1V9.2
	C4.5,9.1,4.6,9.1,4.6,9.1z"/>
<linearGradient id="SVGID_108_" gradientUnits="userSpaceOnUse" x1="3.99" y1="3.7" x2="3.99" y2="4.64" gradientTransform="matrix(1 0 0 -1 0 13.73)">
	<stop  offset="0" style="stop-color:#1A1A1A"/>
	<stop  offset="1" style="stop-color:#595959"/>
</linearGradient>
<path class="st112" d="M3.6,9.1h0.7c0.1,0,0.1,0,0.1,0.1v0.7c0,0.1,0,0.1-0.1,0.1H3.6c-0.1,0-0.1,0-0.1-0.1V9.2
	C3.5,9.1,3.6,9.1,3.6,9.1z"/>
<linearGradient id="SVGID_109_" gradientUnits="userSpaceOnUse" x1="11.59" y1="4.17" x2="12.42" y2="4.17" gradientTransform="matrix(1 0 0 -1 0 13.73)">
	<stop  offset="0" style="stop-color:#CCCCCC"/>
	<stop  offset="1" style="stop-color:#F7F7F7"/>
</linearGradient>
<path class="st113" d="M11.6,9.2h0.7c0,0,0.1,0,0.1,0.1v0.7c0,0,0,0.1-0.1,0.1h-0.7c0,0-0.1,0-0.1-0.1L11.6,9.2
	C11.6,9.2,11.6,9.2,11.6,9.2z"/>
<linearGradient id="SVGID_110_" gradientUnits="userSpaceOnUse" x1="10.59" y1="4.17" x2="11.42" y2="4.17" gradientTransform="matrix(1 0 0 -1 0 13.73)">
	<stop  offset="0" style="stop-color:#CCCCCC"/>
	<stop  offset="1" style="stop-color:#F7F7F7"/>
</linearGradient>
<path class="st114" d="M10.6,9.2h0.7c0,0,0.1,0,0.1,0.1v0.7c0,0,0,0.1-0.1,0.1h-0.7c0,0-0.1,0-0.1-0.1L10.6,9.2
	C10.6,9.2,10.6,9.2,10.6,9.2z"/>
<linearGradient id="SVGID_111_" gradientUnits="userSpaceOnUse" x1="9.59" y1="4.17" x2="10.41" y2="4.17" gradientTransform="matrix(1 0 0 -1 0 13.73)">
	<stop  offset="0" style="stop-color:#CCCCCC"/>
	<stop  offset="1" style="stop-color:#F7F7F7"/>
</linearGradient>
<path class="st115" d="M9.6,9.2h0.7c0,0,0.1,0,0.1,0.1v0.7c0,0,0,0.1-0.1,0.1H9.6c0,0-0.1,0-0.1-0.1L9.6,9.2
	C9.6,9.2,9.6,9.2,9.6,9.2z"/>
<linearGradient id="SVGID_112_" gradientUnits="userSpaceOnUse" x1="8.59" y1="4.17" x2="9.41" y2="4.17" gradientTransform="matrix(1 0 0 -1 0 13.73)">
	<stop  offset="0" style="stop-color:#CCCCCC"/>
	<stop  offset="1" style="stop-color:#F7F7F7"/>
</linearGradient>
<path class="st116" d="M8.6,9.2h0.7c0,0,0.1,0,0.1,0.1v0.7c0,0,0,0.1-0.1,0.1H8.6c0,0-0.1,0-0.1-0.1L8.6,9.2
	C8.6,9.2,8.6,9.2,8.6,9.2z"/>
<linearGradient id="SVGID_113_" gradientUnits="userSpaceOnUse" x1="7.59" y1="4.17" x2="8.41" y2="4.17" gradientTransform="matrix(1 0 0 -1 0 13.73)">
	<stop  offset="0" style="stop-color:#CCCCCC"/>
	<stop  offset="1" style="stop-color:#F7F7F7"/>
</linearGradient>
<path class="st117" d="M7.6,9.2h0.7c0,0,0.1,0,0.1,0.1v0.7c0,0,0,0.1-0.1,0.1H7.6c0,0-0.1,0-0.1-0.1L7.6,9.2
	C7.6,9.2,7.6,9.2,7.6,9.2z"/>
<linearGradient id="SVGID_114_" gradientUnits="userSpaceOnUse" x1="6.59" y1="4.17" x2="7.41" y2="4.17" gradientTransform="matrix(1 0 0 -1 0 13.73)">
	<stop  offset="0" style="stop-color:#CCCCCC"/>
	<stop  offset="1" style="stop-color:#F7F7F7"/>
</linearGradient>
<path class="st118" d="M6.6,9.2h0.7c0,0,0.1,0,0.1,0.1v0.7c0,0,0,0.1-0.1,0.1H6.6c0,0-0.1,0-0.1-0.1L6.6,9.2
	C6.6,9.2,6.6,9.2,6.6,9.2z"/>
<linearGradient id="SVGID_115_" gradientUnits="userSpaceOnUse" x1="5.59" y1="4.17" x2="6.41" y2="4.17" gradientTransform="matrix(1 0 0 -1 0 13.73)">
	<stop  offset="0" style="stop-color:#CCCCCC"/>
	<stop  offset="1" style="stop-color:#F7F7F7"/>
</linearGradient>
<path class="st119" d="M5.6,9.2h0.7c0,0,0.1,0,0.1,0.1v0.7c0,0,0,0.1-0.1,0.1H5.6c0,0-0.1,0-0.1-0.1L5.6,9.2
	C5.6,9.2,5.6,9.2,5.6,9.2z"/>
<linearGradient id="SVGID_116_" gradientUnits="userSpaceOnUse" x1="4.58" y1="4.17" x2="5.41" y2="4.17" gradientTransform="matrix(1 0 0 -1 0 13.73)">
	<stop  offset="0" style="stop-color:#CCCCCC"/>
	<stop  offset="1" style="stop-color:#F7F7F7"/>
</linearGradient>
<path class="st120" d="M4.6,9.2h0.7c0,0,0.1,0,0.1,0.1v0.7c0,0,0,0.1-0.1,0.1H4.6c0,0-0.1,0-0.1-0.1L4.6,9.2
	C4.6,9.2,4.6,9.2,4.6,9.2z"/>
<linearGradient id="SVGID_117_" gradientUnits="userSpaceOnUse" x1="3.58" y1="4.17" x2="4.41" y2="4.17" gradientTransform="matrix(1 0 0 -1 0 13.73)">
	<stop  offset="0" style="stop-color:#CCCCCC"/>
	<stop  offset="1" style="stop-color:#F7F7F7"/>
</linearGradient>
<path class="st121" d="M3.6,9.2h0.7c0,0,0.1,0,0.1,0.1v0.7c0,0,0,0.1-0.1,0.1H3.6c0,0,0,0,0-0.1L3.6,9.2C3.6,9.2,3.6,9.2,3.6,9.2z"
	/>
<path class="st2" d="M1.1,9.4h2.2l0,0V9.2l0,0H1.1l0,0L1.1,9.4L1.1,9.4z"/>
<path class="st2" d="M12.7,9.2L12.7,9.2v0.2l0,0h2.2l0,0V9.2l0,0L12.7,9.2L12.7,9.2z"/>
<path class="st2" d="M11.6,9.2L11.6,9.2v0.2l0,0h0.7l0,0V9.2l0,0L11.6,9.2L11.6,9.2z"/>
<path class="st2" d="M10.6,9.2L10.6,9.2v0.2l0,0h0.7l0,0V9.2l0,0L10.6,9.2L10.6,9.2z"/>
<path class="st2" d="M9.6,9.2L9.6,9.2v0.2l0,0h0.7l0,0V9.2l0,0L9.6,9.2L9.6,9.2z"/>
<path class="st2" d="M8.6,9.2L8.6,9.2v0.2l0,0h0.7l0,0V9.2l0,0L8.6,9.2L8.6,9.2z"/>
<path class="st2" d="M7.6,9.2L7.6,9.2v0.2l0,0h0.7l0,0V9.2l0,0L7.6,9.2L7.6,9.2z"/>
<path class="st2" d="M6.6,9.2L6.6,9.2v0.2l0,0h0.7l0,0V9.2l0,0L6.6,9.2L6.6,9.2z"/>
<path class="st2" d="M5.6,9.2L5.6,9.2v0.2l0,0h0.7l0,0V9.2l0,0L5.6,9.2L5.6,9.2z"/>
<path class="st2" d="M4.6,9.2L4.6,9.2v0.2l0,0h0.7l0,0V9.2l0,0L4.6,9.2L4.6,9.2z"/>
<path class="st2" d="M3.6,9.2L3.6,9.2v0.2l0,0h0.7l0,0V9.2l0,0L3.6,9.2L3.6,9.2z"/>
<linearGradient id="SVGID_118_" gradientUnits="userSpaceOnUse" x1="1.725" y1="5.84" x2="1.725" y2="6.8" gradientTransform="matrix(1 0 0 -1 0 13.73)">
	<stop  offset="0" style="stop-color:#1A1A1A"/>
	<stop  offset="1" style="stop-color:#595959"/>
</linearGradient>
<path class="st122" d="M1,7.6V7.2c0-0.1,0.1-0.3,0.3-0.3h0.9c0.1,0,0.3,0.1,0.3,0.3v0.4c0,0.1-0.1,0.3-0.3,0.3H1.3
	C1.1,7.9,1,7.8,1,7.6z"/>
<linearGradient id="SVGID_119_" gradientUnits="userSpaceOnUse" x1="1.725" y1="5.9" x2="1.725" y2="6.74" gradientTransform="matrix(1 0 0 -1 0 13.73)">
	<stop  offset="0" style="stop-color:#CCCCCC"/>
	<stop  offset="1" style="stop-color:#F7F7F7"/>
</linearGradient>
<path class="st123" d="M1.2,7h1c0.1,0,0.2,0.1,0.2,0.2v0.5c0,0.1-0.1,0.2-0.2,0.2h-1c-0.1,0-0.1-0.1-0.1-0.2V7.1
	C1.1,7.1,1.1,7,1.2,7z"/>
<linearGradient id="SVGID_120_" gradientUnits="userSpaceOnUse" x1="13" y1="5.85" x2="13" y2="6.79" gradientTransform="matrix(1 0 0 -1 0 13.73)">
	<stop  offset="0" style="stop-color:#1A1A1A"/>
	<stop  offset="1" style="stop-color:#595959"/>
</linearGradient>
<path class="st124" d="M12.6,6.9h0.7c0.1,0,0.1,0,0.1,0.1v0.7c0,0.1,0,0.1-0.1,0.1h-0.7c-0.1,0-0.1,0-0.1-0.1V7.1
	C12.5,7,12.6,6.9,12.6,6.9z"/>
<linearGradient id="SVGID_121_" gradientUnits="userSpaceOnUse" x1="12" y1="5.85" x2="12" y2="6.79" gradientTransform="matrix(1 0 0 -1 0 13.73)">
	<stop  offset="0" style="stop-color:#1A1A1A"/>
	<stop  offset="1" style="stop-color:#595959"/>
</linearGradient>
<path class="st125" d="M11.6,6.9h0.7c0.1,0,0.1,0,0.1,0.1v0.7c0,0.1,0,0.1-0.1,0.1h-0.7c-0.1,0-0.1,0-0.1-0.1V7.1
	C11.5,7,11.6,6.9,11.6,6.9z"/>
<linearGradient id="SVGID_122_" gradientUnits="userSpaceOnUse" x1="11" y1="5.85" x2="11" y2="6.79" gradientTransform="matrix(1 0 0 -1 0 13.73)">
	<stop  offset="0" style="stop-color:#1A1A1A"/>
	<stop  offset="1" style="stop-color:#595959"/>
</linearGradient>
<path class="st126" d="M10.6,6.9h0.7c0.1,0,0.1,0,0.1,0.1v0.7c0,0.1,0,0.1-0.1,0.1h-0.7c-0.1,0-0.1,0-0.1-0.1V7.1
	C10.5,7,10.6,6.9,10.6,6.9z"/>
<linearGradient id="SVGID_123_" gradientUnits="userSpaceOnUse" x1="10" y1="5.85" x2="10" y2="6.79" gradientTransform="matrix(1 0 0 -1 0 13.73)">
	<stop  offset="0" style="stop-color:#1A1A1A"/>
	<stop  offset="1" style="stop-color:#595959"/>
</linearGradient>
<path class="st127" d="M9.6,6.9h0.7c0.1,0,0.1,0,0.1,0.1v0.7c0,0.1,0,0.1-0.1,0.1H9.6c-0.1,0-0.1,0-0.1-0.1V7.1
	C9.5,7,9.6,6.9,9.6,6.9z"/>
<linearGradient id="SVGID_124_" gradientUnits="userSpaceOnUse" x1="9" y1="5.85" x2="9" y2="6.79" gradientTransform="matrix(1 0 0 -1 0 13.73)">
	<stop  offset="0" style="stop-color:#1A1A1A"/>
	<stop  offset="1" style="stop-color:#595959"/>
</linearGradient>
<path class="st128" d="M8.6,6.9h0.7c0.1,0,0.1,0,0.1,0.1v0.7c0,0.1,0,0.1-0.1,0.1H8.6c-0.1,0-0.1,0-0.1-0.1V7.1
	C8.5,7,8.6,6.9,8.6,6.9z"/>
<linearGradient id="SVGID_125_" gradientUnits="userSpaceOnUse" x1="8" y1="5.85" x2="8" y2="6.79" gradientTransform="matrix(1 0 0 -1 0 13.73)">
	<stop  offset="0" style="stop-color:#1A1A1A"/>
	<stop  offset="1" style="stop-color:#595959"/>
</linearGradient>
<path class="st129" d="M7.6,6.9h0.7c0.1,0,0.1,0,0.1,0.1v0.7c0,0.1,0,0.1-0.1,0.1H7.6c-0.1,0-0.1,0-0.1-0.1V7.1
	C7.5,7,7.6,6.9,7.6,6.9z"/>
<linearGradient id="SVGID_126_" gradientUnits="userSpaceOnUse" x1="7" y1="5.85" x2="7" y2="6.79" gradientTransform="matrix(1 0 0 -1 0 13.73)">
	<stop  offset="0" style="stop-color:#1A1A1A"/>
	<stop  offset="1" style="stop-color:#595959"/>
</linearGradient>
<path class="st130" d="M6.6,6.9h0.7c0.1,0,0.1,0,0.1,0.1v0.7c0,0.1,0,0.1-0.1,0.1H6.6c-0.1,0-0.1,0-0.1-0.1V7.1
	C6.5,7,6.6,6.9,6.6,6.9z"/>
<linearGradient id="SVGID_127_" gradientUnits="userSpaceOnUse" x1="6" y1="5.85" x2="6" y2="6.79" gradientTransform="matrix(1 0 0 -1 0 13.73)">
	<stop  offset="0" style="stop-color:#1A1A1A"/>
	<stop  offset="1" style="stop-color:#595959"/>
</linearGradient>
<path class="st131" d="M5.6,6.9h0.7c0.1,0,0.1,0,0.1,0.1v0.7c0,0.1,0,0.1-0.1,0.1H5.6c-0.1,0-0.1,0-0.1-0.1V7.1
	C5.5,7,5.6,6.9,5.6,6.9z"/>
<linearGradient id="SVGID_128_" gradientUnits="userSpaceOnUse" x1="4.99" y1="5.85" x2="4.99" y2="6.79" gradientTransform="matrix(1 0 0 -1 0 13.73)">
	<stop  offset="0" style="stop-color:#1A1A1A"/>
	<stop  offset="1" style="stop-color:#595959"/>
</linearGradient>
<path class="st132" d="M4.6,6.9h0.7c0.1,0,0.1,0,0.1,0.1v0.7c0,0.1,0,0.1-0.1,0.1H4.6c-0.1,0-0.1,0-0.1-0.1V7.1
	C4.5,7,4.6,6.9,4.6,6.9z"/>
<linearGradient id="SVGID_129_" gradientUnits="userSpaceOnUse" x1="3.99" y1="5.85" x2="3.99" y2="6.79" gradientTransform="matrix(1 0 0 -1 0 13.73)">
	<stop  offset="0" style="stop-color:#1A1A1A"/>
	<stop  offset="1" style="stop-color:#595959"/>
</linearGradient>
<path class="st133" d="M3.6,6.9h0.7c0.1,0,0.1,0,0.1,0.1v0.7c0,0.1,0,0.1-0.1,0.1H3.6c-0.1,0-0.1,0-0.1-0.1V7.1
	C3.5,7,3.6,6.9,3.6,6.9z"/>
<linearGradient id="SVGID_130_" gradientUnits="userSpaceOnUse" x1="2.99" y1="5.85" x2="2.99" y2="6.79" gradientTransform="matrix(1 0 0 -1 0 13.73)">
	<stop  offset="0" style="stop-color:#1A1A1A"/>
	<stop  offset="1" style="stop-color:#595959"/>
</linearGradient>
<path class="st134" d="M2.6,6.9h0.7c0.1,0,0.1,0,0.1,0.1v0.7c0,0.1,0,0.1-0.1,0.1H2.6c-0.1,0-0.1,0-0.1-0.1V7.1
	C2.5,7,2.6,6.9,2.6,6.9z"/>
<linearGradient id="SVGID_131_" gradientUnits="userSpaceOnUse" x1="12.59" y1="6.32" x2="13.42" y2="6.32" gradientTransform="matrix(1 0 0 -1 0 13.73)">
	<stop  offset="0" style="stop-color:#CCCCCC"/>
	<stop  offset="1" style="stop-color:#F7F7F7"/>
</linearGradient>
<path class="st135" d="M12.6,7h0.7c0,0,0.1,0,0.1,0.1v0.7c0,0,0,0.1-0.1,0.1h-0.7c0,0-0.1,0-0.1-0.1L12.6,7C12.6,7,12.6,7,12.6,7z"
	/>
<linearGradient id="SVGID_132_" gradientUnits="userSpaceOnUse" x1="11.59" y1="6.32" x2="12.42" y2="6.32" gradientTransform="matrix(1 0 0 -1 0 13.73)">
	<stop  offset="0" style="stop-color:#CCCCCC"/>
	<stop  offset="1" style="stop-color:#F7F7F7"/>
</linearGradient>
<path class="st136" d="M11.6,7h0.7c0,0,0.1,0,0.1,0.1v0.7c0,0,0,0.1-0.1,0.1h-0.7c0,0-0.1,0-0.1-0.1L11.6,7C11.6,7,11.6,7,11.6,7z"
	/>
<linearGradient id="SVGID_133_" gradientUnits="userSpaceOnUse" x1="10.59" y1="6.32" x2="11.42" y2="6.32" gradientTransform="matrix(1 0 0 -1 0 13.73)">
	<stop  offset="0" style="stop-color:#CCCCCC"/>
	<stop  offset="1" style="stop-color:#F7F7F7"/>
</linearGradient>
<path class="st137" d="M10.6,7h0.7c0,0,0.1,0,0.1,0.1v0.7c0,0,0,0.1-0.1,0.1h-0.7c0,0-0.1,0-0.1-0.1L10.6,7C10.6,7,10.6,7,10.6,7z"
	/>
<linearGradient id="SVGID_134_" gradientUnits="userSpaceOnUse" x1="9.59" y1="6.32" x2="10.41" y2="6.32" gradientTransform="matrix(1 0 0 -1 0 13.73)">
	<stop  offset="0" style="stop-color:#CCCCCC"/>
	<stop  offset="1" style="stop-color:#F7F7F7"/>
</linearGradient>
<path class="st138" d="M9.6,7h0.7c0,0,0.1,0,0.1,0.1v0.7c0,0,0,0.1-0.1,0.1H9.6c0,0-0.1,0-0.1-0.1L9.6,7C9.6,7,9.6,7,9.6,7z"/>
<linearGradient id="SVGID_135_" gradientUnits="userSpaceOnUse" x1="8.59" y1="6.32" x2="9.41" y2="6.32" gradientTransform="matrix(1 0 0 -1 0 13.73)">
	<stop  offset="0" style="stop-color:#CCCCCC"/>
	<stop  offset="1" style="stop-color:#F7F7F7"/>
</linearGradient>
<path class="st139" d="M8.6,7h0.7c0,0,0.1,0,0.1,0.1v0.7c0,0,0,0.1-0.1,0.1H8.6c0,0-0.1,0-0.1-0.1L8.6,7C8.6,7,8.6,7,8.6,7z"/>
<linearGradient id="SVGID_136_" gradientUnits="userSpaceOnUse" x1="7.59" y1="6.32" x2="8.41" y2="6.32" gradientTransform="matrix(1 0 0 -1 0 13.73)">
	<stop  offset="0" style="stop-color:#CCCCCC"/>
	<stop  offset="1" style="stop-color:#F7F7F7"/>
</linearGradient>
<path class="st140" d="M7.6,7h0.7c0,0,0.1,0,0.1,0.1v0.7c0,0,0,0.1-0.1,0.1H7.6c0,0-0.1,0-0.1-0.1L7.6,7C7.6,7,7.6,7,7.6,7z"/>
<linearGradient id="SVGID_137_" gradientUnits="userSpaceOnUse" x1="6.59" y1="6.32" x2="7.41" y2="6.32" gradientTransform="matrix(1 0 0 -1 0 13.73)">
	<stop  offset="0" style="stop-color:#CCCCCC"/>
	<stop  offset="1" style="stop-color:#F7F7F7"/>
</linearGradient>
<path class="st141" d="M6.6,7h0.7c0,0,0.1,0,0.1,0.1v0.7c0,0,0,0.1-0.1,0.1H6.6c0,0-0.1,0-0.1-0.1L6.6,7C6.6,7,6.6,7,6.6,7z"/>
<linearGradient id="SVGID_138_" gradientUnits="userSpaceOnUse" x1="5.59" y1="6.32" x2="6.41" y2="6.32" gradientTransform="matrix(1 0 0 -1 0 13.73)">
	<stop  offset="0" style="stop-color:#CCCCCC"/>
	<stop  offset="1" style="stop-color:#F7F7F7"/>
</linearGradient>
<path class="st142" d="M5.6,7h0.7c0,0,0.1,0,0.1,0.1v0.7c0,0,0,0.1-0.1,0.1H5.6c0,0-0.1,0-0.1-0.1L5.6,7C5.6,7,5.6,7,5.6,7z"/>
<linearGradient id="SVGID_139_" gradientUnits="userSpaceOnUse" x1="4.58" y1="6.32" x2="5.41" y2="6.32" gradientTransform="matrix(1 0 0 -1 0 13.73)">
	<stop  offset="0" style="stop-color:#CCCCCC"/>
	<stop  offset="1" style="stop-color:#F7F7F7"/>
</linearGradient>
<path class="st143" d="M4.6,7h0.7c0,0,0.1,0,0.1,0.1v0.7c0,0,0,0.1-0.1,0.1H4.6c0,0-0.1,0-0.1-0.1L4.6,7C4.6,7,4.6,7,4.6,7z"/>
<linearGradient id="SVGID_140_" gradientUnits="userSpaceOnUse" x1="3.58" y1="6.32" x2="4.41" y2="6.32" gradientTransform="matrix(1 0 0 -1 0 13.73)">
	<stop  offset="0" style="stop-color:#CCCCCC"/>
	<stop  offset="1" style="stop-color:#F7F7F7"/>
</linearGradient>
<path class="st144" d="M3.6,7h0.7c0,0,0.1,0,0.1,0.1v0.7c0,0,0,0.1-0.1,0.1H3.6c0,0,0,0,0-0.1L3.6,7C3.6,7,3.6,7,3.6,7z"/>
<linearGradient id="SVGID_141_" gradientUnits="userSpaceOnUse" x1="2.58" y1="6.32" x2="3.41" y2="6.32" gradientTransform="matrix(1 0 0 -1 0 13.73)">
	<stop  offset="0" style="stop-color:#CCCCCC"/>
	<stop  offset="1" style="stop-color:#F7F7F7"/>
</linearGradient>
<path class="st145" d="M2.6,7h0.7c0,0,0,0,0,0.1v0.7c0,0,0,0.1,0,0.1H2.6c0,0,0,0,0-0.1L2.6,7C2.6,7,2.6,7,2.6,7z"/>
<path class="st2" d="M1.1,7.2h1.2l0,0V7l0,0H1.1l0,0V7.2L1.1,7.2z"/>
<path class="st2" d="M12.6,7L12.6,7v0.3l0,0h0.7l0,0V7l0,0H12.6L12.6,7z"/>
<path class="st2" d="M11.6,7L11.6,7v0.3l0,0h0.7l0,0V7l0,0H11.6L11.6,7z"/>
<path class="st2" d="M10.6,7L10.6,7v0.3l0,0h0.7l0,0V7l0,0H10.6L10.6,7z"/>
<path class="st2" d="M9.6,7L9.6,7v0.3l0,0h0.7l0,0V7l0,0H9.6z"/>
<path class="st2" d="M8.6,7L8.6,7v0.3l0,0h0.7l0,0V7l0,0H8.6z"/>
<path class="st2" d="M7.6,7L7.6,7v0.3l0,0h0.7l0,0V7l0,0H7.6z"/>
<path class="st2" d="M6.6,7L6.6,7v0.3l0,0h0.7l0,0V7l0,0H6.6z"/>
<path class="st2" d="M5.6,7L5.6,7v0.3l0,0h0.7l0,0V7l0,0H5.6z"/>
<path class="st2" d="M4.6,7L4.6,7v0.3l0,0h0.7l0,0V7l0,0H4.6z"/>
<path class="st2" d="M3.6,7L3.6,7v0.3l0,0h0.7l0,0V7l0,0H3.6z"/>
<path class="st2" d="M2.6,7L2.6,7v0.3l0,0h0.7l0,0V7l0,0H2.6z"/>
<linearGradient id="SVGID_142_" gradientUnits="userSpaceOnUse" x1="1.965" y1="4.77" x2="1.965" y2="5.72" gradientTransform="matrix(1 0 0 -1 0 13.73)">
	<stop  offset="0" style="stop-color:#1A1A1A"/>
	<stop  offset="1" style="stop-color:#595959"/>
</linearGradient>
<path class="st146" d="M1,8.7V8.3C1,8.1,1.1,8,1.3,8h1.4c0.1,0,0.3,0.1,0.3,0.3v0.4C2.9,8.8,2.8,9,2.7,9H1.3C1.1,9,1,8.8,1,8.7z"/>
<linearGradient id="SVGID_143_" gradientUnits="userSpaceOnUse" x1="1.965" y1="4.83" x2="1.965" y2="5.67" gradientTransform="matrix(1 0 0 -1 0 13.73)">
	<stop  offset="0" style="stop-color:#CCCCCC"/>
	<stop  offset="1" style="stop-color:#F7F7F7"/>
</linearGradient>
<path class="st147" d="M1.2,8.1h1.6c0.1,0,0.1,0,0.1,0.1v0.6c0,0.1,0,0.1-0.1,0.1H1.2c-0.1,0-0.1,0-0.1-0.1V8.2
	C1.1,8.1,1.1,8.1,1.2,8.1z"/>
<linearGradient id="SVGID_144_" gradientUnits="userSpaceOnUse" x1="14.035" y1="4.77" x2="14.035" y2="6.8" gradientTransform="matrix(1 0 0 -1 0 13.73)">
	<stop  offset="0" style="stop-color:#1A1A1A"/>
	<stop  offset="1" style="stop-color:#595959"/>
</linearGradient>
<path class="st148" d="M13.2,9c-0.1,0-0.1-0.1-0.1-0.1V8.1c0-0.1,0.1-0.1,0.1-0.1h0.5V7c0-0.1,0.1-0.1,0.1-0.1h1.1
	C14.9,6.9,15,6.9,15,7v1.8C15,8.9,14.9,9,14.9,9L13.2,9z"/>
<linearGradient id="SVGID_145_" gradientUnits="userSpaceOnUse" x1="14.035" y1="4.83" x2="14.035" y2="6.74" gradientTransform="matrix(1 0 0 -1 0 13.73)">
	<stop  offset="0" style="stop-color:#CCCCCC"/>
	<stop  offset="1" style="stop-color:#F7F7F7"/>
</linearGradient>
<path class="st149" d="M13.7,7.1V8c0,0,0,0.1-0.1,0.1h0h-0.5c0,0-0.1,0-0.1,0.1v0v0.7c0,0,0,0.1,0.1,0.1h0h1.7c0,0,0.1,0,0.1-0.1v0
	V7.1c0,0,0-0.1-0.1-0.1L13.7,7.1C13.8,7,13.7,7,13.7,7.1z"/>
<path class="st2" d="M1.1,8.3h1.7l0,0V8.1H1.1l0,0L1.1,8.3L1.1,8.3z"/>
<path class="st2" d="M13.1,8.1v0.2c0,0,0-0.1,0.1-0.1h0h0.5c0,0,0.1,0,0.1-0.1v0V8c0,0,0,0.1-0.1,0.1h0L13.1,8.1
	C13.2,8.1,13.1,8.1,13.1,8.1z"/>
<path class="st2" d="M13.8,7L13.8,7v0.3c0,0,0-0.1,0.1-0.1l0,0h1.1c0,0,0.1,0,0.1,0.1v0V7.1c0,0,0,0,0-0.1H13.8z"/>
<path class="st2" d="M12.1,8.3h0.7l0,0V8.1l0,0h-0.7l0,0L12.1,8.3L12.1,8.3z"/>
<path class="st2" d="M11.1,8.3h0.7l0,0V8.1l0,0h-0.7l0,0L11.1,8.3L11.1,8.3z"/>
<path class="st2" d="M10.1,8.3h0.7l0,0V8.1l0,0h-0.7l0,0L10.1,8.3L10.1,8.3z"/>
<path class="st2" d="M9.1,8.3h0.7l0,0V8.1l0,0H9.1l0,0V8.3L9.1,8.3z"/>
<path class="st2" d="M8.1,8.3h0.7l0,0V8.1l0,0H8.1l0,0V8.3L8.1,8.3z"/>
<path class="st2" d="M7.1,8.3h0.7l0,0V8.1l0,0H7.1l0,0V8.3L7.1,8.3z"/>
<path class="st2" d="M6.1,8.3h0.7l0,0V8.1l0,0H6.1l0,0V8.3L6.1,8.3z"/>
<path class="st2" d="M5.1,8.3h0.7l0,0V8.1l0,0H5.1l0,0V8.3L5.1,8.3z"/>
<path class="st2" d="M4.1,8.3h0.7l0,0V8.1l0,0H4.1l0,0V8.3L4.1,8.3z"/>
<path class="st2" d="M3.1,8.1L3.1,8.1v0.2l0,0h0.7l0,0V8.1l0,0L3.1,8.1z"/>
</svg>
