<?xml version="1.0" encoding="utf-8"?>
<!-- Generator: Adobe Illustrator 21.0.0, SVG Export Plug-In . SVG Version: 6.00 Build 0)  -->
<svg version="1.1" id="katman_1" xmlns="http://www.w3.org/2000/svg" xmlns:xlink="http://www.w3.org/1999/xlink" x="0px" y="0px"
	 viewBox="0 0 16.8 17" style="enable-background:new 0 0 16.8 17;" xml:space="preserve">
<style type="text/css">
	.st0{fill:#333333;}
	.st1{fill:#D9D9D9;}
	.st2{fill:#C6C6C5;}
	.st3{fill:#9C9B9B;}
	.st4{fill:#B1B1B1;}
	.st5{opacity:0.1;fill:#FFFFFF;enable-background:new    ;}
	.st6{opacity:0.4;fill:none;stroke:#25323F;stroke-linecap:round;stroke-linejoin:round;enable-background:new    ;}
	.st7{fill:#E7F0F4;}
	.st8{opacity:0.8;fill:none;stroke:url(#SVGID_1_);stroke-linecap:round;stroke-linejoin:round;enable-background:new    ;}
	.st9{opacity:0.8;fill:none;stroke:url(#SVGID_2_);stroke-linecap:round;stroke-linejoin:round;enable-background:new    ;}
	.st10{opacity:0.8;fill:none;stroke:url(#SVGID_3_);stroke-linecap:round;stroke-linejoin:round;enable-background:new    ;}
	.st11{opacity:0.2;enable-background:new    ;}
	.st12{fill:url(#SVGID_4_);}
	.st13{opacity:0.2;}
	.st14{fill:url(#SVGID_5_);}
	.st15{fill:#39A935;}
	.st16{opacity:0.8;fill:none;stroke:url(#SVGID_6_);stroke-linecap:round;stroke-linejoin:round;enable-background:new    ;}
	.st17{opacity:0.8;fill:none;stroke:url(#SVGID_7_);stroke-linecap:round;stroke-linejoin:round;enable-background:new    ;}
	.st18{opacity:0.8;fill:none;stroke:url(#SVGID_8_);stroke-linecap:round;stroke-linejoin:round;enable-background:new    ;}
	.st19{fill:none;stroke:#494E52;stroke-miterlimit:10;}
	.st20{opacity:0.8;fill:none;stroke:url(#SVGID_9_);stroke-linecap:round;stroke-linejoin:round;enable-background:new    ;}
	.st21{opacity:0.8;fill:none;stroke:url(#SVGID_10_);stroke-linecap:round;stroke-linejoin:round;enable-background:new    ;}
</style>
<title>user-trash-full_5</title>
<path class="st0" d="M4.6,16.1H3.2c-0.1,0-0.3-0.1-0.3-0.2L1,6.1l2.4-1.9l1-3l4.1,1l4.1-1l1,3l2.4,1.9l-0.1,0.4l-1.6,9.4
	c0,0.1-0.1,0.2-0.3,0.2L4.6,16.1z"/>
<polygon id="_Yol_" class="st1" points="2.1,11.6 4.4,11.6 4.4,1.2 3.4,4.2 1,6.1 "/>
<polygon id="_Yol_2" class="st2" points="8.4,6.1 12.4,6.1 12.4,1.2 8.4,2.2 "/>
<polygon id="_Yol_3" class="st1" points="14.7,11.6 12.4,11.6 12.4,1.2 13.4,4.2 15.8,6.1 "/>
<polygon id="_Yol_4" class="st3" points="8.4,6.1 4.4,6.1 4.4,1.2 8.4,2.2 "/>
<polygon id="_Yol_5" class="st4" points="12.4,11.6 12.4,1.2 13.4,4.2 "/>
<polygon id="_Yol_6" class="st4" points="4.4,11.6 4.4,1.2 3.4,4.2 "/>
<polygon class="st5" points="8.4,2.2 8.4,2.6 12.4,1.7 12.4,1.2 "/>
<polygon class="st5" points="8.4,6.1 8.4,6.1 8.4,2.2 4.4,1.2 4.4,1.7 8.4,2.6 "/>
<path class="st6" d="M11.2,7.9c-0.1,0-0.1,0-0.2-0.1V7.7c-0.1-0.2-0.1-0.4-0.2-0.6s-0.2-0.6-0.3-1c0-0.1,0-0.2-0.1-0.2s0-0.1,0-0.2
	c-0.1-0.2-0.2-0.4-0.3-0.6L10,5C9.8,4.7,9.6,4.4,9.5,4.1c-0.1-0.2-0.1-0.5,0-0.7c0-0.1,0-0.2-0.1-0.3c0,0,0-0.1,0-0.1
	c0,0,0-0.1,0.1-0.1l0,0L9.7,3l0.3,0.2h0.1l0,0c0.2,0.1,0.4,0.2,0.5,0.3c0.2,0.1,0.4,0.2,0.6,0.3C11.5,3.9,11.7,4,12,4.1l0.2,0.1
	c0.2,0.1,0.5,0.2,0.8,0.4c0.1,0,0.1,0,0.2,0h0.1l0.4,0.2c0.1,0,0.1,0.1,0.1,0.1c0,0.1,0,0.1,0,0.2l-0.6,1.2L13,6.6l-0.2,0.3l0,0l0,0
	c0.1-0.1,0.1-0.2,0.2-0.3l0.6-1.1L13.9,5l0.3,0.3l0,0C14.1,5.4,14,5.6,14,5.7c-0.1,0.3-0.3,0.5-0.4,0.8l-0.2,0.2L13.1,7
	c-0.1,0.1-0.2,0.3-0.3,0.4c0,0.1-0.1,0.1-0.2,0.1l0,0l-0.9,0.1l0,0l-0.4,0.1L11.2,7.9z"/>
<path class="st7" d="M13.9,5.1l0.2,0.2c-0.2,0.4-0.4,0.8-0.6,1.2c-0.1,0.2-0.3,0.4-0.4,0.6c-0.1,0.1-0.2,0.3-0.3,0.4
	c0,0.1-0.1,0.1-0.2,0.1l-1,0.2l-0.4,0.1c0,0,0,0-0.1,0c-0.1-0.2-0.2-0.4-0.2-0.7s-0.2-0.7-0.3-1c0-0.2-0.1-0.3-0.1-0.5
	C10.4,5.4,10.2,5.2,10,5C9.8,4.7,9.7,4.4,9.6,4.1c-0.1-0.2-0.1-0.4,0-0.7c0.1-0.1,0.1-0.3,0-0.4c0-0.1,0-0.1,0-0.1l0,0L10,3.2h0.1
	c0.2,0.1,0.4,0.1,0.5,0.2c0.2,0.1,0.4,0.2,0.6,0.3c0.3,0.1,0.6,0.3,0.9,0.5c0.2,0.1,0.5,0.2,0.8,0.4c0.1,0,0.2,0.1,0.3,0.1l0.4,0.2
	c0.1,0,0.1,0.1,0.1,0.2c0,0,0,0,0,0l-0.6,1.2l-0.3,0.6c0,0,0,0.1,0,0.1c0.1,0,0.1,0,0.2-0.1s0.1-0.2,0.2-0.3l0.7-1.3L13.9,5.1z"/>
<linearGradient id="SVGID_1_" gradientUnits="userSpaceOnUse" x1="11.8384" y1="9.5" x2="11.8384" y2="15.18" gradientTransform="matrix(1 0 0 -1 0 17.73)">
	<stop  offset="0" style="stop-color:#FFFFFF;stop-opacity:0.39"/>
	<stop  offset="0.12" style="stop-color:#FFFFFF;stop-opacity:0.16"/>
	<stop  offset="0.5" style="stop-color:#FFFFFF;stop-opacity:0.24"/>
	<stop  offset="1" style="stop-color:#FFFFFF"/>
</linearGradient>
<path class="st8" d="M11.1,7.6c-0.1-0.2-0.1-0.4-0.2-0.6s-0.2-0.6-0.3-1c0-0.1,0-0.2-0.1-0.2s0-0.2,0-0.2c-0.1-0.2-0.2-0.4-0.4-0.6
	V4.9C10,4.7,9.8,4.4,9.7,4.1c-0.1-0.2-0.1-0.4,0-0.6c0.1-0.1,0.1-0.3,0-0.4l0,0l0.3,0.2h0.1l0,0c0.2,0.1,0.3,0.1,0.5,0.2
	c0.2,0.1,0.4,0.2,0.6,0.3C11.5,3.9,11.8,4,12,4.2l0.2,0.1c0.2,0.1,0.5,0.2,0.8,0.4c0.1,0,0.1,0,0.2,0h0.1l0.4,0.2l0,0
	c0,0,0,0.1,0,0.1l-0.6,1.2l-0.1,0.3l-0.2,0.3c0,0,0,0.1,0,0.1V7v0.1h0.1h0.1C12.9,7.1,13,7,13,7c0.1-0.1,0.1-0.2,0.2-0.3l0.6-1.1
	l0.1-0.2V5.3L14,5.4c-0.1,0.1-0.1,0.2-0.2,0.3c-0.1,0.3-0.2,0.5-0.4,0.8l-0.2,0.2L13,7c-0.1,0.1-0.2,0.3-0.3,0.4c0,0,0,0-0.1,0l0,0
	l-0.9,0.1l0,0l-0.4,0.1L11.1,7.6z"/>
<path class="st6" d="M7.2,8.3H7c-0.3,0-0.6,0-1-0.1L5.2,8.1L4.9,8l0,0H4.7C4.7,8,4.6,8,4.6,7.9C4.5,7.7,4.4,7.4,4.3,7.2L4.2,7
	c0-0.1-0.1-0.2-0.1-0.3L3.9,6.4L3.9,6.3l0,0h0L3.7,6.1C3.6,6.1,3.5,6,3.4,5.9C3.2,5.7,3.2,5.5,3.2,5.3c0-0.2,0-0.5,0-0.7V4.3
	C3.1,3.8,3,3.4,2.8,3C2.8,2.8,2.7,2.6,2.6,2.4L2.6,2.2c0-0.1,0-0.1,0-0.2c0-0.1,0.1-0.1,0.2-0.1L3,1.8c0.2-0.1,0.5-0.2,0.7-0.2
	c0.2,0,0.4-0.1,0.6-0.1h0.2l1-0.1l0.4-0.1c0.4-0.1,0.9-0.2,1.3-0.3l0.7-0.2l0.5-0.1h0.2h0.2h0.1v0.1c0,0.1,0,0.1,0,0.2
	c0,0.6,0.1,1.2,0.3,1.8l0.1,0.2c0,0.1,0.1,0.2,0.1,0.3c0,0.1,0,0.1,0,0.2L8.9,3.9l0,0L8.8,4L8.6,4.3l0.6-0.9h0.1
	c0,0.3,0,0.5,0.1,0.8c0.1,0.2,0.2,0.4,0.4,0.6l0.1,0.1C9.9,5,10,5.2,10.2,5.3c0.1,0.1,0.1,0.3,0.1,0.5c0,0.2,0,0.5,0.1,0.7l0.1,0.4
	l0.1,0.5c0,0.1,0,0.1,0.1,0.2l0.1,0.1c0,0,0,0,0,0.1v0.1h-0.2L10.1,8L9.4,8.1L8.8,8.1H8.2h-1L7.2,8.3z M4.7,5.3L4.7,5.3L4.7,5.3
	C4.5,5.5,4.4,5.6,4.2,5.7l0,0C4.4,5.6,4.6,5.4,4.7,5.3L4.7,5.3z M3.5,4.7c0,0,0,0.1,0,0.2s0,0.2,0,0.3c0,0,0,0.1,0,0.1
	c0-0.1,0-0.1,0-0.2c0,0,0-0.1,0-0.1s0-0.1,0-0.2V4.7z M3.3,2.8c0,0.1,0.1,0.2,0.1,0.4l0,0.2l0,0C3.4,3.2,3.3,3,3.3,2.8z"/>
<path class="st7" d="M10.8,7.8C10.8,7.8,10.8,7.9,10.8,7.8L10.2,8L9.4,8.1L8.8,8.2H8.1c-0.3,0-0.7,0-1,0s-0.7,0-1-0.1L4.9,8H4.8
	c0,0-0.1,0-0.1-0.1C4.6,7.7,4.4,7.4,4.3,7.2C4.3,7,4.2,6.9,4.1,6.7S4,6.3,3.9,6.2C4.3,5.8,4.7,5.4,5,5C4.8,5.1,4.7,5.2,4.6,5.3
	C4.5,5.4,4.3,5.6,4.2,5.7S4,6,3.8,6.1l0,0C3.7,6,3.6,5.9,3.4,5.7C3.3,5.6,3.2,5.4,3.2,5.2c0-0.3,0-0.6,0-0.9c0-0.4-0.2-0.8-0.3-1.2
	C2.8,2.7,2.7,2.5,2.6,2.2c0-0.1,0-0.2,0.1-0.2c0.3-0.1,0.6-0.2,1-0.3C4,1.6,4.2,1.6,4.5,1.5l1.3-0.2c0.7-0.1,1.4-0.4,2.1-0.5
	c0.2-0.1,0.5-0.1,0.8-0.2h0.2c0,0.1,0,0.2,0,0.3c0,0.6,0.1,1.2,0.3,1.9c0,0.2,0.1,0.3,0.1,0.5c0,0,0,0.1,0,0.1L8.9,3.8
	C8.7,4,8.6,4.3,8.4,4.5c0,0.1-0.1,0.2-0.1,0.2c0,0,0,0.1,0,0.1l0.9-1.3c0,0.3,0,0.5,0.1,0.8c0.1,0.2,0.2,0.4,0.4,0.6
	c0.1,0.2,0.3,0.4,0.4,0.6c0.1,0.1,0.1,0.3,0.1,0.4c0,0.2,0,0.5,0.1,0.7c0.1,0.3,0.2,0.6,0.3,0.9C10.6,7.6,10.7,7.7,10.8,7.8z M8.8,5
	c0.3,0.3,0.6,0.5,1,0.6L8.8,5z M3.9,4.3c0.3,0.2,0.6,0.2,0.9,0.2C4.6,4.4,4.2,4.4,3.9,4.3z M3.7,5.5c0-0.1-0.1-0.2-0.1-0.2
	c0-0.1,0-0.2,0-0.3c0-0.2,0-0.4,0-0.5c0-0.1,0-0.2,0-0.3l0,0c0,0.2,0,0.4,0,0.5s0,0.3,0,0.5C3.5,5.3,3.6,5.4,3.7,5.5z M3.5,3.7
	L3.5,3.7c0-0.1,0-0.2,0-0.3c0-0.2-0.1-0.5-0.2-0.7c0-0.1-0.1-0.1-0.2-0.2C3.2,2.9,3.4,3.3,3.5,3.7z"/>
<linearGradient id="SVGID_2_" gradientUnits="userSpaceOnUse" x1="6.6924" y1="9.1" x2="6.6924" y2="17.58" gradientTransform="matrix(1 0 0 -1 0 17.73)">
	<stop  offset="0" style="stop-color:#FFFFFF;stop-opacity:0.39"/>
	<stop  offset="0.12" style="stop-color:#FFFFFF;stop-opacity:0.16"/>
	<stop  offset="0.5" style="stop-color:#FFFFFF;stop-opacity:0.24"/>
	<stop  offset="1" style="stop-color:#FFFFFF"/>
</linearGradient>
<path class="st9" d="M7.2,8.1H7c-0.3,0-0.6,0-1-0.1L5.2,8H4.9H4.8H4.7L4.4,7.3L4.3,7.1c0-0.1-0.1-0.2-0.1-0.3S4.1,6.4,4,6.3V6.2
	L4.1,6C4.4,5.7,4.8,5.4,5,5l0.1-0.2L4.9,5C4.8,5.1,4.6,5.2,4.5,5.3l0,0C4.4,5.4,4.3,5.5,4.2,5.7L3.9,6L3.8,6.1L3.7,6
	C3.6,5.9,3.5,5.8,3.5,5.7C3.3,5.6,3.3,5.4,3.3,5.2c0-0.2,0-0.5,0-0.7s0-0.2,0-0.3C3.3,3.8,3.2,3.4,3,3C2.9,2.8,2.9,2.6,2.8,2.4
	L2.7,2.2c0,0,0,0,0-0.1c0,0,0-0.1,0-0.1L3,1.9c0.2-0.1,0.5-0.2,0.7-0.2c0.2,0,0.4-0.1,0.5-0.1h0.2l1-0.1l0.4-0.1
	C6.2,1.3,6.7,1.2,7.1,1l0.7-0.2l0.5-0.1h0.2h0.1l0,0c0,0.1,0,0.1,0,0.2c0,0.6,0.1,1.2,0.3,1.8l0.1,0.2c0,0.1,0.1,0.2,0.1,0.3
	c0,0,0,0,0,0.1L8.8,3.7l0,0L8.7,4L8.4,4.4c0,0.1-0.1,0.1-0.1,0.2l0,0c0,0,0,0.1,0,0.1V5l0.9-1.3c0,0.2,0,0.4,0.1,0.6
	c0.1,0.2,0.2,0.4,0.4,0.6L9.7,5c0.1,0.2,0.3,0.4,0.4,0.5c0.1,0.1,0.1,0.3,0.1,0.4c0,0.2,0.1,0.5,0.1,0.7L10.4,7l0.1,0.5
	c0,0.1,0.1,0.1,0.1,0.2v0.1l0,0h-0.1L10.1,8L9.4,8L8.8,8.1H8.2L7.2,8.1L7.2,8.1z M3.5,4v0.2c0,0.1,0,0.2,0,0.4s0,0.2,0,0.2
	s0,0.2,0,0.3c0,0.2,0.1,0.4,0.3,0.4h0.1V5.4V5.4c0,0,0-0.1,0-0.1c0-0.1,0-0.2,0-0.2c0,0,0-0.1,0-0.1s0-0.1,0-0.2c0-0.1,0-0.2,0-0.4
	c0-0.1,0-0.3,0-0.4v0H3.5z M8.7,5c0.2,0.3,0.6,0.5,1,0.6l0,0h0.2L8.7,4.8L8.7,5z M3.9,4.4c0.3,0.1,0.5,0.2,0.8,0.2l0,0
	c0.1,0,0.1,0,0.2,0L5,4.5H4.9C4.6,4.4,4.3,4.3,4,4.3H3.7L3.9,4.4z M3,2.6C3.1,2.8,3.2,3,3.2,3.2c0,0.2,0.1,0.3,0.2,0.5l0,0h0.1v0
	c0,0,0-0.1,0-0.1c0-0.1,0-0.2,0-0.2c0-0.2-0.1-0.5-0.2-0.7C3.3,2.5,3.2,2.5,3,2.6L3,2.6L3,2.6z"/>
<path class="st6" d="M11.9,4.1c-0.2-0.1-0.4-0.2-0.6-0.3c-0.2-0.1-0.4-0.2-0.6-0.3c-0.2-0.1-0.3-0.2-0.5-0.2l0,0h-0.1L9.7,3L9.6,2.9
	L9.5,3V2.9V3V2.9C9.2,2.3,9.1,1.6,9,0.9V0.9h0.3L10,1c0.1,0,0.3,0,0.4,0c0.3,0,0.5,0,0.8,0.1l0,0h0.2h0.1c0.2,0,0.3,0,0.5,0.1
	c0.2,0.1,0.4,0.1,0.6,0.1l0,0h0.2H13l-0.4,1.2C12.5,3.1,12.3,3.6,11.9,4.1L11.9,4.1L11.9,4.1z"/>
<path class="st7" d="M9.5,2.9L9.5,2.9L9.7,3l0.3,0.2h0.1l0,0c0.2,0.1,0.4,0.2,0.5,0.3c0.2,0.1,0.4,0.2,0.6,0.3
	c0.2,0.1,0.4,0.2,0.6,0.3c0.3-0.4,0.5-0.9,0.7-1.4L13,1.5l-0.3-0.1c-0.2,0-0.5-0.1-0.7-0.2c-0.2-0.1-0.3-0.1-0.5-0.1
	c-0.1,0-0.2,0-0.2,0c-0.3-0.1-0.5-0.1-0.8-0.1C10.3,1.1,10.2,1,10,1L9,0.9c0,0.6,0.2,1.3,0.4,1.9L9.5,2.9L9.5,2.9z"/>
<linearGradient id="SVGID_3_" gradientUnits="userSpaceOnUse" x1="10.97" y1="13.25" x2="10.97" y2="17.24" gradientTransform="matrix(1 0 0 -1 0 17.73)">
	<stop  offset="0" style="stop-color:#FFFFFF;stop-opacity:0.39"/>
	<stop  offset="0.12" style="stop-color:#FFFFFF;stop-opacity:0.16"/>
	<stop  offset="0.5" style="stop-color:#FFFFFF;stop-opacity:0.24"/>
	<stop  offset="1" style="stop-color:#FFFFFF"/>
</linearGradient>
<path class="st10" d="M11.9,4c-0.2-0.1-0.4-0.2-0.6-0.3c-0.2-0.1-0.4-0.2-0.6-0.3c-0.2-0.1-0.4-0.2-0.6-0.3l0,0h-0.1L9.8,3L9.6,2.8
	l0,0l0,0C9.3,2.2,9.2,1.6,9.1,1h0.2L10,1.1c0.2,0,0.3,0,0.5,0c0.3,0,0.5,0,0.8,0.1l0,0c0.1,0,0.2,0,0.2,0h0.1c0.1,0,0.3,0,0.4,0.1
	c0.2,0.1,0.4,0.1,0.7,0.2l0,0h0.2l0,0l-0.4,1C12.4,3,12.2,3.5,11.9,4z"/>
<path class="st11" d="M15.2,5.7H4.5H4.4c-0.1,0-0.1,0.1-0.2,0.1L3.4,8L2.6,5.8c0-0.1-0.1-0.2-0.2-0.2H1.6L1,6.2h1.4
	c0.1,0,0.2,0.1,0.2,0.2l0.8,2.1l0.9-2.2c0-0.1,0.1-0.1,0.2-0.1h11.4L15.2,5.7z"/>
<linearGradient id="SVGID_4_" gradientUnits="userSpaceOnUse" x1="6.54" y1="8.9567" x2="-0.3" y2="4.8767" gradientTransform="matrix(1 0 0 -1 0 17.73)">
	<stop  offset="0" style="stop-color:#E7E6E6"/>
	<stop  offset="0.38" style="stop-color:#C8C7C7"/>
	<stop  offset="0.77" style="stop-color:#ADAEAE"/>
	<stop  offset="1" style="stop-color:#A3A4A4"/>
</linearGradient>
<path class="st12" d="M3.2,16h1.3V6.1L3.8,9.3L2.7,6.2c0-0.1-0.1-0.1-0.2-0.2H1l1.9,9.8C2.9,15.9,3,16,3.2,16z"/>
<g class="st13">
	<path d="M2.9,15.8L2.9,15.8l-0.1-0.1l0.1,0.5c0,0.1,0.1,0.2,0.2,0.2h1.3V16H3.2C3,16,3,15.9,2.9,15.8z"/>
</g>
<linearGradient id="SVGID_5_" gradientUnits="userSpaceOnUse" x1="2.1" y1="6.66" x2="15.77" y2="6.66" gradientTransform="matrix(1 0 0 -1 0 17.73)">
	<stop  offset="0" style="stop-color:#A3A4A4"/>
	<stop  offset="4.000000e-02" style="stop-color:#A7A8A8"/>
	<stop  offset="8.000000e-02" style="stop-color:#B2B2B2"/>
	<stop  offset="0.12" style="stop-color:#C5C5C5"/>
	<stop  offset="0.16" style="stop-color:#DFDEDE"/>
	<stop  offset="0.17" style="stop-color:#E7E6E6"/>
	<stop  offset="0.58" style="stop-color:#E5E4E4"/>
	<stop  offset="0.72" style="stop-color:#DEDEDE"/>
	<stop  offset="0.83" style="stop-color:#D3D2D2"/>
	<stop  offset="0.91" style="stop-color:#C2C2C2"/>
	<stop  offset="0.98" style="stop-color:#ACADAD"/>
	<stop  offset="1" style="stop-color:#A5A6A6"/>
</linearGradient>
<path class="st14" d="M15.8,6.1H4.6c-0.1,0-0.2,0.1-0.2,0.2l-2.2,5.4l0.5,2.7L4.4,16c0,0,0.1,0.1,0.2,0.1h9.4c0.1,0,0.2-0.1,0.2-0.2
	L15.8,6.1z"/>
<path class="st11" d="M14.2,15.8L14.2,15.8c0,0.1-0.1,0.2-0.2,0.2H4.6c-0.1,0-0.1,0-0.2,0l-1.8-1.7l0,0H2.5l0.1,0.5l1.8,1.7
	c0,0,0.1,0.1,0.2,0.1h9.4c0.1,0,0.2-0.1,0.2-0.2L14.2,15.8L14.2,15.8z"/>
<path class="st5" d="M4.6,6.6h11.1l0.1-0.5H4.6c-0.1,0-0.2,0.1-0.2,0.2l-2.2,5.4l0.1,0.3l2.2-5.2C4.4,6.6,4.5,6.6,4.6,6.6z"/>
<path class="st5" d="M2.4,6.6c0.1,0,0.2,0.1,0.2,0.2l0.7,1.9l0.1-0.2l0,0L2.7,6.2c0-0.1-0.1-0.1-0.2-0.2H1l0.1,0.5H2.4z"/>
<image style="overflow:visible;opacity:0.75;enable-background:new    ;" width="122" height="79" xlink:href="6D3442A0DF202223.png"  transform="matrix(5.950820e-02 0 0 5.924051e-02 5.28 8.58)">
</image>
<g id="_Grup_">
	<path id="_Yol_7" class="st15" d="M5.7,11.7C5.7,11.7,5.7,11.7,5.7,11.7L5.7,11.7L5.7,11.7z"/>
	<path id="_Yol_8" class="st15" d="M5.8,11.6L5.8,11.6L5.8,11.6C5.8,11.6,5.9,11.6,5.8,11.6C5.9,11.4,5.8,11.6,5.8,11.6z"/>
	<path id="_Yol_9" class="st15" d="M5.9,11.5L5.9,11.5C5.9,11.5,5.9,11.5,5.9,11.5z"/>
	<path id="_Yol_10" class="st15" d="M9.1,10L9.1,10C9,10,9,10.1,9.1,10z"/>
	<path id="_Yol_11" class="st15" d="M9,10L9,10z"/>
	<path id="_Yol_12" class="st15" d="M7.9,10.2c0,0-0.1,0.1-0.1,0.1l0,0c-0.1,0,0,0,0,0.1c-0.1,0-0.1,0.1-0.2,0.1l0,0
		c0,0,0,0.1-0.1,0.1l0,0c-0.2,0.1-0.4,0.3-0.7,0.4l0,0c-0.2,0.1-0.4,0.3-0.6,0.5c0.1-0.1,0.3-0.1,0.4-0.3S6.7,11,6.7,11
		c0.2-0.1,0.2-0.2,0.4-0.3s0,0,0,0L7,10.9h0.1c0,0-0.1,0.1-0.1,0.1s0.3-0.2,0.4-0.3l-0.2,0.1H7.1c0.1-0.1,0.3-0.2,0.5-0.3
		c0,0,0.1-0.1,0.1,0s0,0,0,0s0-0.1,0.1-0.1v0.1c0-0.1,0.1,0,0.2-0.1s0,0-0.1,0.1s0.1,0,0.1-0.1v0.1c0-0.1,0.1,0,0.1,0s0,0,0-0.1
		s0,0,0,0s0,0,0-0.1s0,0,0,0.1c0,0,0.1,0,0.1,0c0,0,0,0,0-0.1s0,0,0.1,0.1l-0.1,0.1l0.1-0.1c0,0,0.1,0,0,0c0.1,0,0.3-0.1,0.4-0.2
		l0,0c0,0,0.1,0,0.1,0s0-0.1,0-0.1c0.1,0,0.1,0,0.2,0l0,0C9,10,9,10,9.1,10s0,0,0,0s0.1,0,0.1,0v0.1c0,0,0.1-0.1,0.1,0
		s0.2-0.1,0.3-0.2l0,0c0-0.1,0.2-0.1,0.2-0.1l0,0l0.1-0.1l0,0c0.1,0,0.1-0.1,0.2-0.1c0,0,0.1-0.1,0.2-0.1c0.4-0.1,0.8-0.3,1.1-0.4
		c0.1,0,0.1,0,0.2-0.1c-0.1,0-0.1,0-0.2,0.1c-0.1,0-0.1,0-0.1,0l0,0c-0.1,0-0.1,0-0.1,0V9c0,0,0,0-0.1,0l0,0c-0.1,0-0.1,0-0.1,0l0,0
		c0,0-0.2,0.1-0.1,0s0,0-0.1,0l0,0c0,0-0.1,0-0.1,0l0,0c-0.2,0.1,0,0.1-0.2,0.2l0,0l0,0h-0.1c0,0.1-0.2,0.1-0.3,0.2s-0.1,0-0.2,0
		l0,0c-0.1,0-0.3,0.1-0.4,0s0,0,0,0s-0.1,0-0.2,0s0.1,0,0,0S9.1,9.4,9,9.5s0,0,0,0C8.9,9.5,8.7,9.6,8.6,9.7L8,9.9l0,0
		c-0.1,0-0.2,0.1-0.2,0.1L7.9,10.2z"/>
	<path id="_Yol_13" class="st15" d="M7,11L7,11L7,11L7,11z"/>
	<polygon id="_Yol_14" class="st15" points="6.9,10.9 6.9,10.9 7,10.9 	"/>
	<polygon id="_Yol_15" class="st15" points="8,10.4 8,10.4 7.8,10.5 	"/>
	<path id="_Yol_16" class="st15" d="M9.1,10.1C9.1,10.1,9.1,10.1,9.1,10.1L9.1,10.1L9.1,10.1z"/>
	<path id="_Yol_17" class="st15" d="M9.8,9.9C9.8,9.8,9.9,9.9,9.8,9.9S9.8,9.8,9.8,9.9z"/>
	<path id="_Yol_18" class="st15" d="M10,9.7L10,9.7C10,9.7,10,9.7,10,9.7z"/>
</g>
<g id="_Grup_2">
	<path id="_Yol_19" class="st15" d="M6,12.3C6,12.3,6,12.3,6,12.3L6,12.3L6,12.3z"/>
	<path id="_Yol_20" class="st15" d="M6.2,12.3L6.2,12.3L6.2,12.3C6.2,12.2,6.2,12.2,6.2,12.3C6.2,12.1,6.2,12.2,6.2,12.3z"/>
	<path id="_Yol_21" class="st15" d="M6.3,12.1C6.4,12.1,6.3,12.1,6.3,12.1S6.3,12.1,6.3,12.1z"/>
	<path id="_Yol_22" class="st15" d="M9.6,10.6L9.6,10.6C9.6,10.6,9.5,10.6,9.6,10.6z"/>
	<path id="_Yol_23" class="st15" d="M9.5,10.6L9.5,10.6z"/>
	<path id="_Yol_24" class="st15" d="M8.3,10.8c0,0-0.1,0.1-0.1,0.1l0,0c-0.1,0,0,0-0.1,0.1C8.1,11,8,11,7.9,11l0,0
		c0,0,0,0.1-0.1,0.1l0,0c-0.2,0.1-0.4,0.3-0.7,0.4l0,0c-0.2,0.1-0.5,0.3-0.7,0.5C6.7,12,6.8,11.9,7,11.8c0.1,0,0.1-0.1,0.2-0.1
		c0.2-0.1,0.2-0.2,0.4-0.3l0,0l-0.1,0.1h0.1c0,0-0.1,0.1-0.1,0.1s0.3-0.2,0.4-0.3l-0.2,0.1H7.5c0.2-0.1,0.3-0.2,0.5-0.3
		c0,0,0.1-0.1,0.1,0s0,0,0,0s0-0.1,0.1-0.1v0c0-0.1,0.1,0,0.2-0.1s0,0-0.1,0.1s0.1-0.1,0.1-0.1V11c0-0.1,0.1,0,0.1,0s0,0,0-0.1
		s0,0,0,0s0,0,0.1-0.1s0,0,0,0.1c0,0,0.1,0,0.1,0c0,0,0,0,0-0.1s0,0,0.1,0.1L8.6,11l0.1-0.1c0,0,0.1,0,0,0c0.1-0.1,0.3-0.1,0.4-0.2
		l0,0c0,0,0.1,0,0.1,0s0-0.1,0-0.1c0.1,0,0.1,0,0.2,0l0,0c0.1,0,0.1,0,0.1-0.1s0,0,0,0s0.1,0,0.1,0v0.1c0,0,0.1-0.1,0.1,0
		s0.2-0.1,0.3-0.2l0,0c0,0,0.2-0.1,0.2-0.1l0,0l0.1-0.1l0,0c0.1,0,0.1-0.1,0.2-0.1c0,0,0.1-0.1,0.2-0.1c0.4-0.1,0.8-0.3,1.2-0.4
		c0.1,0,0.1-0.1,0.2-0.1c-0.1,0-0.1,0-0.2,0.1c-0.1,0-0.1,0-0.2,0l0,0c-0.1,0-0.1,0-0.1,0v0c0,0-0.1,0-0.1,0l0,0c-0.1,0-0.1,0-0.1,0
		l0,0c0,0-0.2,0.1-0.2,0c0,0,0,0-0.1,0l0,0c0,0-0.1,0-0.1,0l0,0c-0.2,0.1,0,0.1-0.2,0.2l0,0l0,0h-0.1c0,0.1-0.3,0.1-0.4,0.1
		s-0.1,0-0.2,0l0,0c-0.1,0-0.3,0.1-0.4,0s0,0,0,0s-0.1,0-0.2,0s0.1,0,0,0S9.6,10,9.5,10.1s0,0,0,0c-0.1,0.1-0.3,0.1-0.4,0.2
		c-0.2,0-0.4,0.1-0.6,0.2l0,0c-0.1,0-0.2,0.1-0.3,0.1L8.3,10.8z"/>
	<path id="_Yol_25" class="st15" d="M7.4,11.6L7.4,11.6L7.4,11.6C7.4,11.5,7.4,11.6,7.4,11.6z"/>
	<polygon id="_Yol_26" class="st15" points="7.3,11.5 7.3,11.6 7.4,11.5 	"/>
	<polygon id="_Yol_27" class="st15" points="8.4,11 8.4,11 8.3,11.1 	"/>
	<path id="_Yol_28" class="st15" d="M9.6,10.6C9.6,10.6,9.6,10.6,9.6,10.6L9.6,10.6L9.6,10.6z"/>
	<path id="_Yol_29" class="st15" d="M10.4,10.4C10.4,10.4,10.4,10.4,10.4,10.4S10.4,10.4,10.4,10.4z"/>
	<path id="_Yol_30" class="st15" d="M10.5,10.3L10.5,10.3C10.5,10.3,10.5,10.3,10.5,10.3z"/>
</g>
<g id="_Grup_3">
	<path id="_Yol_31" class="st15" d="M6.7,12.9C6.7,12.9,6.7,12.9,6.7,12.9L6.7,12.9L6.7,12.9z"/>
	<path id="_Yol_32" class="st15" d="M6.8,12.8L6.8,12.8L6.8,12.8C6.8,12.7,6.8,12.7,6.8,12.8C6.8,12.6,6.8,12.7,6.8,12.8z"/>
	<path id="_Yol_33" class="st15" d="M7,12.6L7,12.6C7,12.6,6.9,12.7,7,12.6z"/>
	<path id="_Yol_34" class="st15" d="M9.9,11.3L9.9,11.3C9.9,11.3,9.9,11.4,9.9,11.3z"/>
	<path id="_Yol_35" class="st15" d="M9.9,11.3L9.9,11.3z"/>
	<path id="_Yol_36" class="st15" d="M8.8,11.5c0,0-0.1,0.1-0.1,0.1l0,0c0,0,0,0,0,0.1c-0.1,0-0.1,0-0.2,0.1l0,0c0,0,0,0.1-0.1,0.1
		l0,0c-0.2,0.1-0.4,0.2-0.6,0.4l0,0c-0.2,0.1-0.4,0.2-0.6,0.4c0.1-0.1,0.3-0.1,0.4-0.3s0.1-0.1,0.1,0s0.2-0.2,0.4-0.2s0,0,0,0H8h0.1
		c0,0-0.1,0.1-0.1,0.1s0.3-0.1,0.4-0.2L8.1,12c0,0-0.1,0-0.1,0c0.1-0.1,0.3-0.2,0.4-0.2c0,0,0.1,0,0.1,0s0,0,0,0s0-0.1,0.1-0.1v0.1
		c0-0.1,0.1,0,0.1-0.1s0,0,0,0.1s0,0,0.1-0.1v0.1c0-0.1,0.1,0,0.1,0s0,0,0-0.1s0,0,0,0c0,0,0,0,0-0.1l0,0c0,0,0,0,0.1,0l0,0
		c0,0,0,0,0.1,0.1s-0.1,0.1-0.1,0.1l0.1-0.1c0,0,0.1,0,0,0c0.1,0,0.2-0.1,0.3-0.2l0,0c0,0,0.1,0,0.1,0s0-0.1,0-0.1
		c0.1,0,0.1,0,0.2,0l0,0c0.1,0,0,0,0.1-0.1s0,0,0,0s0.1,0,0.1,0l0,0c0,0,0.1-0.1,0.1,0s0.2-0.1,0.2-0.1l0,0c0,0,0.2-0.1,0.2-0.1l0,0
		l0.1-0.1l0,0c0.1,0,0.1-0.1,0.2-0.1c0,0,0.1-0.1,0.1-0.1c0.4-0.1,0.7-0.3,1-0.5c0,0,0.1-0.1,0.1-0.1s-0.1,0-0.1,0.1s-0.1,0-0.1,0
		l0,0c-0.1,0.1-0.1,0-0.1,0.1l0,0c0,0-0.1,0-0.1,0l0,0c-0.1,0-0.1,0-0.1,0l0,0c0,0-0.2,0.1-0.1,0s0,0,0,0l0,0c0,0-0.1,0.1-0.1,0l0,0
		c-0.2,0.1,0,0.1-0.1,0.2l0,0l0,0h0c0,0.1-0.2,0.1-0.3,0.2s-0.1,0-0.2,0l0,0c-0.1,0-0.3,0.1-0.4,0s0,0,0,0s-0.1,0-0.2,0s0.1,0,0,0
		S10,11,9.8,11s0,0,0,0c-0.1,0.1-0.2,0.1-0.4,0.2c-0.1,0-0.4,0.1-0.5,0.2H9C8.9,11.4,8.9,11.4,8.8,11.5L8.8,11.5z"/>
	<path id="_Yol_37" class="st15" d="M7.9,12.2L7.9,12.2L7.9,12.2C8,12.2,8,12.2,7.9,12.2z"/>
	<polygon id="_Yol_38" class="st15" points="7.9,12.1 7.9,12.2 7.9,12.1 	"/>
	<polygon id="_Yol_39" class="st15" points="8.9,11.7 8.9,11.7 8.7,11.8 	"/>
	<path id="_Yol_40" class="st15" d="M9.9,11.4C9.9,11.4,9.9,11.4,9.9,11.4L9.9,11.4L9.9,11.4z"/>
	<path id="_Yol_41" class="st15" d="M10.6,11.2C10.6,11.1,10.7,11.2,10.6,11.2S10.6,11.2,10.6,11.2z"/>
	<path id="_Yol_42" class="st15" d="M10.7,11L10.7,11C10.7,11,10.7,11.1,10.7,11z"/>
</g>
<path class="st6" d="M4.1,14.4H4c-0.1,0-0.3,0-0.4,0H3.4c-0.3,0-0.7,0-1-0.1H2.3H2.2l-0.1-0.4l0.3-0.1H2.2l0.5-2.1l0.1,0.1L3,12
	c0.2,0.1,0.3,0.3,0.5,0.4C3.7,12.7,4,13,4.2,13.3l0.1,0.1c0.1,0.1,0.1,0.2,0.2,0.3l0.1,0.1c0.1,0.1,0.1,0.2,0,0.3
	C4.4,14.3,4.3,14.4,4.1,14.4z M3.1,13.1L3.1,13.1c0,0.2-0.1,0.4-0.2,0.5l0,0C3,13.5,3.1,13.3,3.1,13.1C3.1,13.1,3.1,13.1,3.1,13.1
	L3.1,13.1z"/>
<path class="st7" d="M4.5,13.9c0,0.1,0,0.1,0,0.2c-0.1,0.2-0.3,0.2-0.5,0.2c-0.2,0-0.4,0-0.5,0c-0.3,0-0.6,0-0.9-0.1
	c-0.1,0-0.1,0-0.2,0V14h0.2c0.2-0.1,0.4-0.2,0.5-0.3c0.1-0.1,0.2-0.3,0.3-0.5c0-0.1-0.1-0.1-0.1-0.1c0,0,0,0,0,0C3,13,3,13,3,13.1
	c0,0.2-0.1,0.4-0.3,0.5c-0.1,0.1-0.2,0-0.3,0.1H2.4l0.4-1.8C3,12,3.2,12.2,3.4,12.5c0.3,0.3,0.6,0.7,0.8,1
	C4.3,13.6,4.4,13.7,4.5,13.9z"/>
<linearGradient id="SVGID_6_" gradientUnits="userSpaceOnUse" x1="3.395" y1="3.0581" x2="3.395" y2="6.2381" gradientTransform="matrix(1 0 0 -1 0 17.73)">
	<stop  offset="0" style="stop-color:#FFFFFF;stop-opacity:0.39"/>
	<stop  offset="0.12" style="stop-color:#FFFFFF;stop-opacity:0.16"/>
	<stop  offset="0.5" style="stop-color:#FFFFFF;stop-opacity:0.24"/>
	<stop  offset="1" style="stop-color:#FFFFFF"/>
</linearGradient>
<path class="st16" d="M4.1,14.2H4c-0.1,0-0.3,0-0.4,0H3.4c-0.3,0-0.6-0.1-0.9-0.2H2.4l0,0h0.1h0.1c0.2-0.1,0.3-0.2,0.4-0.3
	c0.2-0.1,0.3-0.4,0.3-0.6c0-0.1-0.1-0.2-0.2-0.2c0,0,0,0,0,0l0,0c-0.1,0-0.2,0-0.2,0.2c0,0.2-0.1,0.3-0.2,0.4c0,0-0.1,0-0.1,0H2.4
	L2.8,12l0.1,0.1c0.2,0.1,0.3,0.3,0.5,0.4c0.2,0.3,0.5,0.6,0.7,0.9l0.1,0.1c0.1,0.1,0.1,0.2,0.2,0.3l0.1,0.1c0,0,0,0,0,0.1
	C4.4,14.1,4.3,14.2,4.1,14.2z"/>
<path class="st6" d="M2,16.5H1.8c-0.2,0-0.3-0.1-0.5-0.1H1H1H0.9l0,0c-0.1,0.1-0.3,0-0.3-0.1s0-0.3,0.1-0.3c0-0.1,0-0.1,0-0.2
	c0-0.2,0-0.4,0-0.7c0-0.1,0-0.2-0.1-0.3c-0.1-0.2-0.1-0.5-0.1-0.7c0-0.2,0.1-0.3,0.3-0.3c0,0,0,0,0,0H1h0.1l0.4,0.1h0.1l0.6-0.2h0.1
	l0.1,0.4H2.3c-0.1,0-0.2,0.1-0.3,0.2l-0.1,0.2l-0.1,0.2c0,0-0.1,0.1-0.1,0.1l0,0l-0.3,0.3v-0.2v0.1l0,0c0,0,0,0,0,0.1
	c0,0,0,0.1,0,0.1l0,0c0.1-0.1,0.1-0.1,0.2-0.2c0.1-0.1,0.2-0.2,0.3-0.3C1.9,14.8,2,14.7,2,14.6l0,0c0-0.1,0.1-0.1,0.1-0.2l0.1-0.1
	c0-0.1,0.2-0.2,0.3-0.2h0.1L3,14.2l0.5,0.1h0.3l0.4,0.1h0.3h0.3l-0.2,0.2L4.3,15c-0.1,0.1-0.3,0.2-0.5,0.2l-0.5,0.1
	c-0.2,0.1-0.4,0.2-0.5,0.4l-0.2,0.3l-0.1,0.2c0,0-0.1,0.1-0.2,0.1L2,16.5L2,16.5z"/>
<path class="st7" d="M4.5,14.7L4.3,15c-0.1,0.1-0.3,0.2-0.4,0.2l-0.5,0.1c-0.3,0.1-0.5,0.2-0.6,0.5c-0.1,0.2-0.2,0.3-0.3,0.5
	s0,0.1-0.1,0.1c-0.2,0-0.4,0-0.6,0c-0.2,0-0.5-0.1-0.7-0.1c-0.1,0-0.1,0-0.2,0c-0.1,0-0.2-0.1-0.2-0.2c0-0.3,0-0.5,0-0.8
	c0-0.1,0-0.3-0.1-0.4c-0.1-0.2-0.1-0.4-0.1-0.6C0.6,14,0.7,14,1,14l0.5,0.1c0.1,0,0.1,0,0.2,0L2.2,14v0.2c-0.1,0-0.3,0.2-0.3,0.3
	c-0.1,0.1-0.2,0.3-0.2,0.4c0,0.1-0.1,0.1-0.1,0.2l-0.2,0.2l-0.1-0.5h0.2l0,0l-0.3-0.1c-0.1,0-0.1,0-0.1,0.1c0.1,0.2,0.1,0.5,0,0.7
	c0,0,0,0.1,0,0.1c0,0.1,0,0.1,0,0.2c0.1,0,0.1,0,0.2,0c0.1-0.1,0.1-0.2,0.2-0.2c0.1-0.1,0.1-0.2,0.3-0.3c0.1-0.1,0.2-0.2,0.3-0.3
	c0.1-0.1,0.1-0.2,0.2-0.3c0.1-0.1,0.1-0.2,0.3-0.1l0.9,0.1l0.6,0.1C4.2,14.6,4.3,14.6,4.5,14.7z"/>
<linearGradient id="SVGID_7_" gradientUnits="userSpaceOnUse" x1="2.4824" y1="0.92" x2="2.4824" y2="4.23" gradientTransform="matrix(1 0 0 -1 0 17.73)">
	<stop  offset="0" style="stop-color:#FFFFFF;stop-opacity:0.39"/>
	<stop  offset="0.12" style="stop-color:#FFFFFF;stop-opacity:0.16"/>
	<stop  offset="0.5" style="stop-color:#FFFFFF;stop-opacity:0.24"/>
	<stop  offset="1" style="stop-color:#FFFFFF"/>
</linearGradient>
<path class="st17" d="M2,16.3H1.8c-0.2,0-0.3-0.1-0.5-0.1H1.1H1H0.9l0,0c0,0-0.1,0-0.1-0.1s0-0.1,0-0.2c0-0.2,0-0.4,0-0.6
	c0-0.2,0-0.3-0.1-0.5c-0.1-0.2-0.1-0.4-0.1-0.6c0-0.1,0.1-0.2,0.2-0.2L1,14h0.1l0.4,0.1h0.1h0.1L2.2,14l0,0
	c-0.1,0.1-0.2,0.2-0.3,0.3l-0.1,0.2l-0.1,0.2c0,0-0.1,0.1-0.1,0.1l0,0.1L1.4,15l-0.1-0.3h0.1v-0.1h0H1.4H1.2l0,0
	c-0.1,0-0.1,0-0.1,0.1c0,0,0,0.1,0,0.1c0.1,0.2,0.1,0.4,0,0.6l0,0c0,0,0,0.1,0,0.1c0,0.1,0,0.2,0.1,0.2c0,0,0.1,0,0.1,0
	c0.1,0,0.1,0,0.2-0.1c0.1-0.1,0.2-0.2,0.2-0.3c0-0.1,0.1-0.2,0.2-0.2C1.9,15.2,2,15.1,2.1,15l0,0c0-0.1,0.1-0.1,0.1-0.2l0.1-0.1
	c0.1-0.1,0.1-0.1,0.1-0.1h0.1l0.4,0.1l0.5,0.1h0.3l0.3,0h0.3l-0.2,0.2c-0.1,0.1-0.2,0.2-0.4,0.2l-0.5,0.1c-0.3,0.1-0.5,0.3-0.7,0.5
	c-0.1,0.1-0.1,0.2-0.2,0.3l-0.1,0.2l0,0L2,16.3L2,16.3z"/>
<path class="st6" d="M1.5,13.9c-0.1,0-0.2,0-0.3,0H1.2H1l0.1-0.1c0.1-0.2,0.1-0.4,0.1-0.5c0-0.1,0-0.2,0-0.3v-0.1h0.1
	c0.2,0,0.3,0.1,0.5,0.2c0,0,0.1,0.1,0.1,0.1c0.1,0,0.1,0.1,0.1,0.2c0,0,0,0,0,0c0,0.1,0,0.2-0.1,0.3v0.2H1.9H1.8
	C1.8,13.9,1.7,14,1.5,13.9L1.5,13.9z"/>
<path class="st7" d="M1.9,13.2c0.1,0,0.1,0,0,0.1s0,0.3-0.1,0.4c-0.1,0.1-0.2,0.1-0.3,0.1c-0.1,0-0.3,0-0.4-0.1
	c0.1-0.3,0.2-0.6,0.2-0.9c0.2,0,0.3,0.1,0.4,0.2C1.8,13.1,1.9,13.2,1.9,13.2z"/>
<linearGradient id="SVGID_8_" gradientUnits="userSpaceOnUse" x1="1.62" y1="3.47" x2="1.62" y2="5.26" gradientTransform="matrix(1 0 0 -1 0 17.73)">
	<stop  offset="0" style="stop-color:#FFFFFF;stop-opacity:0.39"/>
	<stop  offset="0.12" style="stop-color:#FFFFFF;stop-opacity:0.16"/>
	<stop  offset="0.5" style="stop-color:#FFFFFF;stop-opacity:0.24"/>
	<stop  offset="1" style="stop-color:#FFFFFF"/>
</linearGradient>
<path class="st18" d="M1.5,13.8c-0.1,0-0.1,0-0.2,0l0,0c0.1-0.2,0.1-0.3,0.1-0.5c0-0.1,0-0.1,0-0.2c0.1,0,0.2,0.1,0.3,0.2
	c0.1,0.1,0.1,0.1,0.2,0.1l0,0c0,0.1,0,0.2-0.1,0.3v0.1l0,0c-0.1,0-0.1,0.1-0.2,0.1L1.5,13.8z"/>
<path class="st19" d="M14.5,13.9c0,0.2-0.1,0.3-0.1,0.4l-0.1,0.1l0,0c0,0.1-0.1,0.1-0.1,0.2L14,15l0,0c-0.1,0.1-0.1,0.2-0.1,0.3l0,0
	c0,0.1,0,0.2,0,0.2c0,0,0,0,0,0.1h0.1l0.6-0.2l0.2-0.1l0.3-0.1h0.2h0.1c0.1,0,0.3,0.1,0.3,0.3v0.1c0,0,0,0.1,0,0.1"/>
<path class="st6" d="M16.3,15.4L16,15.3l-0.3-0.1h-0.1c-0.1,0-0.2-0.1-0.3-0.1c-0.1,0-0.2-0.2-0.1-0.3c0,0,0,0,0,0v-0.1h-0.1
	c-0.1-0.1-0.1-0.1-0.2-0.2l0,0l-0.2-0.3L14.6,14l-0.1-0.1v-0.1c0-0.1,0-0.1,0-0.2c0-0.1,0-0.1-0.1-0.1v-0.1v-0.1l-0.1-0.3
	c0-0.1-0.1-0.1-0.1-0.1L14,13c-0.1,0-0.1,0.1-0.1,0.2c0,0.2,0,0.4,0.1,0.5v0.1v0.1l0,0c0,0,0-0.1,0-0.1v-0.1v-0.1
	c0-0.1,0-0.1-0.1-0.1l-0.3-0.2l-0.2-0.1l-0.2,0.4l-0.4,0.8l0,0c-0.1,0.1-0.1,0.3-0.1,0.5c0,0.1,0,0.1,0,0.2s0,0.1,0,0.2s0,0.3,0,0.4
	c0,0.1,0,0.2,0.1,0.2c0.3,0.1,0.5,0.3,0.8,0.3h0.1c0.2,0,0.4,0.1,0.5,0.3c0,0,0.1,0,0.1,0h0.1h0.1l0.3-0.1l0.7-0.4
	c0,0,0.1-0.1,0.1-0.1L16.3,15.4z"/>
<path class="st7" d="M15.6,15.3l0.4,0.1l-0.5,0.3v-0.1l0,0c0-0.1-0.1-0.3-0.3-0.3c-0.2,0-0.4,0-0.6,0.1L14,15.6h-0.1
	c0-0.1,0-0.3,0.1-0.4c0-0.1,0.1-0.2,0.2-0.2c0.1-0.1,0.1-0.1,0.1-0.2c0-0.1,0.1-0.1,0.1-0.2l0.1-0.1l0.1-0.3
	c0.1,0.1,0.2,0.3,0.3,0.4s0.1,0.1,0.2,0.2c-0.1,0.1,0,0.3,0.1,0.4c0,0,0,0,0,0C15.4,15.2,15.5,15.2,15.6,15.3z"/>
<linearGradient id="SVGID_9_" gradientUnits="userSpaceOnUse" x1="14.93" y1="1.63" x2="14.93" y2="4.03" gradientTransform="matrix(1 0 0 -1 0 17.73)">
	<stop  offset="0" style="stop-color:#FFFFFF;stop-opacity:0.39"/>
	<stop  offset="0.12" style="stop-color:#FFFFFF;stop-opacity:0.16"/>
	<stop  offset="0.5" style="stop-color:#FFFFFF;stop-opacity:0.24"/>
	<stop  offset="1" style="stop-color:#FFFFFF"/>
</linearGradient>
<path class="st20" d="M15.6,15.6L15.6,15.6c0-0.1-0.1-0.2-0.2-0.3h0.1h0.1l0.3,0.1L15.6,15.6L15.6,15.6z M13.9,15.5
	c0-0.1,0-0.2,0-0.3c0-0.1,0.1-0.1,0.2-0.2l0.1-0.1l0.1-0.1c0,0,0.1-0.1,0.1-0.1c0-0.1,0.1-0.1,0.1-0.2v-0.1l0.1-0.4l0,0l0.2,0.3l0,0
	c0,0.1,0.1,0.1,0.2,0.2c-0.1,0.2,0,0.4,0.2,0.4h0.1h-0.1c-0.1,0-0.3,0-0.4,0.1h-0.1l-0.4,0.1L13.9,15.5L13.9,15.5L13.9,15.5z"/>
<path class="st7" d="M15.4,15.7c0,0.1,0,0.1,0,0.2c0,0,0,0,0,0.1l-0.7,0.4c-0.1,0-0.2,0.1-0.3,0.1c0,0-0.1,0-0.1,0
	c-0.2-0.2-0.4-0.3-0.6-0.3c-0.3-0.1-0.6-0.2-0.8-0.4c-0.1,0-0.1-0.1-0.1-0.1c0-0.1,0-0.3,0-0.4s0-0.2-0.1-0.4c0-0.2,0-0.3,0.1-0.5
	l0.6-1.1l0.4,0.3c0,0,0,0.1,0,0.1c0,0.1,0,0.2,0.1,0.2c0,0,0,0.1,0.1,0.1c0.1,0.1,0.1,0.1,0,0.2c-0.1,0.2-0.2,0.3-0.3,0.5l-0.1,0.2
	c0,0,0,0.1,0,0.1h0.1c0.1-0.1,0.3-0.3,0.3-0.4c0-0.1,0.1-0.2,0.1-0.3c0-0.1,0-0.3-0.1-0.4c-0.1-0.2-0.1-0.3-0.1-0.5
	c0,0,0-0.1,0.1-0.1c0,0,0.1,0,0.1,0.1l0.2,0.3c0,0.1,0.1,0.1,0.1,0.2c0,0.1,0,0.1,0,0.2c0,0.2-0.1,0.4-0.1,0.5l-0.1,0.2
	c0,0.1-0.1,0.1-0.1,0.1l-0.2,0.2c-0.1,0.1-0.1,0.3-0.1,0.4c0,0.1,0,0.2,0,0.2c0,0.1,0,0.1,0.1,0.2c0,0,0,0,0.1,0l0.6-0.2l0.5-0.1
	c0.1,0,0.1,0,0.2,0C15.3,15.4,15.3,15.5,15.4,15.7L15.4,15.7z"/>
<linearGradient id="SVGID_10_" gradientUnits="userSpaceOnUse" x1="14.0648" y1="0.92" x2="14.0648" y2="5.1" gradientTransform="matrix(1 0 0 -1 0 17.73)">
	<stop  offset="0" style="stop-color:#FFFFFF;stop-opacity:0.39"/>
	<stop  offset="0.12" style="stop-color:#FFFFFF;stop-opacity:0.16"/>
	<stop  offset="0.5" style="stop-color:#FFFFFF;stop-opacity:0.24"/>
	<stop  offset="1" style="stop-color:#FFFFFF"/>
</linearGradient>
<path class="st21" d="M14.3,16.3c-0.2-0.1-0.4-0.2-0.6-0.3h-0.1c-0.3-0.1-0.5-0.2-0.8-0.3c0,0,0,0,0-0.1s0-0.3,0-0.4s0-0.1,0-0.2
	s0-0.1,0-0.1c0-0.1,0-0.3,0.1-0.4l0,0l0.4-0.8l0.1-0.2l0,0l0.3,0.2l0,0v0.1v0.1c0,0.1,0,0.1,0.1,0.2c0.1,0,0,0.1,0,0.2
	c0,0.1-0.1,0.3-0.2,0.4l-0.1,0.1l-0.1,0.2c0,0,0,0,0,0.1l0,0v0.1h0.1l0,0h0.1c0.1-0.1,0.3-0.3,0.4-0.4c0-0.1,0.1-0.2,0.1-0.3v-0.1
	c0-0.1,0-0.2,0-0.3v-0.1c-0.1-0.2-0.1-0.3-0.1-0.5l0,0l0,0l0.1,0.3v0.1v0.1l0.1,0.1c0,0,0,0.1,0,0.1c0,0.2-0.1,0.4-0.1,0.5L14,14.5
	l0,0c0,0.1-0.1,0.1-0.1,0.1l-0.2,0.2l0,0c-0.1,0.1-0.2,0.3-0.2,0.4l0,0c0,0.1,0,0.2,0,0.2c0,0.1,0,0.1,0.1,0.2c0,0,0.1,0.1,0.1,0.1
	h0.1l0.6-0.2l0.2-0.1l0.3-0.1h0.2c0.1,0,0.1,0,0.1,0.1v0.1c0,0,0,0.1,0,0.1l-0.7,0.4L14.3,16.3L14.3,16.3L14.3,16.3z"/>
<path class="st6" d="M14,13.9c0.1,0.2,0.1,0.3,0,0.5c-0.1,0.2-0.2,0.4-0.4,0.5"/>
</svg>
