<?xml version="1.0" encoding="utf-8"?>
<!-- Generator: Adobe Illustrator 21.0.0, SVG Export Plug-In . SVG Version: 6.00 Build 0)  -->
<svg version="1.1" id="katman_1" xmlns="http://www.w3.org/2000/svg" xmlns:xlink="http://www.w3.org/1999/xlink" x="0px" y="0px"
	 viewBox="0 0 47.8 48" style="enable-background:new 0 0 47.8 48;" xml:space="preserve">
<style type="text/css">
	.st0{opacity:0.1;fill:#FFFFFF;enable-background:new    ;}
	.st1{opacity:0.1;fill:#010101;enable-background:new    ;}
	.st2{fill:url(#SVGID_1_);}
	.st3{fill:none;}
	.st4{opacity:0.7;fill:#603913;enable-background:new    ;}
	.st5{fill:url(#SVGID_2_);}
</style>
<title>applications-multimedia_1</title>
<rect x="3.3" y="46.3" class="st0" width="5.6" height="1.5"/>
<path class="st1" d="M34.1,13.3H13.6c-1.3,0-2.4,1.1-2.4,2.4v1.5c0-1.3,1.1-2.4,2.4-2.4h20.4c1.3,0,2.4,1.1,2.4,2.4v-1.5
	C36.5,14.4,35.4,13.3,34.1,13.3z"/>
<path class="st1" d="M36.5,38.4c0-1.3-1.1-2.4-2.4-2.4c0,0,0,0,0,0H13.6c-1.3,0-2.4,1.1-2.4,2.4v1.5c0-1.3,1.1-2.4,2.4-2.4
	c0,0,0,0,0,0h20.4c1.3,0,2.4,1.1,2.4,2.4L36.5,38.4z"/>
<rect x="38.8" y="37.5" class="st1" width="5.6" height="1.5"/>
<rect x="3.3" y="37.5" class="st1" width="5.6" height="1.5"/>
<rect x="3.3" y="32.4" class="st1" width="5.6" height="1.4"/>
<rect x="38.8" y="11.7" class="st1" width="5.6" height="1.5"/>
<rect x="3.3" y="42.7" class="st1" width="5.6" height="1.5"/>
<rect x="38.8" y="1.4" class="st1" width="5.6" height="1.4"/>
<rect x="38.8" y="42.7" class="st1" width="5.6" height="1.5"/>
<rect x="38.8" y="32.4" class="st1" width="5.6" height="1.4"/>
<rect x="3.3" y="1.4" class="st1" width="5.6" height="1.4"/>
<rect x="38.8" y="6.6" class="st1" width="5.6" height="1.5"/>
<rect x="3.3" y="6.6" class="st1" width="5.6" height="1.5"/>
<rect x="38.8" y="16.9" class="st1" width="5.6" height="1.5"/>
<rect x="38.8" y="22.1" class="st1" width="5.6" height="1.5"/>
<rect x="3.3" y="22.1" class="st1" width="5.6" height="1.5"/>
<rect x="38.8" y="27.2" class="st1" width="5.6" height="1.4"/>
<rect x="3.3" y="27.2" class="st1" width="5.6" height="1.4"/>
<rect x="3.3" y="16.9" class="st1" width="5.6" height="1.5"/>
<rect x="3.3" y="11.7" class="st1" width="5.6" height="1.5"/>
<linearGradient id="SVGID_1_" gradientUnits="userSpaceOnUse" x1="23.88" y1="-23.91" x2="23.88" y2="73.82" gradientTransform="matrix(1 0 0 -1 0 47.73)">
	<stop  offset="0.17" style="stop-color:#1A1A1A"/>
	<stop  offset="0.65" style="stop-color:#404040"/>
</linearGradient>
<path class="st2" d="M3.3,48v-0.1H9V48h2.2v-9.6c0-1.3,1.1-2.4,2.4-2.4h20.4c1.3,0,2.4,1.1,2.4,2.4V48h2.2v-0.1h5.6V48h3.2V0h-11
	v6.2c0,1.3-1.1,2.4-2.4,2.4c0,0,0,0-0.1,0H13.6c-1.3,0-2.4-1.1-2.4-2.4V0h-11v48H3.3z M38.8,1.4h5.6V5h-5.6V1.4z M38.8,6.6h5.6v3.6
	h-5.6V6.6z M38.8,11.7h5.6v3.6h-5.6V11.7z M38.8,16.9h5.6v3.6h-5.6V16.9z M38.8,22.1h5.6v3.6h-5.6V22.1z M38.8,27.1h5.6v3.8h-5.6
	V27.1z M38.8,32.3h5.6v3.6h-5.6V32.3z M38.8,37.5h5.6v3.6h-5.6V37.5z M38.8,42.6h5.6v3.6h-5.6V42.6z M11.2,15.6
	c0-1.3,1.1-2.4,2.4-2.4h20.4c1.3,0,2.4,1.1,2.4,2.4v14.3c0,1.3-1.1,2.4-2.4,2.4H13.6c-1.3,0-2.4-1.1-2.4-2.4V15.6z M3.3,1.4H9V5H3.3
	V1.4z M3.3,6.6H9v3.6H3.3V6.6z M3.3,11.7H9v3.6H3.3V11.7z M3.3,16.9H9v3.6H3.3V16.9z M3.3,22.1H9v3.6H3.3V22.1z M3.3,27.1H9v3.8H3.3
	V27.1z M3.3,32.3H9v3.6H3.3V32.3z M3.3,37.5H9v3.6H3.3V37.5z M3.3,42.6H9v3.6H3.3V42.6z"/>
<rect y="0.1" class="st3" width="47.8" height="47.8"/>
<rect x="3.3" y="25.7" class="st0" width="5.6" height="1.4"/>
<rect x="3.3" y="15.3" class="st0" width="5.6" height="1.5"/>
<rect x="3.3" y="20.5" class="st0" width="5.6" height="1.5"/>
<rect x="3.3" y="10.2" class="st0" width="5.6" height="1.5"/>
<rect x="3.3" y="5" class="st0" width="5.6" height="1.5"/>
<rect x="38.8" y="5" class="st0" width="5.6" height="1.5"/>
<path class="st0" d="M34.1,32.4H13.6c-1.3,0-2.4-1.1-2.4-2.4v1.5c0,1.3,1.1,2.4,2.4,2.4h20.4c1.3,0,2.4-1.1,2.4-2.4v-1.5
	C36.5,31.3,35.4,32.4,34.1,32.4z"/>
<polygon class="st0" points="3.3,1.4 9,1.4 9,1.5 11.2,1.5 11.2,0 0.2,0 0.2,1.5 3.3,1.5 "/>
<rect x="3.3" y="30.9" class="st0" width="5.6" height="1.4"/>
<rect x="3.3" y="46.3" class="st0" width="5.6" height="1.5"/>
<path class="st0" d="M11.2,7.7c0,1.3,1.1,2.4,2.4,2.4h20.4c1.3,0,2.4-1.1,2.4-2.4V6.2c0,1.3-1.1,2.4-2.4,2.4H13.6
	c-1.3,0-2.4-1.1-2.4-2.4V7.7z"/>
<rect x="3.3" y="35.9" class="st0" width="5.6" height="1.5"/>
<rect x="38.8" y="10.2" class="st0" width="5.6" height="1.5"/>
<rect x="3.3" y="41.1" class="st0" width="5.6" height="1.5"/>
<rect x="38.8" y="46.3" class="st0" width="5.6" height="1.5"/>
<rect x="38.8" y="35.9" class="st0" width="5.6" height="1.5"/>
<rect x="38.8" y="20.5" class="st0" width="5.6" height="1.5"/>
<rect x="38.8" y="15.3" class="st0" width="5.6" height="1.5"/>
<rect x="38.8" y="25.7" class="st0" width="5.6" height="1.4"/>
<rect x="38.8" y="41.1" class="st0" width="5.6" height="1.5"/>
<polygon class="st0" points="36.5,0 36.5,1.5 38.8,1.5 38.8,1.4 44.4,1.4 44.4,1.5 47.6,1.5 47.6,0 "/>
<path class="st4" d="M16,46c-4,0-7.3-2.9-7.3-6.5s3.3-6.6,7.3-6.6c1,0,2,0.2,2.9,0.5c0.1-4.3,0-23.8,0-24c0-0.6,0.4-1,1-1.1
	l24.8-3.1h0.1c0.3,0,0.5,0.1,0.7,0.3c0.2,0.2,0.4,0.5,0.4,0.8V32c0,0.1,0,0.1,0,0.2c0,3.6-3.3,6.5-7.3,6.5s-7.3-2.9-7.3-6.5
	s3.3-6.5,7.3-6.5c1,0,2,0.2,3,0.6V15.3l-18.3,2.4v20.8c0,0.1,0,0.2,0,0.3c0,0.2,0,0.5,0,0.7C23.3,43,20,46,16,46z"/>
<linearGradient id="SVGID_2_" gradientUnits="userSpaceOnUse" x1="33.705" y1="-7.619" x2="24.155" y2="40.491" gradientTransform="matrix(1 0 0 -1 0 47.73)">
	<stop  offset="0" style="stop-color:#DF942F"/>
	<stop  offset="6.000000e-02" style="stop-color:#FAAF43"/>
	<stop  offset="0.42" style="stop-color:#F9DC6F"/>
	<stop  offset="1" style="stop-color:#FEDFB3"/>
</linearGradient>
<path class="st5" d="M45.3,5.8c-0.2-0.1-0.4-0.2-0.6-0.2L19.9,8.8c-0.4,0-0.6,0.4-0.6,0.7c0,0,0.1,21.8,0,24.5
	c-1-0.5-2.2-0.7-3.3-0.7c-3.8,0-6.9,2.8-6.9,6.2s3.1,6.2,6.9,6.2s6.9-2.8,6.9-6.2c0-0.2,0-0.5,0-0.7c0-0.1,0-0.2,0-0.2V17.3L42,14.9
	v11.9c-1.1-0.5-2.2-0.8-3.4-0.8c-3.8,0-6.9,2.8-6.9,6.2s3.1,6.2,6.9,6.2s6.9-2.8,6.9-6.2c0-0.1,0-0.1,0-0.2s0,0,0-0.1V6.3
	C45.5,6.1,45.4,5.9,45.3,5.8z"/>
<path class="st0" d="M19.3,34c-1-0.5-2.1-0.7-3.3-0.7c-3.8,0-6.9,2.8-6.9,6.2c0,0.3,0,0.5,0.1,0.8c0.4-3,3.3-5.4,6.9-5.4
	c1.1,0,2.2,0.2,3.3,0.7C19.3,35.1,19.3,34.4,19.3,34z"/>
<path class="st0" d="M38.6,27.5c1.2,0,2.3,0.3,3.4,0.8v-1.5c-1.1-0.5-2.2-0.8-3.4-0.8c-3.8,0-6.9,2.8-6.9,6.2c0,0.3,0,0.5,0.1,0.8
	C32.2,29.8,35.1,27.5,38.6,27.5z"/>
<path class="st0" d="M45.3,5.8c-0.2-0.1-0.4-0.2-0.6-0.2L19.9,8.8c-0.4,0-0.6,0.4-0.6,0.7c0,0,0,0.5,0,1.5c0-0.4,0.3-0.6,0.6-0.7
	l24.8-3.2c0.2,0,0.4,0,0.6,0.2c0.2,0.1,0.2,0.3,0.2,0.6V6.3C45.5,6.1,45.4,5.9,45.3,5.8z"/>
<path class="st1" d="M38.6,38.3c-3.5,0-6.5-2.4-6.9-5.4c0,0.2-0.1,0.5-0.1,0.8c0,3.4,3.1,6.2,6.9,6.2s6.9-2.8,6.9-6.2
	c0-0.1,0-0.1,0-0.2s0,0,0-0.1v-1.2C45.5,35.5,42.4,38.3,38.6,38.3z"/>
<path class="st1" d="M16,47.1c3.8,0,6.9-2.8,6.9-6.2c0-0.2,0-0.5,0-0.7c0-0.1,0-0.2,0-0.2v-0.5c0,3.4-3.1,6.2-6.9,6.2
	c-3.5,0-6.4-2.4-6.9-5.4c0,0.2-0.1,0.5-0.1,0.8C9.1,44.3,12.2,47.1,16,47.1z"/>
<polygon class="st1" points="42,14.9 22.9,17.3 22.9,18.8 42,16.4 "/>
</svg>
