<?xml version="1.0" encoding="utf-8"?>
<!-- Generator: Adobe Illustrator 22.0.1, SVG Export Plug-In . SVG Version: 6.00 Build 0)  -->
<svg version="1.1" id="katman_1" xmlns="http://www.w3.org/2000/svg" xmlns:xlink="http://www.w3.org/1999/xlink" x="0px" y="0px"
	 viewBox="0 0 24.7 32" style="enable-background:new 0 0 24.7 32;" xml:space="preserve">
<style type="text/css">
	.st0{opacity:0.2;enable-background:new    ;}
	.st1{fill:url(#SVGID_1_);}
	.st2{opacity:0.1;enable-background:new    ;}
	.st3{fill:#F5F5F5;}
	.st4{opacity:0.1;fill:#FFFFFF;enable-background:new    ;}
	.st5{opacity:0.5;enable-background:new    ;}
</style>
<title>libreoffice-impress_4</title>
<path class="st0" d="M0,29.2v1.1C0,31.2,0.7,32,1.7,32c0,0,0,0,0,0H23c0.9,0,1.7-0.8,1.7-1.7l0,0v-1.1c0,0.9-0.7,1.7-1.7,1.7
	c0,0,0,0,0,0H1.7C0.8,30.9,0,30.1,0,29.2C0,29.2,0,29.2,0,29.2z"/>
<linearGradient id="SVGID_1_" gradientUnits="userSpaceOnUse" x1="12.35" y1="0.4596" x2="12.35" y2="31.8899" gradientTransform="matrix(1 0 0 -1 0 31.8898)">
	<stop  offset="0" style="stop-color:#C73323"/>
	<stop  offset="0.21" style="stop-color:#D13E26"/>
	<stop  offset="0.68" style="stop-color:#E3522A"/>
	<stop  offset="1" style="stop-color:#EA592C"/>
</linearGradient>
<path class="st1" d="M24.7,29.7V1.7C24.7,0.8,23.9,0,23,0c0,0,0,0,0,0H1.7C0.8,0,0,0.8,0,1.7v28.1c0,0.9,0.8,1.7,1.7,1.7
	c0,0,0,0,0,0H23C23.9,31.4,24.7,30.7,24.7,29.7C24.7,29.8,24.7,29.8,24.7,29.7z"/>
<path class="st2" d="M2.3,2.8v26.9h20.2V12.2L13,2.8H2.3z M16.2,2.8l6.3,6.3V2.8H16.2z"/>
<path class="st3" d="M2.3,2.2v26.9h20.2V11.7L13,2.2H2.3z M16.2,2.2l6.3,6.3V2.2H16.2z"/>
<path class="st4" d="M1.7,0C0.8,0,0,0.8,0,1.7v0.6c0-0.9,0.8-1.7,1.7-1.7l0,0H23c0.9,0,1.7,0.7,1.7,1.7c0,0,0,0,0,0V1.7
	C24.7,0.8,23.9,0,23,0c0,0,0,0,0,0H1.7z"/>
<path class="st5" d="M7.9,16.1c-1.7,0-3,1.3-3,3s1.3,3,3,3s3-1.3,3-3h-3L7.9,16.1z"/>
<rect x="12.4" y="16.8" class="st5" width="7.5" height="1.2"/>
<rect x="12.4" y="20.2" class="st5" width="7.5" height="1.1"/>
<rect x="5.6" y="23.6" class="st5" width="11.2" height="1.1"/>
<path class="st2" d="M7.9,16.6c-1.7,0-3,1.3-3,3s1.3,3,3,3s3-1.3,3-3h-3L7.9,16.6z"/>
<rect x="12.4" y="17.3" class="st2" width="7.5" height="1.1"/>
<rect x="12.4" y="20.7" class="st2" width="7.5" height="1.1"/>
<rect x="5.6" y="24.1" class="st2" width="11.2" height="1.1"/>
</svg>
