<?xml version="1.0" encoding="utf-8"?>
<!-- Generator: Adobe Illustrator 21.0.0, SVG Export Plug-In . SVG Version: 6.00 Build 0)  -->
<svg version="1.1" id="katman_1" xmlns="http://www.w3.org/2000/svg" xmlns:xlink="http://www.w3.org/1999/xlink" x="0px" y="0px"
	 viewBox="0 0 24.6 32" style="enable-background:new 0 0 24.6 32;" xml:space="preserve">
<style type="text/css">
	.st0{opacity:0.7;fill:#333333;enable-background:new    ;}
	.st1{opacity:0.1;fill:#010101;enable-background:new    ;}
	.st2{fill:url(#SVGID_1_);}
	.st3{fill:url(#SVGID_2_);}
	.st4{fill:url(#SVGID_3_);}
	.st5{opacity:0.1;fill:#FFFFFF;enable-background:new    ;}
	.st6{fill:url(#SVGID_4_);}
	.st7{fill:url(#SVGID_5_);}
	.st8{fill:url(#SVGID_6_);}
	.st9{fill:url(#SVGID_7_);}
	.st10{fill:url(#SVGID_8_);}
</style>
<title>preferences-desktop-pripherals_2</title>
<path class="st0" d="M10.9,31.3c-2.1-0.2-4.1-1.1-5.7-2.5c-0.9-1-1.4-2.3-1.4-3.6c0-0.7-0.1-1.5-0.3-2.2c-0.3-0.9-0.7-1.7-1.2-2.5
	c-0.5-0.8-0.9-1.7-1.3-2.7c-0.5-1.7-0.7-3.4-0.5-5.1c0.3-1.6,1.1-3,2.2-4.2c0.8-0.8,1.7-1.4,2.8-1.7c0-0.3,0-0.5,0-0.8
	c-0.2-1.4,0-2.8,0.5-4.1c0.5-0.9,1.4-1.5,2.4-1.6C9.6,0.1,10.7,0,11.9,0c1.3-0.1,2.5,0.2,3.6,0.7C22,3.9,24.6,7.8,24.6,14
	c0,6.3-3.3,12.2-8.6,15.5l-0.6,0.4C14.1,30.9,12.5,31.4,10.9,31.3z"/>
<path class="st0" d="M4.5,17.8c-0.2,0-0.3,0-0.5-0.1c-2.3-0.4-4-2.4-4-4.7c0-1.2,0.3-2.9,2.9-4c0.4-0.2,0.9-0.3,1.4-0.3
	c0.5,0,1,0.1,1.4,0.4c0.8,0.8,0.8,2.5,0.8,3.8v0.2c0.1,1.2-0.1,2.4-0.4,3.5C5.9,17.4,5.2,17.8,4.5,17.8z"/>
<path class="st1" d="M15.9,29.3c-1.4,0.9-2.1,1.8-5,1.8c-2.1-0.2-4-1-5.5-2.4c-1.8-1.8-0.9-3.4-1.6-5.7c-0.6-1.8-1.8-3.2-2.5-5.2
	c-0.3-1.1-0.5-2.2-0.6-3.3c0,1.4,0.2,2.9,0.6,4.2c0.7,2,1.9,3.4,2.4,5.2c0.7,2.2-0.2,3.9,1.6,5.7c1.5,1.4,3.5,2.2,5.5,2.4
	c2.9,0,3.7-0.9,5-1.8c5.3-3.3,8.5-9.1,8.5-15.3c0-0.2,0-0.3,0-0.5C24.2,20.5,21,26.1,15.9,29.3z"/>
<radialGradient id="SVGID_1_" cx="16.3283" cy="11.4483" r="14.27" gradientTransform="matrix(0.96 0 0 -0.96 -3.15 26.5908)" gradientUnits="userSpaceOnUse">
	<stop  offset="0" style="stop-color:#F7F7F7"/>
	<stop  offset="0.3" style="stop-color:#F3F3F3"/>
	<stop  offset="0.61" style="stop-color:#E7E7E7"/>
	<stop  offset="0.92" style="stop-color:#D3D3D3"/>
	<stop  offset="1" style="stop-color:#CCCCCC"/>
</radialGradient>
<path class="st2" d="M24.4,14c0,6.2-3.2,12-8.5,15.3c-1.4,0.9-2.1,1.8-5,1.8c-2.1-0.2-4-1-5.5-2.4c-1.8-1.8-0.9-3.4-1.6-5.7
	c-0.6-1.9-1.7-3.2-2.4-5.2c-0.5-1.6-0.7-3.3-0.5-5c0.3-1.5,1-2.9,2.1-4c0.8-0.9,1.8-1.4,2.9-1.6c0-1.9-0.2-3.7,0.5-5
	c0.5-0.9,1.3-1.4,2.3-1.6c0.8-0.2,4.5-0.8,6.8,0.3C21.9,4.2,24.4,8,24.4,14z"/>
<path class="st0" d="M9.9,14.1c-1.5,0-2.7-1.2-2.7-2.7l0,0V0.8l0.1-0.1c0.4-0.2,0.8-0.3,1.2-0.4C9.6,0.1,10.7,0,11.9,0
	c1.3,0,2.5,0.2,3.6,0.7C16.8,1.3,18,2,19.1,2.8l0.1,0.1v6.4c0,2.6-2.1,4.7-4.8,4.8H9.9z"/>
<linearGradient id="SVGID_2_" gradientUnits="userSpaceOnUse" x1="7.45" y1="24.6704" x2="18.95" y2="24.6704" gradientTransform="matrix(1 0 0 -1 0 31.73)">
	<stop  offset="0" style="stop-color:#CCCCCC"/>
	<stop  offset="1" style="stop-color:#F7F7F7"/>
</linearGradient>
<path class="st3" d="M15.4,0.9c-2.3-1.1-6-0.5-6.8-0.3C8.2,0.7,7.8,0.8,7.4,1v10.4c0,1.4,1.1,2.5,2.5,2.5l0,0h4.5
	c2.5,0,4.5-2,4.6-4.5c0,0,0,0,0-0.1V3C17.9,2.2,16.6,1.5,15.4,0.9z"/>
<path class="st0" d="M4.5,17.6c-0.2,0-0.3,0-0.5,0c-2.2-0.4-3.8-2.2-3.8-4.4c0-1.1,0.3-2.7,2.7-3.8C3.4,9.1,3.8,9,4.3,9
	c0.4,0,0.9,0.1,1.2,0.3c0.7,0.7,0.7,2.4,0.7,3.6v0.2c0.1,1.2,0,2.3-0.3,3.4C5.7,17.1,5.1,17.6,4.5,17.6z"/>
<path class="st0" d="M13.2,8.3c-0.6,0-1.1-0.5-1.1-1v0V4.5c0-0.6,0.5-1.1,1.1-1.1s1.1,0.5,1.1,1.1v2.8C14.2,7.8,13.8,8.3,13.2,8.3
	L13.2,8.3z"/>
<linearGradient id="SVGID_3_" gradientUnits="userSpaceOnUse" x1="12.39" y1="25.875" x2="14.01" y2="25.875" gradientTransform="matrix(1 0 0 -1 0 31.73)">
	<stop  offset="0" style="stop-color:#DD922E"/>
	<stop  offset="0.71" style="stop-color:#F9AE42"/>
	<stop  offset="1" style="stop-color:#F8DB6E"/>
</linearGradient>
<path class="st4" d="M13.2,3.7L13.2,3.7C13.6,3.7,14,4,14,4.5v2.8C14,7.7,13.6,8,13.2,8h0c-0.4,0-0.8-0.4-0.8-0.8V4.5
	C12.4,4,12.8,3.7,13.2,3.7z"/>
<path class="st0" d="M13.2,14.9c-0.6,0-1.1-0.5-1.1-1c0,0,0,0,0,0v-3.7c0-0.6,0.5-1.1,1.1-1.1s1.1,0.5,1.1,1.1v3.7
	C14.2,14.4,13.8,14.9,13.2,14.9C13.2,14.9,13.2,14.9,13.2,14.9z"/>
<path class="st5" d="M2.9,9.7C3.7,8.8,4.7,8.2,5.8,8c0-0.3,0-0.6,0-1C4.7,7.2,3.7,7.8,2.9,8.6c-1.1,1.1-1.8,2.5-2.1,4
	c-0.1,0.6-0.1,1.3-0.1,1.9c0-0.3,0-0.5,0.1-0.8C1.1,12.2,1.8,10.8,2.9,9.7z"/>
<linearGradient id="SVGID_4_" gradientUnits="userSpaceOnUse" x1="5.8" y1="25.345" x2="5.83" y2="25.345" gradientTransform="matrix(1 0 0 -1 0 31.73)">
	<stop  offset="0" style="stop-color:#CCCCCC"/>
	<stop  offset="1" style="stop-color:#F7F7F7"/>
</linearGradient>
<path class="st6" d="M5.8,5.7c0,0.4,0,0.9,0,1.4l0,0C5.8,6.6,5.8,6.1,5.8,5.7z"/>
<linearGradient id="SVGID_5_" gradientUnits="userSpaceOnUse" x1="12.39" y1="19.78" x2="14.01" y2="19.78" gradientTransform="matrix(1 0 0 -1 0 31.73)">
	<stop  offset="0" style="stop-color:#CCCCCC"/>
	<stop  offset="1" style="stop-color:#F7F7F7"/>
</linearGradient>
<path class="st7" d="M13.2,9.3L13.2,9.3c0.4,0,0.8,0.4,0.8,0.8v3.7c0,0.4-0.4,0.8-0.8,0.8h0c-0.4,0-0.8-0.4-0.8-0.8v-3.7
	C12.4,9.6,12.8,9.3,13.2,9.3z"/>
<linearGradient id="SVGID_6_" gradientUnits="userSpaceOnUse" x1="12.7" y1="21.02" x2="13.7" y2="21.02" gradientTransform="matrix(1 0 0 -1 0 31.73)">
	<stop  offset="0" style="stop-color:#DD922E"/>
	<stop  offset="0.71" style="stop-color:#F9AE42"/>
	<stop  offset="1" style="stop-color:#F8DB6E"/>
</linearGradient>
<path class="st8" d="M13.2,9.6L13.2,9.6c0.3,0,0.5,0.2,0.5,0.5v1.2c0,0.3-0.2,0.5-0.5,0.5l0,0c-0.3,0-0.5-0.2-0.5-0.5v-1.2
	C12.7,9.9,12.9,9.6,13.2,9.6z"/>
<linearGradient id="SVGID_7_" gradientUnits="userSpaceOnUse" x1="12.7" y1="18.53" x2="13.7" y2="18.53" gradientTransform="matrix(1 0 0 -1 0 31.73)">
	<stop  offset="0" style="stop-color:#DD922E"/>
	<stop  offset="0.71" style="stop-color:#F9AE42"/>
	<stop  offset="1" style="stop-color:#F8DB6E"/>
</linearGradient>
<path class="st9" d="M13.2,12.1L13.2,12.1c0.3,0,0.5,0.2,0.5,0.5v1.2c0,0.3-0.2,0.5-0.5,0.5l0,0c-0.3,0-0.5-0.2-0.5-0.5v-1.2
	C12.7,12.3,12.9,12.1,13.2,12.1z"/>
<path class="st5" d="M8.6,1.6c0.8-0.2,4.5-0.8,6.8,0.3c6.4,3.2,8.9,6.8,9,12.5c0-0.1,0-0.3,0-0.5c0-6-2.5-9.8-9-13
	c-2.3-1.1-6-0.5-6.8-0.3C7.7,0.7,6.8,1.2,6.3,2C5.9,3.2,5.7,4.4,5.8,5.6C5.8,4.7,6,3.8,6.3,3C6.8,2.2,7.6,1.6,8.6,1.6z"/>
<radialGradient id="SVGID_8_" cx="6.6583" cy="37.4477" r="3.59" gradientTransform="matrix(0.96 0 0 -1.63 -3.15 74.3699)" gradientUnits="userSpaceOnUse">
	<stop  offset="0" style="stop-color:#F7F7F7"/>
	<stop  offset="0.3" style="stop-color:#F3F3F3"/>
	<stop  offset="0.61" style="stop-color:#E7E7E7"/>
	<stop  offset="0.92" style="stop-color:#D3D3D3"/>
	<stop  offset="1" style="stop-color:#CCCCCC"/>
</radialGradient>
<path class="st10" d="M6,13.1c0.1,1.1,0,2.3-0.3,3.4c-0.2,0.7-0.9,1-1.6,0.8c0,0,0,0,0,0c-2.1-0.3-3.6-2.1-3.6-4.2
	c0-1.1,0.3-2.6,2.6-3.6c0.7-0.3,1.6-0.3,2.3,0C6,10.2,6,11.9,6,13.1z"/>
<path class="st5" d="M3.1,10.5c0.7-0.3,1.6-0.3,2.3,0C5.9,11,6,12.4,6,13.5c0-0.2,0-0.3,0-0.5c0-1.2,0-2.9-0.7-3.6
	c-0.7-0.3-1.6-0.3-2.3,0c-2.3,1-2.6,2.4-2.6,3.6c0,0.2,0,0.3,0,0.5C0.7,12.1,1.7,10.9,3.1,10.5z"/>
</svg>
