<?xml version="1.0" encoding="utf-8"?>
<!-- Generator: Adobe Illustrator 21.0.0, SVG Export Plug-In . SVG Version: 6.00 Build 0)  -->
<svg version="1.1" id="katman_1" xmlns="http://www.w3.org/2000/svg" xmlns:xlink="http://www.w3.org/1999/xlink" x="0px" y="0px"
	 viewBox="0 0 13.5 16" style="enable-background:new 0 0 13.5 16;" xml:space="preserve">
<style type="text/css">
	.st0{fill:#662D91;}
	.st1{fill:url(#SVGID_1_);}
	.st2{fill:#ED1C24;}
	.st3{fill:url(#SVGID_2_);}
	.st4{fill:url(#SVGID_3_);}
	.st5{fill:none;stroke:#000000;stroke-miterlimit:10;}
	.st6{fill:#F15A24;}
	.st7{fill:url(#SVGID_4_);}
	.st8{fill:url(#SVGID_5_);}
	.st9{fill:#90C265;}
	.st10{fill:#2E3192;}
	.st11{fill:url(#SVGID_6_);}
	.st12{fill:url(#SVGID_7_);}
	.st13{fill:#006837;}
	.st14{fill:url(#SVGID_8_);}
	.st15{fill:#009245;}
	.st16{fill:url(#SVGID_9_);}
	.st17{fill:url(#SVGID_10_);}
	.st18{fill:#FFFFFF;stroke:#000000;stroke-miterlimit:10;}
	.st19{fill:url(#SVGID_11_);}
	.st20{fill:#1B1464;}
	.st21{fill:url(#SVGID_12_);}
	.st22{opacity:0.1;fill:#FFFFFF;enable-background:new    ;}
	.st23{fill:url(#SVGID_13_);}
	.st24{opacity:0.1;enable-background:new    ;}
	.st25{fill:url(#SVGID_14_);}
	.st26{fill:url(#SVGID_15_);}
	.st27{fill:url(#SVGID_16_);}
	.st28{fill:#FFFFFF;}
</style>
<title>gnome-setting-theme_5</title>
<path class="st0" d="M3.2,8.8c-0.3,0-0.6-0.1-0.8-0.3C1.4,7.1,0.6,5.5,0,3.9l0,0l0,0l0.1-0.1c0.1-0.1,0.2-0.1,0.4-0.1
	c0.1,0,0.3,0,0.4,0.1c0.2,0.1,0.5,0.1,0.7,0.1c0.3,0,0.5,0,0.8-0.1c0.2,0,0.3-0.1,0.5-0.1H3c0.4,0,0.8,0.2,1.1,0.4l0,0l0,0
	c0,0.1-0.1,0.2-0.1,0.3c0,0.1,0,0.1,0,0.2v0.1h0c0,0.5,0.1,1,0.3,1.5c0.2,0.5,0.4,1.3,0.5,1.4l0,0L5,7.8l0.1,0.1L3.8,8.6
	C3.6,8.7,3.4,8.8,3.2,8.8L3.2,8.8z"/>
<linearGradient id="SVGID_1_" gradientUnits="userSpaceOnUse" x1="5.7362" y1="7.076" x2="0.4462" y2="12.146" gradientTransform="matrix(1 0 0 -1 0 15.73)">
	<stop  offset="0" style="stop-color:#682D91"/>
	<stop  offset="2.000000e-02" style="stop-color:#6B2D8E"/>
	<stop  offset="0.19" style="stop-color:#87286E"/>
	<stop  offset="0.37" style="stop-color:#9E2555"/>
	<stop  offset="0.56" style="stop-color:#AE2343"/>
	<stop  offset="0.77" style="stop-color:#B72138"/>
	<stop  offset="1" style="stop-color:#BA2135"/>
</linearGradient>
<path class="st1" d="M4.7,7.7L4.7,7.7L4.7,7.7c0,0-0.3-0.9-0.5-1.5C4,5.8,4,5.2,4,4.7h0c0-0.1,0-0.2,0-0.2c0-0.1,0.1-0.2,0.1-0.3
	C3.8,3.9,3.4,3.8,3,3.8c-0.2,0-0.4,0-0.6,0.1c-0.5,0.1-1,0.1-1.5,0c-0.2-0.1-0.5-0.1-0.7,0L0.1,3.9l0,0C0.7,5.5,1.5,7,2.5,8.4
	c0.3,0.3,0.9,0.4,1.3,0.2L5,7.9L4.7,7.7z"/>
<path class="st2" d="M6.6,8.6c-0.2,0-0.3,0-0.5-0.1C5.6,8.3,5.2,8,4.7,7.7l0,0l0,0c0,0-0.3-0.9-0.5-1.4C4.1,5.9,4,5.4,3.9,5H4
	c0.1,0.3,0.3,0.5,0.5,0.7l1.2,0.7V6.2l0.2,0.1l1,0.7c0.5,0.3,0.7,0.7,0.6,1C7.4,8.4,7,8.6,6.6,8.6L6.6,8.6z"/>
<linearGradient id="SVGID_2_" gradientUnits="userSpaceOnUse" x1="3.99" y1="8.9726" x2="7.46" y2="8.9726" gradientTransform="matrix(1 0 0 -1 0 15.73)">
	<stop  offset="0" style="stop-color:#BA2135"/>
	<stop  offset="1.000000e-02" style="stop-color:#BD2434"/>
	<stop  offset="0.12" style="stop-color:#D03C2D"/>
	<stop  offset="0.24" style="stop-color:#DF4E28"/>
	<stop  offset="0.39" style="stop-color:#E95A25"/>
	<stop  offset="0.58" style="stop-color:#EF6223"/>
	<stop  offset="1" style="stop-color:#F16422"/>
</linearGradient>
<path class="st3" d="M6.9,7l-1-0.7L5.8,6.3l0,0l0,0v0.1L4.5,5.7C4.3,5.5,4.1,5.3,4,5c0,0.4,0.1,0.8,0.3,1.2c0.2,0.5,0.5,1.4,0.5,1.4
	C5.2,8,5.7,8.2,6.2,8.4C6.6,8.6,7.2,8.6,7.4,8C7.5,7.6,7.3,7.3,6.9,7z"/>
<path class="st2" d="M4.5,5.7C4.1,5.4,3.9,4.9,4,4.4C4.7,2.8,5.6,1.4,6.6,0l0,0l0,0h0.1C7,0.2,7.1,0.4,7.2,0.7C7.4,1.2,7.6,1.6,8,2
	c0.2,0.1,0.3,0.3,0.4,0.5c0.2,0.4,0.3,0.8,0.2,1.2l0,0l0,0l-0.3,0L8,3.8c-0.5,0.2-0.9,0.6-1.2,1C6.4,5.2,5.8,6,5.8,6l0,0
	c0,0,0,0.2,0,0.3v0.1L4.5,5.7z"/>
<linearGradient id="SVGID_3_" gradientUnits="userSpaceOnUse" x1="4.7697" y1="10.0902" x2="8.4697" y2="15.0402" gradientTransform="matrix(1 0 0 -1 0 15.73)">
	<stop  offset="0" style="stop-color:#BA2135"/>
	<stop  offset="1.000000e-02" style="stop-color:#BD2434"/>
	<stop  offset="0.12" style="stop-color:#D03C2D"/>
	<stop  offset="0.24" style="stop-color:#DF4E28"/>
	<stop  offset="0.39" style="stop-color:#E95A25"/>
	<stop  offset="0.58" style="stop-color:#EF6223"/>
	<stop  offset="1" style="stop-color:#F16422"/>
</linearGradient>
<path class="st4" d="M5.7,6L5.7,6c0,0,0.6-0.7,1-1.1C7.1,4.4,7.5,4.1,8,3.8l0.2-0.1l0.3-0.1c0.1-0.4,0-0.8-0.2-1.2
	C8.2,2.3,8.1,2.1,7.9,2C7.6,1.6,7.3,1.2,7.2,0.7C7.1,0.5,7,0.3,6.8,0.1H6.7l0,0C5.6,1.4,4.7,2.9,4.1,4.4c-0.1,0.5,0.1,1,0.5,1.2
	l1.2,0.7C5.7,6.1,5.7,6,5.7,6z"/>
<path class="st5" d="M6.8,8.5"/>
<path class="st6" d="M6.7,8.5c-0.5,0-0.8-0.4-0.9-0.9C5.7,7.1,5.7,6.5,5.7,6l0,0c0,0,0.6-0.7,1-1.1C7,4.5,7.4,4.2,7.7,4l0.1,0.1
	C7.6,4.3,7.5,4.6,7.5,4.9v1.3l0,0l0,0v0.2c0,0-0.1,0.9-0.1,1.2c0,0.6-0.2,0.9-0.6,1L6.7,8.5z"/>
<linearGradient id="SVGID_4_" gradientUnits="userSpaceOnUse" x1="6.2975" y1="7.4902" x2="6.9975" y2="11.7902" gradientTransform="matrix(1 0 0 -1 0 15.73)">
	<stop  offset="0" style="stop-color:#F16422"/>
	<stop  offset="3.000000e-02" style="stop-color:#F16922"/>
	<stop  offset="0.35" style="stop-color:#F09E26"/>
	<stop  offset="0.64" style="stop-color:#EFC529"/>
	<stop  offset="0.86" style="stop-color:#EEDC2A"/>
	<stop  offset="1" style="stop-color:#EEE52B"/>
</linearGradient>
<path class="st7" d="M7.5,6.2L7.5,6.2V4.8c0-0.3,0.1-0.6,0.3-0.8c-0.4,0.2-0.7,0.5-1,0.8C6.4,5.3,5.8,6,5.8,6c0,0.5,0,1.1,0,1.6
	c0.1,0.5,0.4,1,1,0.9c0.3-0.1,0.5-0.4,0.5-0.9c0-0.3,0.1-1.2,0.1-1.2L7.5,6.2L7.5,6.2L7.5,6.2z"/>
<path class="st6" d="M11.1,7.3c-0.1-0.1-0.1-0.2-0.2-0.2l-0.2-0.1h-0.1l0,0c-0.4-0.3-0.9-0.4-1.4-0.5C8.8,6.3,7.9,6.1,7.8,6.1l0,0
	L7.5,6.3L7.4,6.3V4.8c0-0.5,0.3-1,0.8-1.1c0.5-0.1,1.1-0.1,1.6-0.1c1.2,0,2.3,0.1,3.5,0.2l0,0l0,0c0,0,0,0.1,0,0.1
	c0,0.3-0.2,0.5-0.4,0.7c-0.3,0.4-0.6,0.8-0.7,1.3c-0.1,0.2-0.1,0.4-0.2,0.6C11.8,6.8,11.5,7.1,11.1,7.3L11.1,7.3L11.1,7.3z"/>
<linearGradient id="SVGID_5_" gradientUnits="userSpaceOnUse" x1="7.47" y1="10.268" x2="13.37" y2="10.268" gradientTransform="matrix(1 0 0 -1 0 15.73)">
	<stop  offset="0" style="stop-color:#F16422"/>
	<stop  offset="6.000000e-02" style="stop-color:#F17923"/>
	<stop  offset="0.17" style="stop-color:#F09A26"/>
	<stop  offset="0.29" style="stop-color:#EFB528"/>
	<stop  offset="0.42" style="stop-color:#EFCA29"/>
	<stop  offset="0.57" style="stop-color:#EED92A"/>
	<stop  offset="0.74" style="stop-color:#EEE22B"/>
	<stop  offset="1" style="stop-color:#EEE52B"/>
</linearGradient>
<path class="st8" d="M7.8,6L7.8,6c0,0,1,0.2,1.5,0.3c0.5,0.1,1,0.3,1.5,0.6l0,0c0.1,0,0.2,0.1,0.2,0.1c0.1,0.1,0.1,0.2,0.2,0.2
	c0.4-0.2,0.7-0.4,0.9-0.8c0.1-0.2,0.2-0.4,0.2-0.6C12.4,5.4,12.7,5,13,4.6c0.2-0.2,0.3-0.4,0.4-0.6c0,0,0-0.1,0-0.1l0,0
	C11.7,3.7,10,3.6,8.3,3.8c-0.5,0.1-0.8,0.5-0.8,1v1.4L7.8,6z"/>
<path class="st9" d="M6.6,8.5l0.3,0.2L7,8.7c0.5-0.4,0.6-0.9,0.3-1.3C7.2,7.2,7,7.1,6.8,7.2c-0.2,0-0.4,0.1-0.5,0.1L6.2,7.4
	C6.1,7.4,6,7.5,6,7.6C5.9,7.9,6.1,8.2,6.6,8.5z"/>
<path class="st10" d="M3.3,11.9c-1.1,0-2.1-0.1-3.2-0.2l0,0l0,0c0,0,0-0.1,0-0.1c0-0.3,0.2-0.5,0.3-0.7c0.3-0.4,0.5-0.8,0.6-1.3
	C1.3,9,1.7,8.5,2.2,8.2l0,0l0,0l0.2,0.2l0.2,0.1h0l0,0C3,8.8,3.5,9,4,9.1c0.5,0.1,1.5,0.3,1.5,0.3l0,0L6,9.3h0.1v1.4
	c0,0.5-0.3,1-0.8,1.1C4.6,11.9,3.9,12,3.3,11.9z"/>
<linearGradient id="SVGID_6_" gradientUnits="userSpaceOnUse" x1="0.1872" y1="5.2606" x2="6.0272" y2="6.0606" gradientTransform="matrix(1 0 0 -1 0 15.73)">
	<stop  offset="0" style="stop-color:#01ABD0"/>
	<stop  offset="0.14" style="stop-color:#08A3CC"/>
	<stop  offset="0.36" style="stop-color:#1A8DC1"/>
	<stop  offset="0.63" style="stop-color:#3769AF"/>
	<stop  offset="0.94" style="stop-color:#5F3896"/>
	<stop  offset="1" style="stop-color:#682D91"/>
</linearGradient>
<path class="st11" d="M5.6,9.6L5.6,9.6c0,0-1-0.2-1.5-0.3c-0.5-0.1-1-0.3-1.5-0.6l0,0c-0.1,0-0.1-0.1-0.2-0.1L2.3,8.3
	C1.9,8.5,1.6,8.7,1.4,9.1C1.3,9.2,1.2,9.4,1.2,9.6c-0.1,0.5-0.4,0.9-0.7,1.3c-0.2,0.2-0.3,0.4-0.3,0.6c0,0,0,0.1,0,0.1l0,0
	c1.7,0.2,3.4,0.2,5.1,0c0.4-0.1,0.8-0.5,0.8-1l0-1.4L5.6,9.6z"/>
<linearGradient id="SVGID_7_" gradientUnits="userSpaceOnUse" x1="5.99" y1="8.5012" x2="10.49" y2="8.5012" gradientTransform="matrix(1 0 0 -1 0 15.73)">
	<stop  offset="0" style="stop-color:#7AC043"/>
	<stop  offset="0.31" style="stop-color:#5BB751"/>
	<stop  offset="0.97" style="stop-color:#0CA075"/>
	<stop  offset="1" style="stop-color:#089F77"/>
</linearGradient>
<path class="st12" d="M8.3,7.7L8.3,7.7l1.3-0.8c0.2-0.1,0.4-0.1,0.6-0.2c0.1,0,0.2,0,0.3,0c-0.4-0.2-0.8-0.3-1.2-0.4
	C8.8,6.2,7.8,6,7.8,6C7.4,6.3,6.9,6.6,6.5,6.9C6,7.1,5.9,7.7,6.1,8.1c0,0.1,0.1,0.1,0.1,0.1c0.2,0.3,0.6,0.2,1.1,0L8.3,7.7L8.3,7.7
	L8.3,7.7z"/>
<path class="st13" d="M10.6,11.8L10.6,11.8c-0.5,0-0.9-0.1-1.2-0.4l0,0l0,0c0-0.1,0.1-0.1,0.1-0.2v-0.1c0,0,0-0.2,0-0.3
	c0-0.5-0.1-1-0.3-1.5C9,8.8,8.7,7.9,8.7,7.9l0,0L8.4,7.7L8.3,7.6l1.3-0.8c0.2-0.1,0.4-0.1,0.6-0.2c0.3,0,0.6,0.1,0.8,0.3
	c1,1.4,1.9,2.9,2.5,4.5l0,0l0,0l-0.1,0.1c-0.1,0.1-0.3,0.1-0.4,0.1l0,0c-0.1,0-0.3,0-0.4,0c-0.2-0.1-0.4-0.1-0.6-0.1
	c-0.3,0-0.6,0-0.8,0.1C11,11.7,10.8,11.8,10.6,11.8z"/>
<linearGradient id="SVGID_8_" gradientUnits="userSpaceOnUse" x1="8.4" y1="6.5156" x2="13.42" y2="6.5156" gradientTransform="matrix(1 0 0 -1 0 15.73)">
	<stop  offset="0" style="stop-color:#7AC043"/>
	<stop  offset="0.31" style="stop-color:#5BB751"/>
	<stop  offset="0.97" style="stop-color:#0CA075"/>
	<stop  offset="1" style="stop-color:#089F77"/>
</linearGradient>
<path class="st14" d="M13.4,11.5c-0.6-1.6-1.5-3.1-2.5-4.4c-0.3-0.3-0.9-0.4-1.3-0.2L8.4,7.6l0.3,0.2l0,0l0,0c0,0,0.3,0.9,0.5,1.4
	c0.2,0.5,0.3,1,0.3,1.5c0,0.1,0,0.3,0,0.3v0.1c0,0.1,0,0.1-0.1,0.2c0.3,0.2,0.7,0.4,1.1,0.4c0.2,0,0.4,0,0.6-0.1
	c0.5-0.1,1-0.1,1.5,0C12.9,11.7,13.1,11.7,13.4,11.5L13.4,11.5L13.4,11.5L13.4,11.5z"/>
<path class="st15" d="M9.4,10.7c-0.1-0.3-0.2-0.6-0.5-0.8L7.7,9.3H7.7l0,0c0-0.4,0-0.9-0.1-1.3c0-0.3-0.2-0.5-0.4-0.7l0.1-0.1
	c0.5,0.2,1,0.5,1.4,0.8l0,0l0,0c0,0,0.3,0.9,0.5,1.4C9.4,9.8,9.5,10.3,9.4,10.7L9.4,10.7z"/>
<linearGradient id="SVGID_9_" gradientUnits="userSpaceOnUse" x1="8.5002" y1="8.0725" x2="8.2302" y2="5.9025" gradientTransform="matrix(1 0 0 -1 0 15.73)">
	<stop  offset="0" style="stop-color:#01ABD0"/>
	<stop  offset="0.29" style="stop-color:#04A6AB"/>
	<stop  offset="0.57" style="stop-color:#06A28E"/>
	<stop  offset="0.82" style="stop-color:#08A07D"/>
	<stop  offset="1" style="stop-color:#089F77"/>
</linearGradient>
<path class="st16" d="M7.7,7.9c0.1,0.4,0.1,0.9,0.1,1.3l0,0l1.1,0.6c0.3,0.2,0.5,0.5,0.5,0.8c0-0.5-0.1-0.9-0.3-1.4
	C9,8.8,8.7,7.9,8.7,7.9C8.2,7.6,7.8,7.3,7.3,7.1C7.5,7.3,7.6,7.6,7.7,7.9z"/>
<path class="st15" d="M6.8,15.6L6.8,15.6L6.8,15.6c-0.3-0.2-0.5-0.4-0.5-0.6c-0.1-0.5-0.4-0.9-0.8-1.2c-0.2-0.1-0.3-0.3-0.4-0.5
	c-0.2-0.4-0.3-0.8-0.2-1.3l0,0l0,0l0.3-0.1c0.2-0.1,0.3-0.1,0.5-0.2c0.3-0.2,0.7-0.5,0.9-0.9c0.3-0.4,0.9-1.1,1-1.1l0,0
	c0,0,0-0.1,0-0.2V9.3l0.1,0.1L8.9,10c0.3,0.2,0.6,0.6,0.6,1c0,0.1,0,0.1,0,0.2l0,0v0.1C8.8,12.8,7.9,14.3,6.8,15.6L6.8,15.6
	L6.8,15.6z"/>
<linearGradient id="SVGID_10_" gradientUnits="userSpaceOnUse" x1="7.9158" y1="6.6546" x2="5.5058" y2="-0.7854" gradientTransform="matrix(1 0 0 -1 0 15.73)">
	<stop  offset="0" style="stop-color:#01ABD0"/>
	<stop  offset="0.29" style="stop-color:#04A6AB"/>
	<stop  offset="0.57" style="stop-color:#06A28E"/>
	<stop  offset="0.82" style="stop-color:#08A07D"/>
	<stop  offset="1" style="stop-color:#089F77"/>
</linearGradient>
<path class="st17" d="M9.4,11.1L9.4,11.1c0-0.1,0-0.1,0-0.2c0-0.4-0.2-0.7-0.5-0.9L7.7,9.3c0,0.1,0,0.2,0,0.2l0,0c0,0-0.6,0.8-1,1.1
	c-0.3,0.3-0.6,0.6-1,0.9c-0.2,0.1-0.3,0.2-0.5,0.2l-0.3,0.1c-0.1,0.4,0,0.9,0.2,1.2c0.1,0.2,0.2,0.3,0.4,0.5
	c0.4,0.4,0.6,0.8,0.8,1.3c0.1,0.2,0.2,0.5,0.4,0.6h0.1l0,0C7.8,14.1,8.7,12.7,9.4,11.1L9.4,11.1L9.4,11.1z"/>
<path class="st18" d="M6.8,8.5"/>
<path class="st18" d="M6.8,8.8"/>
<path class="st0" d="M5.6,9.6c0,0-1-0.2-1.5-0.3C3.6,9.1,3.2,9,2.8,8.8V8.7c0.1,0,0.2,0,0.3,0c0.2,0,0.4,0,0.5-0.1L5,7.9H4.9L5,7.8
	l1.1-0.5c0.2-0.1,0.4-0.2,0.7-0.2c0.2,0,0.4,0.1,0.5,0.2c0.4,0.4,0.3,1-0.3,1.4C6.5,9,6.1,9.3,5.6,9.6L5.6,9.6L5.6,9.6z"/>
<linearGradient id="SVGID_11_" gradientUnits="userSpaceOnUse" x1="7.478" y1="7.5299" x2="3.098" y2="7.2399" gradientTransform="matrix(1 0 0 -1 0 15.73)">
	<stop  offset="0" style="stop-color:#682D91"/>
	<stop  offset="8.000000e-02" style="stop-color:#7A2A7C"/>
	<stop  offset="0.2" style="stop-color:#912762"/>
	<stop  offset="0.34" style="stop-color:#A4244E"/>
	<stop  offset="0.5" style="stop-color:#B02240"/>
	<stop  offset="0.69" style="stop-color:#B82138"/>
	<stop  offset="1" style="stop-color:#BA2135"/>
</linearGradient>
<path class="st19" d="M7.2,7.3C7,7.1,6.6,7.1,6.1,7.3L5.1,7.9l0,0l0,0L3.7,8.6C3.5,8.7,3.3,8.7,3.1,8.7c-0.1,0-0.2,0-0.3-0.1
	C3.2,8.9,3.6,9,4,9.1c0.5,0.1,1.5,0.3,1.5,0.3C6,9.2,6.5,9,7,8.7C7.4,8.4,7.5,7.8,7.2,7.3C7.3,7.4,7.2,7.4,7.2,7.3z"/>
<path class="st20" d="M5.7,11.5C5.9,11.2,6,11,6,10.7V9.3l0,0c0.4-0.2,0.7-0.4,1-0.6c0.5-0.4,0.6-0.9,0.3-1.3C7.2,7.2,7,7.1,6.8,7.2
	c-0.2,0-0.4,0.1-0.5,0.1L6.1,7.4l0.1-0.2C6.3,7.1,6.4,7,6.5,7h0.2c0.4,0,0.8,0.3,0.9,0.9C7.7,8.5,7.8,9,7.7,9.6l0,0
	c0,0-0.6,0.8-1,1.1c-0.3,0.3-0.6,0.6-1,0.9L5.7,11.5z"/>
<linearGradient id="SVGID_12_" gradientUnits="userSpaceOnUse" x1="7.9306" y1="7.2485" x2="4.1506" y2="5.6085" gradientTransform="matrix(1 0 0 -1 0 15.73)">
	<stop  offset="0" style="stop-color:#682D91"/>
	<stop  offset="6.000000e-02" style="stop-color:#5F3896"/>
	<stop  offset="0.37" style="stop-color:#3769AF"/>
	<stop  offset="0.64" style="stop-color:#1A8DC1"/>
	<stop  offset="0.86" style="stop-color:#08A3CC"/>
	<stop  offset="1" style="stop-color:#01ABD0"/>
</linearGradient>
<path class="st21" d="M7.6,7.9c-0.1-0.5-0.4-1-1-0.9C6.4,7,6.3,7.1,6.2,7.2c0.2-0.1,0.4-0.1,0.6-0.1c0.2,0,0.4,0.1,0.5,0.2
	c0.4,0.4,0.3,1-0.3,1.4C6.7,8.9,6.4,9.1,6.1,9.3v1.4c0,0.3-0.1,0.6-0.3,0.8c0.3-0.2,0.7-0.5,0.9-0.9c0.4-0.4,1-1.1,1-1.1
	C7.7,9,7.7,8.4,7.6,7.9z"/>
<path class="st22" d="M0.9,4.3c0.5,0.1,1,0.1,1.5,0C2.6,4.3,2.8,4.3,3,4.3c0.4,0,0.7,0.1,1,0.3c0-0.1,0-0.1,0-0.2
	c0-0.1,0.1-0.2,0.1-0.3C3.8,3.9,3.4,3.8,3,3.8c-0.2,0-0.4,0-0.6,0.1c-0.5,0.1-1,0.1-1.5,0c-0.2-0.1-0.5-0.1-0.7,0L0.1,3.9l0,0
	l0.2,0.4C0.4,4.3,0.7,4.3,0.9,4.3z"/>
<path class="st22" d="M4,4.8c0,0,0,0.1,0,0.1l0,0c0.7-1.6,1.6-3,2.7-4.4l0,0h0.1C7,0.7,7.1,1,7.2,1.2c0.1,0.5,0.4,0.9,0.8,1.3
	C8.1,2.6,8.2,2.8,8.3,3c0.1,0.2,0.2,0.4,0.2,0.7l0,0c0-0.4,0-0.8-0.2-1.2C8.2,2.3,8.1,2.1,7.9,2C7.6,1.6,7.3,1.2,7.2,0.7
	C7.1,0.5,7,0.3,6.8,0.1H6.7l0,0C5.6,1.4,4.7,2.9,4.1,4.4c0,0.1,0,0.1,0,0.2h0.1L4,4.8z"/>
<path class="st22" d="M8.5,4.2L8.2,4.2L8,4.3C7.8,4.4,7.6,4.5,7.5,4.6c0,0,0,0.1,0,0.1c0.1-0.1,0.2-0.1,0.3-0.2
	C7.6,4.6,7.5,4.8,7.5,5v0.3c0-0.5,0.3-0.9,0.8-1c1.7-0.2,3.3-0.1,5,0.1c0.1-0.1,0.1-0.3,0.1-0.4c0,0,0-0.1,0-0.1l0,0
	c-1.6-0.2-3.2-0.3-4.8-0.2C8.6,3.9,8.6,4,8.5,4.2z"/>
<path class="st22" d="M1.2,10.1c0-0.2,0.1-0.4,0.2-0.6C1.6,9.2,1.9,9,2.2,8.8L2.4,9c0.1,0.1,0.1,0.1,0.2,0.1l0,0
	c0.4,0.3,1,0.5,1.5,0.6c0.5,0.1,1.5,0.3,1.5,0.3l0,0L6,9.9v0.9c0,0,0-0.1,0-0.1V9.8L5.6,10c0,0-0.9-0.2-1.5-0.3
	C3.7,9.6,3.3,9.4,2.9,9.3c0.1,0,0.2,0.1,0.3,0.1c0.2,0,0.4,0,0.5-0.1l0,0H3.7C3.3,9.4,2.7,9.3,2.4,9C2.3,8.8,2.1,8.6,2,8.4
	C1.7,8.6,1.5,8.8,1.4,9.1C1.3,9.2,1.2,9.4,1.1,9.6c-0.1,0.5-0.4,0.9-0.7,1.3c-0.2,0.2-0.3,0.4-0.3,0.6c0,0,0,0.1,0,0.1h0.2
	c0.1-0.1,0.1-0.2,0.2-0.2C0.8,11.1,1,10.6,1.2,10.1z"/>
<linearGradient id="SVGID_13_" gradientUnits="userSpaceOnUse" x1="4.0623" y1="10.594" x2="3.9323" y2="10.544" gradientTransform="matrix(1 0 0 -1 0 15.73)">
	<stop  offset="0" style="stop-color:#682D91"/>
	<stop  offset="6.000000e-02" style="stop-color:#5F3896"/>
	<stop  offset="0.37" style="stop-color:#3769AF"/>
	<stop  offset="0.64" style="stop-color:#1A8DC1"/>
	<stop  offset="0.86" style="stop-color:#08A3CC"/>
	<stop  offset="1" style="stop-color:#01ABD0"/>
</linearGradient>
<path class="st23" d="M4,5.3c0-0.1,0-0.1,0-0.2V5C4,5.1,4,5.2,4,5.3z"/>
<path class="st22" d="M13.4,11.5c-0.6-1.3-1.2-2.6-2-3.8c-0.1,0-0.1,0.1-0.2,0.1h-0.1c0.8,1.2,1.6,2.5,2.1,3.8h0.1L13.4,11.5
	L13.4,11.5L13.4,11.5z"/>
<path class="st24" d="M2.4,8.5c0.1,0.1,0.1,0.1,0.2,0.1l0,0C2.9,8.8,3.3,9,3.7,9.1l0,0h0.1C3.5,9,3.2,8.9,2.9,8.8
	c0.1,0,0.2,0.1,0.3,0.1c0.2,0,0.4,0,0.5-0.1l0.9-0.5V8.1L3.8,8.6C3.3,8.8,2.8,8.8,2.4,8.5C1.6,7.2,0.8,5.8,0.2,4.3H0.2L0.1,4.4l0,0
	c0.5,1.4,1.2,2.7,2,4l0.2-0.1L2.4,8.5z"/>
<linearGradient id="SVGID_14_" gradientUnits="userSpaceOnUse" x1="4.076" y1="10.298" x2="4.016" y2="10.268" gradientTransform="matrix(1 0 0 -1 0 15.73)">
	<stop  offset="0" style="stop-color:#682D91"/>
	<stop  offset="6.000000e-02" style="stop-color:#5F3896"/>
	<stop  offset="0.37" style="stop-color:#3769AF"/>
	<stop  offset="0.64" style="stop-color:#1A8DC1"/>
	<stop  offset="0.86" style="stop-color:#08A3CC"/>
	<stop  offset="1" style="stop-color:#01ABD0"/>
</linearGradient>
<path class="st25" d="M4.1,5.6c0-0.1,0-0.2,0-0.2C4.1,5.4,4.1,5.5,4.1,5.6z"/>
<path class="st22" d="M8,3.8C7.5,4,7.1,4.4,6.8,4.8c-0.4,0.4-1,1.1-1,1.1V6c0,0,0,0.2,0,0.3L4.6,5.6C4.3,5.5,4.1,5.3,4.1,5
	C4,5,4,5.1,4,5.1c0.1,0.2,0.3,0.5,0.5,0.6l1.3,0.7l0,0l0,0l0,0c0-0.2,0-0.4,0-0.4s0.6-0.7,1-1.1c0.3-0.3,0.6-0.6,1-0.8
	C7.6,4.2,7.4,4.5,7.4,4.7l0.1-0.1c0.1-0.4,0.4-0.7,0.8-0.8l0.3,0V3.7l-0.3,0L8,3.8z"/>
<path class="st24" d="M12.3,5.9c-0.1,0.2-0.1,0.4-0.2,0.6c-0.2,0.3-0.5,0.6-0.9,0.8C11.1,7.2,11.1,7.1,11,7
	c-0.1-0.1-0.1-0.1-0.2-0.2l0,0c-0.5-0.3-1-0.5-1.5-0.6C8.8,6.2,7.8,6,7.8,6l0,0L7.5,6.2v0.1l0.3-0.2c0,0,1,0.2,1.5,0.3
	c0.4,0.1,0.8,0.2,1.2,0.4c-0.1,0-0.2,0-0.3,0c-0.2,0-0.4,0.1-0.6,0.2l0,0h0.1c0.4-0.2,0.9-0.1,1.3,0.2c0.2,0.2,0.3,0.4,0.5,0.6
	c0.2-0.2,0.4-0.4,0.6-0.7c0.1-0.2,0.2-0.4,0.2-0.6C12.4,6,12.7,5.5,13,5.1c0.2-0.2,0.3-0.4,0.4-0.7c0,0,0-0.1,0-0.1l0,0h-0.1
	c-0.1,0.1-0.1,0.2-0.2,0.2C12.7,5,12.4,5.4,12.3,5.9z"/>
<path class="st24" d="M4.9,11.8l0.3-0.1c0.2-0.1,0.3-0.1,0.5-0.2L6,11.4c0,0,0-0.1,0-0.1c-0.1,0.1-0.2,0.1-0.3,0.2
	C5.9,11.4,5.9,11.2,6,11v-0.2c0,0.4-0.4,0.8-0.8,0.9c-1.7,0.2-3.3,0.2-5,0c-0.1,0.1-0.1,0.3-0.1,0.4c0,0,0,0.1,0,0.1l0,0
	c1.6,0.2,3.2,0.2,4.8,0.1C4.8,12.1,4.9,12,4.9,11.8z"/>
<path class="st22" d="M7.4,4.8v0.5c0-0.1,0-0.2,0.1-0.3L7.4,4.8C7.5,4.8,7.5,4.7,7.4,4.8L7.4,4.8L7.4,4.8z"/>
<linearGradient id="SVGID_15_" gradientUnits="userSpaceOnUse" x1="6.2498" y1="5.5105" x2="5.7998" y2="5.3105" gradientTransform="matrix(1 0 0 -1 0 15.73)">
	<stop  offset="0" style="stop-color:#682D91"/>
	<stop  offset="6.000000e-02" style="stop-color:#5F3896"/>
	<stop  offset="0.37" style="stop-color:#3769AF"/>
	<stop  offset="0.64" style="stop-color:#1A8DC1"/>
	<stop  offset="0.86" style="stop-color:#08A3CC"/>
	<stop  offset="1" style="stop-color:#01ABD0"/>
</linearGradient>
<path class="st26" d="M6.1,10.8c0,0,0-0.1,0-0.1V9.8l0,0V10.8z"/>
<path class="st24" d="M13.2,11.6c-0.2,0.1-0.4,0.1-0.6,0c-0.5-0.1-1-0.1-1.5,0c-0.2,0.1-0.4,0.1-0.6,0.1c-0.4,0-0.7-0.1-1-0.3v0.2
	v0.1c0,0.1,0,0.1-0.1,0.2c0.3,0.2,0.7,0.4,1.1,0.4c0.2,0,0.4,0,0.6-0.1c0.5-0.1,1-0.1,1.5,0c0.2,0.1,0.5,0.1,0.7,0l0.1-0.1l0,0
	L13.2,11.6z"/>
<path class="st24" d="M9.4,11.3c0,0,0-0.1,0-0.1c-0.7,1.5-1.5,3-2.6,4.3l0,0H6.7c-0.2-0.2-0.3-0.4-0.4-0.6c-0.1-0.5-0.4-0.9-0.8-1.3
	c-0.1-0.1-0.3-0.3-0.4-0.5C5.1,12.9,5,12.6,5,12.4c-0.1,0.4,0,0.8,0.2,1.2c0.1,0.2,0.2,0.3,0.4,0.5c0.4,0.4,0.6,0.8,0.8,1.3
	c0,0.2,0.2,0.5,0.4,0.6h0.1l0,0c1.1-1.3,1.9-2.8,2.6-4.4v-0.1l0,0C9.4,11.5,9.4,11.4,9.4,11.3L9.4,11.3L9.4,11.3z"/>
<circle class="st2" cx="6.7" cy="7.7" r="0.6"/>
<radialGradient id="SVGID_16_" cx="19.8974" cy="2.5617" r="0.59" gradientTransform="matrix(0.92 0 0 -0.92 -11.58 10.1016)" gradientUnits="userSpaceOnUse">
	<stop  offset="0" style="stop-color:#EEE52B"/>
	<stop  offset="0.14" style="stop-color:#EEDC2A"/>
	<stop  offset="0.36" style="stop-color:#EFC529"/>
	<stop  offset="0.65" style="stop-color:#F09E26"/>
	<stop  offset="0.97" style="stop-color:#F16922"/>
	<stop  offset="1" style="stop-color:#F16422"/>
</radialGradient>
<circle class="st27" cx="6.7" cy="7.7" r="0.5"/>
<path class="st22" d="M6.7,7.4c0.3,0,0.5,0.2,0.5,0.4c0.1-0.3-0.1-0.6-0.4-0.7S6.2,7.3,6.2,7.6c0,0.1,0,0.2,0,0.3
	C6.2,7.6,6.4,7.4,6.7,7.4z"/>
<path class="st24" d="M6.7,8.3c-0.3,0-0.5-0.2-0.5-0.4C6.1,8.1,6.3,8.4,6.5,8.5s0.6-0.1,0.7-0.4c0-0.1,0-0.2,0-0.3
	C7.1,8.1,6.9,8.3,6.7,8.3z"/>
<path class="st28" d="M11.2,7.6"/>
</svg>
