<?xml version="1.0" encoding="utf-8"?>
<!-- Generator: Adobe Illustrator 21.0.0, SVG Export Plug-In . SVG Version: 6.00 Build 0)  -->
<svg version="1.1" id="katman_1" xmlns="http://www.w3.org/2000/svg" xmlns:xlink="http://www.w3.org/1999/xlink" x="0px" y="0px"
	 viewBox="0 0 48 41.5" style="enable-background:new 0 0 48 41.5;" xml:space="preserve">
<style type="text/css">
	.st0{opacity:0.2;enable-background:new    ;}
	.st1{fill:#793D1A;}
	.st2{fill:url(#SVGID_1_);}
	.st3{fill:url(#SVGID_2_);}
	.st4{fill:url(#SVGID_3_);}
	.st5{opacity:0.1;enable-background:new    ;}
	.st6{opacity:0.1;fill:#FFFFFF;enable-background:new    ;}
	.st7{fill:url(#SVGID_4_);}
	.st8{fill:url(#SVGID_5_);}
	.st9{fill:url(#SVGID_6_);}
	.st10{opacity:0.7;fill:#793D1A;}
</style>
<title>folder-templates_1</title>
<polygon class="st0" points="43.9,41.5 48,35.2 47,35.2 43.9,40 "/>
<path class="st1" d="M47.6,4.4c0-0.6-0.5-1.2-1.2-1.2H28.9V1.2c0-0.6-0.5-1.2-1.2-1.2c0,0,0,0,0,0H14.9c-0.6,0-1.2,0.5-1.2,1.2v2.1
	h-3.1c-0.6,0-1.2,0.5-1.2,1.2c0,0,0,0,0,0v4L8.3,7.9c-1.2-0.6-2.4-1-3.7-1.2C3.7,6.7,2,8.2,1.5,8.9C0.9,9.6,0.4,10.4,0,11.3
	c-0.3,0.9,1.1,3.5,1.7,4.4L2.6,17l-2.2,3.6c-0.1,0.2-0.2,0.4-0.2,0.6v8.4c0,0.3,0.1,0.6,0.3,0.8l4.3,4.5l2.3,4.9
	c0.2,0.4,0.6,0.6,1,0.7l35.4-0.1H44l3.4-5.2l0.2-0.3L47.6,4.4z"/>
<linearGradient id="SVGID_1_" gradientUnits="userSpaceOnUse" x1="28.56" y1="6.8" x2="28.56" y2="43.63" gradientTransform="matrix(1 0 0 -1 0 41.73)">
	<stop  offset="0" style="stop-color:#793D1A;stop-opacity:0.8"/>
	<stop  offset="1" style="stop-color:#C96E28"/>
</linearGradient>
<path class="st2" d="M28.6,3.4V1.2c0-0.4-0.4-0.8-0.8-0.8l0,0H14.9c-0.4,0-0.8,0.4-0.8,0.8v2.3c0,0.1-0.1,0.2-0.2,0.2h-3.3
	c-0.4,0-0.8,0.4-0.8,0.8l0,0v30.4h37.4V4.4c0-0.4-0.4-0.8-0.8-0.8l0,0H28.8C28.6,3.6,28.6,3.6,28.6,3.4C28.6,3.4,28.6,3.4,28.6,3.4z
	"/>
<linearGradient id="SVGID_2_" gradientUnits="userSpaceOnUse" x1="49.2788" y1="0.8887" x2="43.6988" y2="6.0187" gradientTransform="matrix(1 0 0 -1 0 41.73)">
	<stop  offset="0" style="stop-color:#C96E28"/>
	<stop  offset="1" style="stop-color:#793D1A;stop-opacity:0.8"/>
</linearGradient>
<polygon class="st3" points="43.9,40 47.3,34.9 42,34.9 "/>
<linearGradient id="SVGID_3_" gradientUnits="userSpaceOnUse" x1="22.1379" y1="2.01" x2="22.1379" y2="34.77" gradientTransform="matrix(1 0 0 -1 0 41.73)">
	<stop  offset="0" style="stop-color:#DD922E"/>
	<stop  offset="6.000000e-02" style="stop-color:#F9AE42"/>
	<stop  offset="0.42" style="stop-color:#F8DB6E"/>
	<stop  offset="1" style="stop-color:#FDDEB1"/>
</linearGradient>
<path class="st4" d="M43.1,6.4H14.6c-0.9,1-1.8,2.1-2.6,3.2c-0.2,0.1-0.3,0.1-0.5,0.1L9.1,8.6L8.1,8.2C7,7.6,5.9,7.2,4.6,7
	C4,7,2.3,8.4,1.8,9.1c-0.6,0.7-1,1.5-1.4,2.3c-0.2,0.6,0.9,2.9,1.7,4.1L3,17l-2.3,3.8c-0.1,0.1-0.1,0.3-0.1,0.4v8.4
	c0,0.2,0.1,0.4,0.2,0.5l4.3,4.5c0,0,0.1,0.1,0.1,0.1l2.3,4.9c0.1,0.3,0.4,0.5,0.7,0.5L43.9,40V7.2C43.9,6.7,43.6,6.4,43.1,6.4
	C43.1,6.4,43.1,6.4,43.1,6.4z"/>
<path class="st5" d="M44.3,5.1H15.8c-0.4,0.4-0.8,0.8-1.2,1.2h28.5c0.4,0,0.8,0.4,0.8,0.8c0,0,0,0,0,0V40l1.2-1.9V5.9
	C45.1,5.5,44.8,5.1,44.3,5.1C44.4,5.1,44.4,5.1,44.3,5.1z"/>
<path class="st6" d="M14.9,1.8h12.8c0.4,0,0.8,0.4,0.8,0.8c0,0,0,0,0,0V1.2c0-0.4-0.4-0.8-0.8-0.8l0,0H14.9c-0.4,0-0.8,0.4-0.8,0.8
	v1.5C14.2,2.2,14.5,1.8,14.9,1.8C14.9,1.8,14.9,1.8,14.9,1.8z"/>
<path class="st6" d="M10.6,5.1H14c0.1,0,0.2-0.1,0.2-0.2V3.4c0,0.1-0.1,0.2-0.2,0.2h-3.4c-0.4,0-0.8,0.4-0.8,0.8l0,0v1.5
	C9.9,5.5,10.2,5.1,10.6,5.1z"/>
<path class="st6" d="M46.5,3.6H28.8c-0.1,0-0.2-0.1-0.2-0.2c0,0,0,0,0,0v1.5c0,0.1,0.1,0.2,0.2,0.2l0,0h17.7c0.4,0,0.8,0.4,0.8,0.8
	c0,0,0,0,0,0V4.4C47.3,4,46.9,3.6,46.5,3.6L46.5,3.6z"/>
<path class="st6" d="M43.1,6.4H14.6c-0.9,1-1.8,2.1-2.6,3.2c-0.2,0.1-0.3,0.1-0.5,0.1L9.1,8.6L8.1,8.2C7,7.6,5.9,7.2,4.6,7
	C4,7,2.3,8.4,1.8,9.1c-0.6,0.7-1,1.5-1.4,2.3c0,0.4,0,0.7,0.2,1.1c0.3-0.7,0.7-1.3,1.2-1.9c0.6-0.7,2.2-2.1,2.9-2
	C5.9,8.8,7,9.1,8.1,9.7l0.9,0.4l2.4,1.1c0.2,0,0.3-0.1,0.5-0.1c0.8-1.1,1.7-2.2,2.6-3.2h28.5c0.4,0,0.8,0.4,0.8,0.8v0V7.2
	C43.9,6.7,43.5,6.4,43.1,6.4L43.1,6.4z"/>
<path class="st0" d="M7.6,39.6l-2.4-4.9c0,0,0-0.1-0.1-0.1l-4.3-4.5c-0.1-0.1-0.2-0.3-0.2-0.5V31c0,0.2,0.1,0.4,0.2,0.5l4.3,4.5
	c0,0,0.1,0.1,0.1,0.1l2.3,4.9c0.1,0.3,0.4,0.5,0.7,0.5l35.6-0.1V40L8.3,40.1C8,40.1,7.7,39.9,7.6,39.6z"/>
<linearGradient id="SVGID_4_" gradientUnits="userSpaceOnUse" x1="23.63" y1="-237.24" x2="23.63" y2="-237.24" gradientTransform="matrix(1 0 0 1 0 257.81)">
	<stop  offset="0" style="stop-color:#CC6D00;stop-opacity:0.8"/>
	<stop  offset="1" style="stop-color:#7A3B00"/>
</linearGradient>
<path class="st7" d="M23.6,20.6"/>
<linearGradient id="SVGID_5_" gradientUnits="userSpaceOnUse" x1="23.48" y1="-237.24" x2="23.48" y2="-237.24" gradientTransform="matrix(1 0 0 1 0 257.81)">
	<stop  offset="0" style="stop-color:#CC6D00;stop-opacity:0.8"/>
	<stop  offset="1" style="stop-color:#7A3B00"/>
</linearGradient>
<path class="st8" d="M23.5,20.6"/>
<linearGradient id="SVGID_6_" gradientUnits="userSpaceOnUse" x1="26.52" y1="-232.38" x2="26.52" y2="-232.38" gradientTransform="matrix(1 0 0 1 0 257.81)">
	<stop  offset="0" style="stop-color:#CC6D00;stop-opacity:0.8"/>
	<stop  offset="1" style="stop-color:#7A3B00"/>
</linearGradient>
<path class="st9" d="M26.5,25.4"/>
<rect x="12.8" y="14.8" class="st10" width="23.3" height="2.6"/>
<rect x="12.8" y="33.7" class="st10" width="23.3" height="2.6"/>
<rect x="12.8" y="18.4" class="st10" width="14.2" height="14.2"/>
<rect x="28.3" y="18.4" class="st10" width="7.8" height="14.2"/>
</svg>
