<?xml version="1.0" encoding="utf-8"?>
<!-- Generator: Adobe Illustrator 21.0.0, SVG Export Plug-In . SVG Version: 6.00 Build 0)  -->
<svg version="1.1" id="katman_1" xmlns="http://www.w3.org/2000/svg" xmlns:xlink="http://www.w3.org/1999/xlink" x="0px" y="0px"
	 viewBox="0 0 16 11.6" style="enable-background:new 0 0 16 11.6;" xml:space="preserve">
<style type="text/css">
	.st0{opacity:0.1;fill:#010101;enable-background:new    ;}
	.st1{opacity:0.7;fill:#1A1A1A;enable-background:new    ;}
	.st2{fill:url(#SVGID_1_);}
	.st3{opacity:0.1;fill:#FFFFFF;enable-background:new    ;}
	.st4{opacity:0.7;fill:#42210B;enable-background:new    ;}
	.st5{opacity:0.5;fill:#666666;enable-background:new    ;}
	.st6{fill:url(#SVGID_2_);}
	.st7{fill:url(#SVGID_3_);}
	.st8{fill:url(#SVGID_4_);}
	.st9{fill:url(#SVGID_5_);}
	.st10{fill:url(#SVGID_6_);}
	.st11{fill:#FFC807;}
	.st12{fill:url(#SVGID_7_);}
	.st13{fill:#333333;}
	.st14{fill:#4D4D4D;}
</style>
<title>applications_science_5</title>
<path class="st0" d="M15.7,0.6L9.5,4.9c0,0-0.1,0-0.1,0l-9,0.4h0H0.2C0.1,5.4,0,5.5,0,5.7s0.2,0.2,0.4,0.2l9-0.4c0,0,0.1,0,0.1,0
	l6.2-4.4c0.1-0.1,0.1-0.3,0-0.4C15.8,0.7,15.7,0.7,15.7,0.6z"/>
<path class="st1" d="M0.4,5.5C0.2,5.5,0,5.4,0,5.2c0-0.2,0-0.3,0.2-0.4l6.5-4c0.1,0,0.1,0,0.2,0L15.6,0l0,0c0.2,0,0.4,0.1,0.4,0.3
	c0.1,0.2,0,0.3-0.1,0.4L9.6,5C9.5,5,9.4,5.1,9.4,5.1L0.4,5.5z"/>
<linearGradient id="SVGID_1_" gradientUnits="userSpaceOnUse" x1="-1944.1471" y1="245.3456" x2="-1944.6571" y2="251.5456" gradientTransform="matrix(0.9625 -0.2714 -0.2714 -0.9625 1946.6698 -286.4454)">
	<stop  offset="5.000000e-02" style="stop-color:#1A1A1A"/>
	<stop  offset="0.39" style="stop-color:#1D1D1D"/>
	<stop  offset="0.66" style="stop-color:#272727"/>
	<stop  offset="0.91" style="stop-color:#383838"/>
	<stop  offset="1" style="stop-color:#404040"/>
</linearGradient>
<path class="st2" d="M0.2,4.9l6.5-4h0.1l8.7-0.8c0.1,0,0.3,0.1,0.3,0.2c0,0.1,0,0.2-0.1,0.2L9.5,4.9c0,0-0.1,0-0.1,0l-9,0.4
	C0.2,5.3,0.1,5.2,0.2,5C0.2,5,0.2,5,0.2,4.9z"/>
<path class="st0" d="M3.1,8.9c0-0.1-0.1-0.2-0.2-0.2c0,0,0,0,0,0H3c0.1,0,0.1-0.1,0.1-0.1S3.1,8.4,3,8.4c0.1,0,0.1-0.1,0.1-0.1
	S3.1,8.2,3,8.2c0.1,0,0.1-0.1,0.1-0.1C3.1,8,3.1,7.9,3,7.9L2.9,5.6L8,3.2L7.6,3L2.4,5.4l0.2,2.5l0,0C2.6,7.9,2.5,8,2.5,8
	c0,0.1,0.1,0.1,0.1,0.1l0,0c-0.1,0-0.1,0.1-0.1,0.1s0.1,0.1,0.1,0.1l0,0c-0.1,0-0.1,0.1-0.1,0.1s0.1,0.1,0.1,0.1l0,0l0,0
	c-0.1,0-0.2,0.1-0.2,0.2l0,0.3L2,11.4c0,0.1,0.1,0.2,0.2,0.2h1.1c0.1,0,0.2-0.1,0.2-0.2c0,0,0,0,0,0L3.2,9.2L3.1,8.9z"/>
<path class="st3" d="M6.9,1.4l8.7-0.8h0.1l0.1,0c0.1-0.1,0.1-0.2,0.1-0.4c-0.1-0.1-0.1-0.1-0.2-0.1L6.9,0.9L6.8,1L0.2,5
	C0.1,5.1,0.1,5.2,0.2,5.4c0,0.1,0.1,0.1,0.2,0.1l6.4-4L6.9,1.4z"/>
<path class="st0" d="M14.2,6.7V6.5C13.8,7.3,12,8.4,10,9C7.7,9.7,5.1,9.6,4.9,8.8l0,0L4.2,6.6H4.1l0.8,2.7l0,0
	c0.2,0.8,2.8,0.9,5.1,0.2S14.4,7.5,14.2,6.7L14.2,6.7z"/>
<path class="st4" d="M2.2,11.5c-0.2,0-0.3-0.1-0.3-0.3l0.4-2.6c0-0.1,0-0.1,0.1-0.2c0.1-0.1,0.1-0.1,0.2-0.1h0.3
	c0.2,0,0.3,0.1,0.3,0.3l0,0.3l0.3,2.2c0,0.1,0,0.2-0.1,0.3c-0.1,0.1-0.1,0.1-0.2,0.1L2.2,11.5z"/>
<polygon class="st5" points="2.3,5.1 7.6,2.7 8.4,3 3,5.4 3.1,8 2.6,8.1 "/>
<path class="st4" d="M2.6,8.3c-0.1,0-0.3-0.1-0.3-0.2c0-0.1,0.1-0.3,0.2-0.3c0,0,0.1,0,0.1,0H3c0.1,0,0.3,0.1,0.3,0.2
	c0,0.1-0.1,0.3-0.2,0.3c0,0-0.1,0-0.1,0H2.6z"/>
<path class="st4" d="M2.6,8.6c-0.1,0-0.3-0.1-0.3-0.2c0-0.1,0.1-0.3,0.2-0.3c0,0,0.1,0,0.1,0H3c0.1,0,0.2,0.2,0.2,0.3
	c0,0.1-0.1,0.2-0.2,0.2H2.6z"/>
<path class="st4" d="M2.6,8C2.5,8,2.3,7.9,2.3,7.8c0-0.1,0.1-0.3,0.2-0.3c0,0,0.1,0,0.1,0H3c0.1,0,0.2,0.2,0.2,0.3
	C3.2,7.9,3.1,8,3,8H2.6z"/>
<path class="st1" d="M6.9,9.6c-0.7,0-1.8-0.1-2.1-0.6l0,0L4.7,8.8L3.9,6l5.9-0.3l3.7-2.6L14.3,6l0,0v0.1c0.2,1-2.1,2.4-4.3,3
	C9,9.4,7.9,9.6,6.9,9.6z"/>
<linearGradient id="SVGID_2_" gradientUnits="userSpaceOnUse" x1="-1944.1587" y1="241.4131" x2="-1944.2288" y2="245.7431" gradientTransform="matrix(0.9625 -0.2714 -0.2714 -0.9625 1946.6698 -286.4454)">
	<stop  offset="5.000000e-02" style="stop-color:#1A1A1A"/>
	<stop  offset="0.39" style="stop-color:#1D1D1D"/>
	<stop  offset="0.66" style="stop-color:#272727"/>
	<stop  offset="0.91" style="stop-color:#383838"/>
	<stop  offset="1" style="stop-color:#404040"/>
</linearGradient>
<path class="st6" d="M13.4,3.4L9.8,5.8L4.1,6.1l0.8,2.7l0,0C5.1,9.6,7.6,9.7,9.9,9s4.5-2,4.2-2.9l0,0L13.4,3.4z"/>
<linearGradient id="SVGID_3_" gradientUnits="userSpaceOnUse" x1="-1947.5052" y1="244.8734" x2="-1947.8352" y2="247.3034" gradientTransform="matrix(0.9625 -0.2714 -0.2714 -0.9625 1946.6698 -286.4454)">
	<stop  offset="0" style="stop-color:#A3A4A4"/>
	<stop  offset="0.62" style="stop-color:#CCCBCB"/>
	<stop  offset="1" style="stop-color:#E7E6E6"/>
</linearGradient>
<polygon class="st7" points="8,3 7.6,2.8 2.4,5.2 2.7,7.9 3,7.9 2.9,5.3 "/>
<linearGradient id="SVGID_4_" gradientUnits="userSpaceOnUse" x1="2.48" y1="5.96" x2="3.09" y2="5.96" gradientTransform="matrix(1 0 0 -1 0 14)">
	<stop  offset="0.25" style="stop-color:#CC2A31"/>
	<stop  offset="0.47" style="stop-color:#C92930"/>
	<stop  offset="0.65" style="stop-color:#BE272F"/>
	<stop  offset="0.83" style="stop-color:#AC232B"/>
	<stop  offset="0.99" style="stop-color:#931D27"/>
	<stop  offset="0.99" style="stop-color:#931D27"/>
</linearGradient>
<path class="st8" d="M2.6,8.2C2.5,8.2,2.5,8.1,2.5,8c0-0.1,0.1-0.1,0.1-0.1H3C3.1,7.9,3.1,8,3.1,8c0,0.1-0.1,0.1-0.1,0.1H2.6z"/>
<linearGradient id="SVGID_5_" gradientUnits="userSpaceOnUse" x1="2.48" y1="5.7" x2="3.09" y2="5.7" gradientTransform="matrix(1 0 0 -1 0 14)">
	<stop  offset="0.25" style="stop-color:#CC2A31"/>
	<stop  offset="0.47" style="stop-color:#C92930"/>
	<stop  offset="0.65" style="stop-color:#BE272F"/>
	<stop  offset="0.83" style="stop-color:#AC232B"/>
	<stop  offset="0.99" style="stop-color:#931D27"/>
	<stop  offset="0.99" style="stop-color:#931D27"/>
</linearGradient>
<path class="st9" d="M2.6,8.4c-0.1,0-0.1-0.1-0.1-0.1s0.1-0.1,0.1-0.1H3c0.1,0,0.1,0.1,0.1,0.1S3.1,8.4,3,8.4H2.6z"/>
<linearGradient id="SVGID_6_" gradientUnits="userSpaceOnUse" x1="2.48" y1="6.22" x2="3.09" y2="6.22" gradientTransform="matrix(1 0 0 -1 0 14)">
	<stop  offset="0.25" style="stop-color:#CC2A31"/>
	<stop  offset="0.47" style="stop-color:#C92930"/>
	<stop  offset="0.65" style="stop-color:#BE272F"/>
	<stop  offset="0.83" style="stop-color:#AC232B"/>
	<stop  offset="0.99" style="stop-color:#931D27"/>
	<stop  offset="0.99" style="stop-color:#931D27"/>
</linearGradient>
<path class="st10" d="M2.6,7.9c-0.1,0-0.1-0.1-0.1-0.1s0.1-0.1,0.1-0.1H3c0.1,0,0.1,0.1,0.1,0.1S3.1,7.9,3,7.9H2.6z"/>
<path class="st11" d="M2.2,11.4c-0.1,0-0.2-0.1-0.2-0.2c0,0,0,0,0,0l0.3-2.2l0-0.3c0-0.1,0.1-0.2,0.2-0.2h0.3c0.1,0,0.2,0.1,0.2,0.2
	c0,0,0,0,0,0L3.2,9l0.3,2.2c0,0.1-0.1,0.2-0.2,0.2c0,0,0,0,0,0L2.2,11.4z"/>
<linearGradient id="SVGID_7_" gradientUnits="userSpaceOnUse" x1="2.01" y1="4.095" x2="3.53" y2="4.095" gradientTransform="matrix(1 0 0 -1 0 14)">
	<stop  offset="0" style="stop-color:#000000;stop-opacity:0"/>
	<stop  offset="0.91" style="stop-color:#000000;stop-opacity:0.31"/>
	<stop  offset="1" style="stop-color:#000000;stop-opacity:0.39"/>
</linearGradient>
<path class="st12" d="M2.2,11.4c-0.1,0-0.2-0.1-0.2-0.2c0,0,0,0,0,0l0.3-2.2l0-0.3c0-0.1,0.1-0.2,0.2-0.2h0.3c0.1,0,0.2,0.1,0.2,0.2
	c0,0,0,0,0,0L3.2,9l0.3,2.2c0,0.1-0.1,0.2-0.2,0.2c0,0,0,0,0,0L2.2,11.4z"/>
<path class="st3" d="M13.4,3.9l0.8,2.7c0.1-0.1,0.1-0.3,0.1-0.4l0,0l-0.8-2.8L9.8,5.8L4.1,6.1l0.1,0.5l5.6-0.3L13.4,3.9z"/>
<path class="st0" d="M6.7,3.7c0.1,0.2,0.7,0.2,1.4,0S9.4,3.2,9.3,3S9.2,2.9,9,2.8C8.7,3,8.4,3.1,8.1,3.2C7.7,3.3,7.4,3.4,7,3.4
	C6.8,3.5,6.7,3.6,6.7,3.7z"/>
<path class="st13" d="M7.1,3.5c-0.3,0-0.5-0.1-0.6-0.2s0.1-0.3,0.4-0.5c0.3-0.2,0.6-0.3,0.9-0.4c0.3-0.1,0.7-0.2,1-0.2
	c0.3,0,0.5,0.1,0.6,0.2c0.1,0.4-0.8,0.8-1.3,0.9C7.8,3.4,7.5,3.5,7.1,3.5z"/>
<ellipse transform="matrix(0.9625 -0.2714 0.2714 0.9625 -0.4753 2.2804)" class="st14" cx="8" cy="2.9" rx="1.4" ry="0.4"/>
</svg>
