<?xml version="1.0" encoding="utf-8"?>
<!-- Generator: Adobe Illustrator 21.0.0, SVG Export Plug-In . SVG Version: 6.00 Build 0)  -->
<svg version="1.1" id="katman_1" xmlns="http://www.w3.org/2000/svg" xmlns:xlink="http://www.w3.org/1999/xlink" x="0px" y="0px"
	 viewBox="0 0 20.8 22" style="enable-background:new 0 0 20.8 22;" xml:space="preserve">
<style type="text/css">
	.st0{fill:#FFFFFF;}
	.st1{fill:#2E3033;}
</style>
<title>document-new_7</title>
<path class="st0" d="M16,2v18c0,0.9-0.7,1.5-1.5,1.5h0H2c-0.8,0-1.5-0.7-1.5-1.5l0,0V2c0-0.8,0.7-1.5,1.5-1.5h12.5
	C15.3,0.5,16,1.2,16,2z"/>
<path class="st1" d="M14.4,21.7H2c-0.9,0-1.7-0.8-1.7-1.7V2c0-0.9,0.8-1.7,1.7-1.7h12.5c0.9,0,1.7,0.8,1.7,1.7l0,0v18
	C16.2,20.9,15.4,21.7,14.4,21.7z M2,0.7C1.3,0.7,0.7,1.3,0.7,2v18c0,0.7,0.5,1.3,1.2,1.3c0,0,0,0,0,0h12.4c0.7,0,1.3-0.5,1.3-1.3
	c0,0,0,0,0,0V2c0-0.7-0.6-1.3-1.3-1.3H2z"/>
<path class="st1" d="M14.4,22H2c-1.1,0-2-0.9-2-2l0,0V2c0-1.1,0.9-2,2-2h12.4c1.1,0,2,0.9,2,1.9V20C16.5,21.1,15.6,22,14.4,22z
	 M2,0.8C1.3,0.8,0.8,1.3,0.8,2c0,0,0,0,0,0l0,0v18c0,0.7,0.5,1.2,1.2,1.2c0,0,0,0,0,0h12.4c0.7,0,1.2-0.5,1.3-1.2V2
	c0-0.7-0.5-1.2-1.2-1.2c0,0,0,0,0,0H2z"/>
<rect x="3" y="17.8" class="st1" width="10.4" height="0.4"/>
<rect x="3" y="15" class="st1" width="10.4" height="0.4"/>
<rect x="3" y="12.2" class="st1" width="10.4" height="0.4"/>
<rect x="3" y="9.4" class="st1" width="10.4" height="0.4"/>
<rect x="3" y="6.6" class="st1" width="10.4" height="0.4"/>
<rect x="3" y="3.8" class="st1" width="10.4" height="0.4"/>
<path class="st1" d="M19.9,11.9h-4.1V7.8C15.8,7.4,15.5,7,15,7c0,0,0,0,0,0h-3.3c-0.5,0-0.8,0.4-0.8,0.8v4.1H6.7
	c-0.5,0-0.8,0.4-0.8,0.8v3.4c0,0.5,0.4,0.8,0.8,0.8h4.1V21c0,0.5,0.4,0.8,0.8,0.8H15c0.5,0,0.8-0.4,0.8-0.8v-4.1h4.1
	c0.5,0,0.8-0.4,0.8-0.8v-3.4C20.8,12.3,20.4,11.9,19.9,11.9z"/>
</svg>
