<?xml version="1.0" encoding="utf-8"?>
<!-- Generator: Adobe Illustrator 21.0.0, SVG Export Plug-In . SVG Version: 6.00 Build 0)  -->
<svg version="1.1" id="katman_1" xmlns="http://www.w3.org/2000/svg" xmlns:xlink="http://www.w3.org/1999/xlink" x="0px" y="0px"
	 viewBox="0 0 22 20.4" style="enable-background:new 0 0 22 20.4;" xml:space="preserve">
<style type="text/css">
	.st0{fill:#2F3134;}
</style>
<title>preferences-desktop_1</title>
<path class="st0" d="M9.3,5C8.8,5.1,8.4,4.9,8.2,4.4C8,4.1,8,3.6,8.3,3.3l0,0c0.1-0.1,0.1-0.3,0-0.4C8,2.6,7.7,2.4,7.4,2.2
	C7.3,2.1,7.1,2.2,7,2.3C6.7,2.8,6,2.9,5.6,2.5C5.3,2.3,5.1,2,5.1,1.7c0-0.1-0.1-0.3-0.3-0.2c-0.4,0-0.7,0-1.1,0.1
	c-0.1,0-0.2,0.2-0.2,0.3C3.6,2.3,3.4,2.8,3,3C2.6,3.2,2.1,3.1,1.8,2.8c-0.1-0.1-0.3-0.1-0.4,0C1.1,3.1,0.9,3.4,0.7,3.7
	c0,0.1,0,0.2,0.1,0.3c0.4,0.3,0.5,0.7,0.4,1.2c-0.1,0.4-0.5,0.7-1,0.8C0.1,6,0,6.1,0,6.2c0,0.4,0,0.7,0.1,1.1c0,0.1,0.2,0.2,0.3,0.2
	C0.9,7.4,1.3,7.6,1.5,8c0.2,0.4,0.1,0.9-0.1,1.2c-0.1,0.1-0.1,0.3,0,0.4c0,0,0,0,0,0c0.3,0.3,0.5,0.5,0.9,0.7c0.1,0.1,0.3,0,0.4-0.1
	c0.3-0.3,0.7-0.5,1.2-0.4c0.4,0.1,0.8,0.5,0.8,1c0,0.1,0.1,0.3,0.3,0.2c0.4,0,0.7,0,1.1-0.1c0.1,0,0.2-0.2,0.2-0.3
	c-0.1-0.4,0.2-0.9,0.5-1.1c0.4-0.2,0.9-0.2,1.2,0.1c0.1,0.1,0.3,0.1,0.4,0C8.5,9.5,8.8,9.2,9,8.8c0.1-0.1,0-0.3-0.1-0.4
	C8.6,8.2,8.4,7.8,8.5,7.3c0.1-0.4,0.5-0.7,1-0.8c0.1,0,0.3-0.1,0.2-0.3c0-0.4,0-0.7-0.1-1.1C9.6,5,9.4,5,9.3,5z M6.1,7.2
	C5.6,8,4.6,8.1,3.9,7.5S3,6,3.6,5.3S5.2,4.4,5.9,5c0,0,0,0,0,0C6.6,5.6,6.7,6.6,6.1,7.2z"/>
<path class="st0" d="M21.6,12.8c-0.9-0.1-1.5-1-1.4-1.9c0.1-0.5,0.4-0.9,0.8-1.2c0.2-0.1,0.2-0.4,0.1-0.6c-0.3-0.5-0.6-1-1-1.4
	c-0.1-0.2-0.4-0.2-0.6-0.1c-0.6,0.4-1.3,0.5-2,0.1c-0.6-0.4-0.9-1.1-0.7-1.8c0.1-0.2-0.1-0.4-0.3-0.5c-0.6-0.2-1.1-0.3-1.7-0.3
	c-0.2,0-0.4,0.1-0.4,0.4c-0.1,0.7-0.6,1.3-1.3,1.4c-0.7,0.1-1.4-0.2-1.8-0.7c-0.1-0.2-0.4-0.2-0.6-0.1c-0.5,0.3-1,0.6-1.4,1
	C9.2,7.3,9.1,7.5,9.3,7.7c0.4,0.6,0.5,1.3,0.1,2c-0.4,0.6-1.1,0.9-1.8,0.7c-0.2-0.1-0.4,0.1-0.5,0.3c0,0,0,0,0,0
	c-0.2,0.6-0.3,1.1-0.3,1.7c0,0.2,0.2,0.4,0.4,0.4c0.7,0.1,1.2,0.6,1.4,1.3c0.2,0.7-0.1,1.4-0.7,1.8c-0.2,0.1-0.2,0.4-0.1,0.6
	c0.3,0.5,0.6,1,1,1.4c0.1,0.2,0.4,0.2,0.6,0c0.6-0.4,1.3-0.5,1.9-0.1c0.6,0.4,0.9,1.1,0.7,1.8c-0.1,0.2,0.1,0.4,0.3,0.5
	c0.6,0.2,1.1,0.3,1.7,0.3c0.2,0,0.4-0.1,0.4-0.4c0.1-0.7,0.6-1.3,1.3-1.4c0.7-0.1,1.4,0.2,1.8,0.7c0.1,0.2,0.4,0.2,0.6,0.1
	c0.5-0.3,1-0.6,1.4-1c0.2-0.1,0.2-0.4,0-0.6c-0.4-0.6-0.5-1.3-0.1-1.9c0.4-0.6,1-0.9,1.7-0.8h0.1c0.2,0.1,0.4-0.1,0.5-0.3
	c0.2-0.6,0.3-1.1,0.3-1.7C22,13,21.8,12.8,21.6,12.8z M16.9,13.3c-0.2,1.4-1.5,2.3-2.9,2.1s-2.3-1.5-2.1-2.9
	c0.2-1.4,1.5-2.3,2.9-2.1C16.2,10.6,17.1,11.9,16.9,13.3L16.9,13.3z"/>
</svg>
