<?xml version="1.0" encoding="utf-8"?>
<!-- Generator: Adobe Illustrator 21.0.0, SVG Export Plug-In . SVG Version: 6.00 Build 0)  -->
<svg version="1.1" id="katman_1" xmlns="http://www.w3.org/2000/svg" xmlns:xlink="http://www.w3.org/1999/xlink" x="0px" y="0px"
	 viewBox="0 0 23.4 24" style="enable-background:new 0 0 23.4 24;" xml:space="preserve">
<style type="text/css">
	.st0{opacity:0.7;fill:#333333;enable-background:new    ;}
	.st1{fill:#1A1A1A;}
	.st2{fill:url(#SVGID_1_);}
	.st3{opacity:0.5;fill:#FFFFFF;enable-background:new    ;}
	.st4{fill:url(#SVGID_2_);}
	.st5{fill:url(#SVGID_3_);}
	.st6{fill:url(#SVGID_4_);}
	.st7{fill:url(#SVGID_5_);}
	.st8{fill:url(#SVGID_6_);}
	.st9{fill:url(#SVGID_7_);}
	.st10{fill:url(#SVGID_8_);}
	.st11{fill:url(#SVGID_9_);}
	.st12{fill:url(#SVGID_10_);}
	.st13{fill:url(#SVGID_11_);}
	.st14{fill:url(#SVGID_12_);}
	.st15{fill:#58595B;}
	.st16{opacity:0.2;fill:#FFFFFF;enable-background:new    ;}
	.st17{opacity:0.1;fill:#FFFFFF;enable-background:new    ;}
	.st18{opacity:0.2;fill:#010101;enable-background:new    ;}
	.st19{fill:#FF0000;}
	.st20{fill:url(#SVGID_13_);}
	.st21{fill:url(#SVGID_14_);}
	.st22{fill:#00FFFF;}
	.st23{opacity:0.2;fill:#383838;enable-background:new    ;}
</style>
<title>Varlık 10</title>
<path class="st0" d="M4.5,23.5l0.1-1.6H4.1L4.2,20H1.3c-0.5,0-0.9-0.3-1-0.7v-0.1c-0.1-0.1-0.2-0.2-0.2-0.3c0,0-0.1-1.9-0.1-2.5
	c0-1.1,0-4.1,0-4.9l0,0c0,0,0-0.1,0-0.1c0-0.1,0-0.1,0-0.2C0,10.6,0.1,9.4,0.1,9s0.2-1.3,0.3-1.7C0.5,7.2,0.6,7,0.7,7h3.9L4.4,2h0.7
	V0h13v2h0.8l-0.2,5.1h3.9c0.2,0,0.3,0.1,0.3,0.3c0.1,0.4,0.3,1.3,0.3,1.7s0.1,1.6,0.1,2.1c0,0,0,0.1,0,0.1c0,0,0,0.1,0,0.1
	c0,0,0,3.6,0,4.9c0,0.5,0,2.5,0,2.5c0,0.1,0,0.2-0.1,0.3c0,0.1,0,0.1,0,0.2c-0.1,0.5-0.5,0.8-1,0.8h-3l0.1,1.9h-0.6l0.1,1.6
	L4.5,23.5z"/>
<path class="st1" d="M23,18.9L23,18.9c0,0.4-0.4,0.8-0.8,0.8l0,0h-21c-0.4,0-0.8-0.4-0.8-0.8l0,0l0,0H23L23,18.9z"/>
<linearGradient id="SVGID_1_" gradientUnits="userSpaceOnUse" x1="11.745" y1="3.77" x2="11.745" y2="4.96" gradientTransform="matrix(1 0 0 -1 0 23.73)">
	<stop  offset="5.000000e-02" style="stop-color:#0F0F0F"/>
	<stop  offset="0.31" style="stop-color:#161616"/>
	<stop  offset="0.7" style="stop-color:#2B2B2B"/>
	<stop  offset="1" style="stop-color:#404040"/>
</linearGradient>
<path class="st2" d="M0.5,19H23l0,0l0,0c0,0.4-0.3,0.8-0.8,0.8h-21C0.8,19.8,0.5,19.4,0.5,19C0.5,19,0.5,19,0.5,19L0.5,19L0.5,19z"
	/>
<path class="st3" d="M0.5,18.9L0.5,18.9c0,0.1,0,0.2,0.1,0.4H23c0.1-0.1,0.1-0.2,0.1-0.4H0.5z"/>
<polygon class="st1" points="4.9,7.8 4.6,2.1 18.7,2.1 18.6,7.8 "/>
<path class="st1" d="M0.3,11.2c-0.1,0-0.1,0-0.1-0.1c0,0,0-0.1,0-0.1c0-0.4,0-1.6,0.1-2s0.2-1.4,0.3-1.7c0-0.1,0.1-0.1,0.1-0.1h4
	c0.1,0,0.1,0.1,0.1,0.1c0,0,0,0,0,0c0,0.3-0.2,1.3-0.2,1.6s0,1.7-0.1,2c0,0.1-0.1,0.1-0.1,0.1l0,0L0.3,11.2z"/>
<path class="st1" d="M18.9,11.2c-0.1,0-0.1-0.1-0.1-0.1c0-0.4,0-1.6,0-2s-0.1-1.3-0.2-1.6c0-0.1,0-0.1,0.1-0.1c0,0,0,0,0,0h4
	c0.1,0,0.1,0,0.1,0.1c0.1,0.3,0.3,1.3,0.3,1.7s0.1,1.7,0.1,2c0,0.1,0,0.1-0.1,0.1c0,0,0,0,0,0L18.9,11.2z"/>
<path class="st1" d="M0.7,19c-0.2,0-0.4-0.1-0.4-0.3c0,0,0,0,0,0c0,0-0.1-1.8-0.1-2.4c0-1.2,0-4.9,0-5c0-0.1,0.1-0.1,0.1-0.1
	c0,0,0,0,0,0h22.8c0.1,0,0.1,0.1,0.1,0.1c0,0,0,3.6,0,4.9c0,0.5,0,2.5,0,2.5c0,0.2-0.1,0.3-0.3,0.3c0,0,0,0,0,0L0.7,19z"/>
<linearGradient id="SVGID_2_" gradientUnits="userSpaceOnUse" x1="4.66" y1="-359.81" x2="18.71" y2="-359.81" gradientTransform="matrix(1 0 0 1 0 364.77)">
	<stop  offset="0" style="stop-color:#E7E6E6"/>
	<stop  offset="9.000000e-02" style="stop-color:#A3A4A4"/>
	<stop  offset="0.92" style="stop-color:#A3A4A4"/>
	<stop  offset="1" style="stop-color:#E7E6E6"/>
</linearGradient>
<polygon class="st4" points="18.7,2.1 4.7,2.1 4.9,7.8 18.5,7.8 "/>
<linearGradient id="SVGID_3_" gradientUnits="userSpaceOnUse" x1="4.93" y1="-359.825" x2="18.45" y2="-359.825" gradientTransform="matrix(1 0 0 1 0 364.77)">
	<stop  offset="0" style="stop-color:#A3A4A4"/>
	<stop  offset="3.000000e-02" style="stop-color:#B1B1B1"/>
	<stop  offset="0.1" style="stop-color:#D5D5D5"/>
	<stop  offset="0.12" style="stop-color:#E7E6E6"/>
	<stop  offset="0.89" style="stop-color:#E7E6E6"/>
	<stop  offset="1" style="stop-color:#A3A4A4"/>
</linearGradient>
<polygon class="st5" points="4.9,2.1 5.1,7.8 18.3,7.8 18.5,2.1 "/>
<rect x="5.3" y="0.1" class="st1" width="12.6" height="7.7"/>
<linearGradient id="SVGID_4_" gradientUnits="userSpaceOnUse" x1="11.655" y1="15.91" x2="11.655" y2="24.28" gradientTransform="matrix(1 0 0 -1 0 23.73)">
	<stop  offset="0" style="stop-color:#A3A4A4"/>
	<stop  offset="1.000000e-02" style="stop-color:#A6A7A7"/>
	<stop  offset="0.14" style="stop-color:#BFC0C0"/>
	<stop  offset="0.28" style="stop-color:#D3D3D4"/>
	<stop  offset="0.44" style="stop-color:#E1E1E2"/>
	<stop  offset="0.64" style="stop-color:#E9E9EA"/>
	<stop  offset="1" style="stop-color:#EBEBEC"/>
</linearGradient>
<rect x="5.4" y="0.2" class="st6" width="12.6" height="7.6"/>
<rect x="3.6" y="7.7" class="st1" width="16.4" height="3.4"/>
<linearGradient id="SVGID_5_" gradientUnits="userSpaceOnUse" x1="11.7245" y1="12.67" x2="11.7245" y2="15.83" gradientTransform="matrix(1 0 0 -1 0 23.73)">
	<stop  offset="5.000000e-02" style="stop-color:#0F0F0F"/>
	<stop  offset="0.19" style="stop-color:#131313"/>
	<stop  offset="0.32" style="stop-color:#1E1E1E"/>
	<stop  offset="0.45" style="stop-color:#313131"/>
	<stop  offset="0.53" style="stop-color:#404040"/>
	<stop  offset="0.61" style="stop-color:#2F2F2F"/>
	<stop  offset="0.73" style="stop-color:#1D1D1D"/>
	<stop  offset="0.85" style="stop-color:#121212"/>
	<stop  offset="1" style="stop-color:#0F0F0F"/>
</linearGradient>
<path class="st7" d="M18.6,11.2H4.8c0,0-0.1-1.7,0-2.4c0-0.4,0.1-0.7,0.2-1.1c0,0,10.7,0.1,13.5,0.1C18.7,8.9,18.8,10.1,18.6,11.2z"
	/>
<linearGradient id="SVGID_6_" gradientUnits="userSpaceOnUse" x1="2.5352" y1="12.54" x2="2.5352" y2="16.47" gradientTransform="matrix(1 0 0 -1 0 23.73)">
	<stop  offset="0" style="stop-color:#B1B3B6"/>
	<stop  offset="0.16" style="stop-color:#B4B6B9"/>
	<stop  offset="0.28" style="stop-color:#BDBFC1"/>
	<stop  offset="0.39" style="stop-color:#CDCECF"/>
	<stop  offset="0.49" style="stop-color:#E4E3E3"/>
	<stop  offset="0.5" style="stop-color:#E7E6E6"/>
	<stop  offset="0.55" style="stop-color:#DFDFDF"/>
	<stop  offset="0.72" style="stop-color:#C6C7C9"/>
	<stop  offset="0.88" style="stop-color:#B6B8BB"/>
	<stop  offset="1" style="stop-color:#B1B3B6"/>
</linearGradient>
<path class="st8" d="M4.5,11.2H0.3c-0.1,0-0.1,0-0.1-0.1c0-0.4,0-1.6,0.1-2s0.2-1.4,0.3-1.7c0-0.1,0.1-0.1,0.1-0.1h4
	c0.1,0,0.1,0,0.1,0.1c0,0,0,0,0,0c0,0.3-0.2,1.3-0.2,1.6s0,1.7-0.1,2C4.6,11.1,4.6,11.1,4.5,11.2C4.5,11.2,4.5,11.2,4.5,11.2z"/>
<linearGradient id="SVGID_7_" gradientUnits="userSpaceOnUse" x1="20.8748" y1="12.43" x2="20.8748" y2="16.52" gradientTransform="matrix(1 0 0 -1 0 23.73)">
	<stop  offset="0" style="stop-color:#B1B3B6"/>
	<stop  offset="0.16" style="stop-color:#B4B6B9"/>
	<stop  offset="0.28" style="stop-color:#BDBFC1"/>
	<stop  offset="0.39" style="stop-color:#CDCECF"/>
	<stop  offset="0.49" style="stop-color:#E4E3E3"/>
	<stop  offset="0.5" style="stop-color:#E7E6E6"/>
	<stop  offset="0.55" style="stop-color:#DFDFDF"/>
	<stop  offset="0.72" style="stop-color:#C6C7C9"/>
	<stop  offset="0.88" style="stop-color:#B6B8BB"/>
	<stop  offset="1" style="stop-color:#B1B3B6"/>
</linearGradient>
<path class="st9" d="M18.9,11.2h4.1c0.1,0,0.1,0,0.1-0.1l0,0c0-0.4,0-1.6-0.1-2s-0.2-1.4-0.3-1.7c0-0.1-0.1-0.1-0.1-0.1h-4
	c-0.1,0-0.1,0-0.1,0.1c0,0,0,0,0,0c0,0.3,0.2,1.3,0.2,1.6s0,1.7,0,2C18.8,11.1,18.8,11.2,18.9,11.2C18.9,11.2,18.9,11.2,18.9,11.2z"
	/>
<linearGradient id="SVGID_8_" gradientUnits="userSpaceOnUse" x1="11.7" y1="4.95" x2="11.7" y2="15.72" gradientTransform="matrix(1 0 0 -1 0 23.73)">
	<stop  offset="0" style="stop-color:#818486"/>
	<stop  offset="0.18" style="stop-color:#8D9091"/>
	<stop  offset="0.51" style="stop-color:#ADAEAF"/>
	<stop  offset="0.95" style="stop-color:#E1E0E0"/>
	<stop  offset="1" style="stop-color:#E7E6E6"/>
</linearGradient>
<path class="st10" d="M22.8,19H0.7c-0.2,0-0.3-0.1-0.4-0.3c0,0,0,0,0,0c0,0-0.1-1.8-0.1-2.5c0-1.2,0-5,0-5c0-0.1,0-0.1,0.1-0.1h22.7
	c0.1,0,0.1,0,0.1,0.1l0,0c0,0,0,3.5,0,4.9c0,0.5,0,2.5,0,2.5C23.1,18.9,23,19,22.8,19C22.8,19,22.8,19,22.8,19z"/>
<linearGradient id="SVGID_9_" gradientUnits="userSpaceOnUse" x1="4.26" y1="4.94" x2="19.16" y2="4.94" gradientTransform="matrix(1 0 0 -1 0 23.73)">
	<stop  offset="0" style="stop-color:#E7E6E6"/>
	<stop  offset="9.000000e-02" style="stop-color:#A3A4A4"/>
	<stop  offset="0.92" style="stop-color:#A3A4A4"/>
	<stop  offset="1" style="stop-color:#E7E6E6"/>
</linearGradient>
<polygon class="st11" points="19.2,21.6 4.3,21.6 4.5,16 19,16 "/>
<linearGradient id="SVGID_10_" gradientUnits="userSpaceOnUse" x1="4.54" y1="5.06" x2="18.89" y2="5.06" gradientTransform="matrix(1 0 0 -1 0 23.73)">
	<stop  offset="0" style="stop-color:#A3A4A4"/>
	<stop  offset="3.000000e-02" style="stop-color:#B1B1B1"/>
	<stop  offset="0.1" style="stop-color:#D5D5D5"/>
	<stop  offset="0.12" style="stop-color:#E7E6E6"/>
	<stop  offset="0.89" style="stop-color:#E7E6E6"/>
	<stop  offset="1" style="stop-color:#A3A4A4"/>
</linearGradient>
<polygon class="st12" points="4.5,21.4 4.8,16 18.7,16 18.9,21.4 "/>
<linearGradient id="SVGID_11_" gradientUnits="userSpaceOnUse" x1="11.735" y1="0.46" x2="11.735" y2="7.83" gradientTransform="matrix(1 0 0 -1 0 23.73)">
	<stop  offset="0" style="stop-color:#E7E6E6"/>
	<stop  offset="1" style="stop-color:#E9E3E2"/>
</linearGradient>
<polygon class="st13" points="18.7,23.3 4.7,23.3 5.3,15.9 18.1,15.9 "/>
<path class="st1" d="M19.1,16H4.3v-0.9c0-0.9,0.7-1.7,1.6-1.7c0,0,0,0,0,0h11.4c0.9,0,1.7,0.8,1.7,1.7l0,0V16z"/>
<linearGradient id="SVGID_12_" gradientUnits="userSpaceOnUse" x1="11.705" y1="10.79" x2="11.705" y2="7.43" gradientTransform="matrix(1 0 0 -1 0 23.73)">
	<stop  offset="0" style="stop-color:#404040"/>
	<stop  offset="0.37" style="stop-color:#252525"/>
	<stop  offset="0.7" style="stop-color:#151515"/>
	<stop  offset="0.95" style="stop-color:#0F0F0F"/>
</linearGradient>
<path class="st14" d="M4.4,15.9H19v-0.8c0-0.9-0.7-1.6-1.6-1.6l0,0H6c-0.9,0-1.6,0.7-1.6,1.6l0,0L4.4,15.9z"/>
<rect x="6.7" y="16.8" class="st15" width="10" height="0.3"/>
<rect x="6.6" y="17.6" class="st15" width="10.3" height="0.3"/>
<rect x="6.5" y="18.5" class="st15" width="10.4" height="0.3"/>
<rect x="6.4" y="19.3" class="st15" width="10.7" height="0.3"/>
<rect x="6.3" y="20.2" class="st15" width="10.9" height="0.3"/>
<rect x="6.2" y="21.1" class="st15" width="11.1" height="0.3"/>
<rect x="6.1" y="21.9" class="st15" width="11.3" height="0.3"/>
<rect x="0.2" y="11.1" class="st1" width="22.9" height="0.1"/>
<path class="st16" d="M0.2,12.3V12c0-0.1,0-0.1,0.1-0.1h22.7c0.1,0,0.1,0,0.1,0.1l0,0v0.3l0,0c0-0.6,0-1,0-1c0-0.1,0-0.1-0.1-0.1
	l0,0H0.4c-0.1,0-0.1,0-0.1,0.1C0.2,11.3,0.2,11.7,0.2,12.3L0.2,12.3z"/>
<path class="st17" d="M17.4,13.5H6.1c-0.9,0-1.6,0.7-1.6,1.6l0,0v0.7c0-0.9,0.7-1.6,1.6-1.6l0,0h11.3c0.9,0,1.6,0.7,1.6,1.6v-0.7
	C19,14.2,18.3,13.5,17.4,13.5L17.4,13.5z"/>
<path class="st16" d="M0.3,10.1c0-0.1,0-0.3,0-0.4C0.3,9.4,0.6,8.4,0.6,8c0-0.1,0.1-0.1,0.1-0.1h4c0,0,0.1,0,0.1,0V7.7l0,0V7.6V7.2
	c0,0-0.1,0-0.1,0h-4c-0.1,0-0.1,0-0.1,0.1C0.6,7.6,0.3,8.6,0.3,9S0.2,9.7,0.3,10.1L0.3,10.1z"/>
<path class="st16" d="M18.7,7.9h4c0,0,0.1,0,0.1,0.1c0.1,0.3,0.3,1.3,0.3,1.7c0,0.1,0,0.2,0,0.4l0,0c0-0.4,0-0.9-0.1-1.1
	s-0.2-1.4-0.3-1.7c0-0.1-0.1-0.1-0.1-0.1h-4c0,0-0.1,0-0.1,0v0.4v0.1l0,0V8C18.5,7.9,18.6,7.9,18.7,7.9z"/>
<polygon class="st16" points="18.5,2.1 18,2.1 18,2.8 18.5,2.8 18.7,2.8 18.7,2.1 "/>
<rect x="5.3" y="0.1" class="st16" width="12.6" height="0.7"/>
<polygon class="st16" points="5.3,2.8 5.3,2.1 4.9,2.1 4.6,2.1 4.7,2.8 4.9,2.8 "/>
<polygon class="st18" points="4.7,24 18.7,24 18.7,23.3 4.8,23.3 "/>
<path class="st16" d="M4.9,7.7V7.5v0.2V7.7z"/>
<path class="st16" d="M18.6,7.5v0.3l0,0V7.6V7.5z"/>
<polygon class="st18" points="18.7,22.4 19.2,22.4 19.1,21.6 18.6,21.6 "/>
<path class="st18" d="M23.1,18.8L23.1,18.8c0,0.1,0,0.1-0.1,0.2c0,0.1,0,0.1,0,0.2l0,0c-0.1,0.4-0.4,0.6-0.8,0.6h-3.2v0.7h3.1
	c0.4,0,0.7-0.3,0.8-0.6l0,0c0-0.1,0-0.1,0-0.2c0.1,0,0.1-0.1,0.1-0.2L23.1,18.8L23.1,18.8z"/>
<polygon class="st18" points="4.3,21.6 4.3,22.4 4.8,22.4 4.9,21.6 "/>
<path class="st18" d="M0.5,19.1L0.5,19.1c0,0,0-0.1,0-0.1c-0.1-0.1-0.2-0.1-0.2-0.2l0,0v0.7c0,0.1,0.1,0.2,0.2,0.2c0,0,0,0.1,0,0.1
	l0,0c0.1,0.4,0.4,0.6,0.8,0.6h3v-0.7h-3C0.9,19.8,0.6,19.5,0.5,19.1z"/>
<circle class="st19" cx="21.2" cy="13.2" r="0.4"/>
<ellipse class="st1" cx="21.2" cy="11.1" rx="0.8" ry="1.2"/>
<radialGradient id="SVGID_13_" cx="21.21" cy="12.59" r="0.98" gradientTransform="matrix(1 0 0 -1 0 23.73)" gradientUnits="userSpaceOnUse">
	<stop  offset="0" style="stop-color:#404040"/>
	<stop  offset="0.38" style="stop-color:#2F2F2F"/>
	<stop  offset="0.95" style="stop-color:#0F0F0F"/>
</radialGradient>
<ellipse class="st20" cx="21.2" cy="11.1" rx="0.7" ry="1.2"/>
<ellipse class="st1" cx="21.2" cy="11.1" rx="0.5" ry="0.7"/>
<radialGradient id="SVGID_14_" cx="21.21" cy="37.682" r="0.4" gradientTransform="matrix(1 0 0 -1.74 0 76.7502)" gradientUnits="userSpaceOnUse">
	<stop  offset="0" style="stop-color:#EBEBEC"/>
	<stop  offset="0.22" style="stop-color:#E7E7E8"/>
	<stop  offset="0.47" style="stop-color:#D9DADA"/>
	<stop  offset="0.72" style="stop-color:#C3C4C4"/>
	<stop  offset="0.99" style="stop-color:#A5A6A6"/>
	<stop  offset="1" style="stop-color:#A3A4A4"/>
</radialGradient>
<ellipse class="st21" cx="21.2" cy="11.1" rx="0.4" ry="0.7"/>
<path class="st16" d="M21.2,13.1c0.2,0,0.3,0.1,0.4,0.2c0-0.1,0-0.1,0-0.2c0-0.2-0.2-0.4-0.4-0.4s-0.4,0.2-0.4,0.4c0,0,0,0,0,0
	c0,0.1,0,0.1,0,0.2C20.8,13.2,21,13.1,21.2,13.1z"/>
<path class="st18" d="M21.2,13.6c-0.2,0-0.3-0.1-0.4-0.2c0,0.1,0,0.1,0,0.2c0,0.2,0.2,0.4,0.4,0.4c0.2,0,0.4-0.2,0.4-0.4
	c0-0.1,0-0.1,0-0.2C21.6,13.5,21.4,13.6,21.2,13.6z"/>
<path class="st16" d="M21.2,10.3c0.4,0,0.7,0.4,0.7,1c0-0.1,0-0.1,0-0.2c0-0.6-0.3-1.2-0.7-1.2s-0.7,0.5-0.7,1.2c0,0.1,0,0.1,0,0.2
	C20.5,10.8,20.8,10.3,21.2,10.3z"/>
<path class="st18" d="M21.2,12.3c-0.4,0-0.7-0.4-0.7-1c0,0.1,0,0.1,0,0.2c0,0.6,0.3,1.2,0.7,1.2s0.7-0.5,0.7-1.2c0-0.1,0-0.1,0-0.2
	C21.9,11.9,21.6,12.3,21.2,12.3z"/>
<path class="st16" d="M21.2,10.8c0.2,0,0.4,0.2,0.4,0.5c0-0.1,0-0.1,0-0.2c0-0.4-0.2-0.7-0.4-0.7s-0.4,0.3-0.4,0.7
	c0,0.1,0,0.1,0,0.2C20.8,11,21,10.8,21.2,10.8z"/>
<circle class="st22" cx="21.2" cy="14.3" r="0.4"/>
<path class="st16" d="M21.2,14.2c0.2,0,0.3,0.1,0.4,0.2c0-0.1,0-0.1,0-0.2c0-0.2-0.2-0.4-0.4-0.4c-0.2,0-0.4,0.2-0.4,0.4
	c0,0.1,0,0.1,0,0.2C20.8,14.3,21,14.2,21.2,14.2z"/>
<path class="st18" d="M21.2,14.7c-0.2,0-0.3-0.1-0.4-0.2c0,0.1,0,0.1,0,0.2c0,0.2,0.2,0.4,0.4,0.4s0.4-0.2,0.4-0.4c0,0,0,0,0,0
	c0-0.1,0-0.1,0-0.2C21.6,14.6,21.4,14.7,21.2,14.7z"/>
<polygon class="st23" points="18.4,18.6 18.1,15.9 5.3,15.9 5.1,18.6 "/>
</svg>
