<?xml version="1.0" encoding="utf-8"?>
<!-- Generator: Adobe Illustrator 21.0.0, SVG Export Plug-In . SVG Version: 6.00 Build 0)  -->
<svg version="1.1" id="katman_1" xmlns="http://www.w3.org/2000/svg" xmlns:xlink="http://www.w3.org/1999/xlink" x="0px" y="0px"
	 viewBox="0 0 46.9 48" style="enable-background:new 0 0 46.9 48;" xml:space="preserve">
<style type="text/css">
	.st0{fill:#262626;}
	.st1{fill:url(#SVGID_1_);}
	.st2{fill:url(#SVGID_2_);}
	.st3{opacity:0.1;fill:#FFFFFF;enable-background:new    ;}
	.st4{opacity:0.1;enable-background:new    ;}
	.st5{fill:url(#SVGID_3_);}
	.st6{opacity:0.1;}
	.st7{fill:url(#SVGID_4_);}
	.st8{opacity:0.3;}
	.st9{fill:url(#SVGID_5_);}
	.st10{fill:url(#SVGID_6_);}
	.st11{fill:url(#SVGID_7_);}
	.st12{fill:url(#SVGID_8_);}
	.st13{fill:url(#SVGID_9_);}
	.st14{fill:url(#SVGID_10_);}
	.st15{fill:url(#SVGID_11_);}
	.st16{opacity:0.3;fill:url(#SVGID_12_);enable-background:new    ;}
	.st17{opacity:0.3;fill:url(#SVGID_13_);enable-background:new    ;}
	.st18{opacity:0.3;fill:url(#SVGID_14_);enable-background:new    ;}
	.st19{fill:url(#SVGID_15_);}
</style>
<title>Varlık 2</title>
<path class="st0" d="M22.2,46.9c-1.1,0-1.9-0.9-1.9-2l0-2.2c-1.6-0.3-3.1-0.7-4.6-1.3l-1.2,1.9c-0.4,0.6-1,0.9-1.7,1h-0.1
	c-0.3,0-0.6-0.1-0.9-0.3l-1.2-0.7c-0.9-0.6-1.2-1.8-0.6-2.7l1.2-1.9L11,38.3l-0.3,0.9L6,42.9l-2.7-2.7L7,35.6l1-0.3L7.9,35l-2,1.1
	c-1,0.5-2.2,0.2-2.7-0.8L2.5,34c-0.5-1-0.2-2.2,0.8-2.7l2-1.1c-0.6-1.5-0.9-3-1.1-4.6l-2.2,0c-1.1,0-1.9-0.9-1.9-2l0-1.4
	c0-1.1,0.9-1.9,2-1.9l2.3,0c0.3-1.6,0.7-3.1,1.3-4.6l-1.9-1.2c-0.9-0.6-1.2-1.8-0.7-2.7l0.7-1.1C3.5,9.6,3.6,8.4,4,7.3l0.2-0.6
	l3.4,3.5c0.1,0.1,0.3,0.1,0.4,0.1c0.8-0.1,1.6-0.5,2.2-1.2c0.7-0.6,1.1-1.4,1.2-2.3l-0.3-0.5L7.9,3.2L8.5,3c0.6-0.2,1.2-0.3,1.8-0.3
	h0.1c0.6,0,1.1,0.1,1.7,0.2l0.7-0.4c1-0.5,2.2-0.2,2.7,0.8l1.1,2c1.5-0.6,3-0.9,4.6-1.1l0-2.2c0-1.1,0.9-1.9,2-1.9h1.5
	c1.1,0,1.9,0.9,1.9,2v1.1c0,0.1,0,0.2,0,0.3v0.8c1.6,0.3,3.1,0.7,4.5,1.3l1.2-1.9c0.4-0.6,1-0.9,1.6-0.9h0.1c0.3,0,0.6,0.1,0.9,0.3
	l0.6,0.4l0.3-0.3c0.4-0.4,0.9-0.6,1.4-0.5c1.6,0.2,3,0.9,4.1,2.1c2,2,2.7,4.4,1.6,5.5l-0.4,0.4c0.5,0.2,0.9,0.5,1.1,0.9l0.7,1.2
	c0.5,1,0.2,2.2-0.8,2.7l-2,1.1c0.6,1.5,0.9,3,1.1,4.6l2.2,0c1.1,0,1.9,0.9,1.9,2v1.4c0,1.1-0.9,1.9-2,1.9l-2.3,0
	c-0.3,1.6-0.7,3.1-1.3,4.5l0.1,0.2l1.8,1.1c0.4,0.3,0.8,0.7,0.9,1.2c0,0.1,0,0.2,0,0.4c0,0.1,0,0.1,0,0.2c0,0.1,0,0.1,0,0.1
	c0,0.1,0,0.2-0.1,0.3c0,0.2-0.1,0.3-0.2,0.5L43.2,36c0,0.7-0.1,1.3-0.2,1.9l-0.2,0.6l-1.3-1.2h-0.3c-0.3,0-0.6-0.1-0.9-0.3l-1.9-1.2
	c-0.9,1-1.8,2-2.8,2.8c0,0.1,0.1,0.2,0.1,0.2l3.5,3.4l-0.6,0.2c-0.7,0.2-1.5,0.4-2.2,0.4h-0.3c-0.2,0.4-0.5,0.7-0.9,0.9l-1.2,0.7
	c-0.3,0.2-0.6,0.2-1,0.2c-0.7,0-1.4-0.4-1.7-1l-1.1-2c-1.5,0.6-3,0.9-4.6,1.1l0,2.3c0,1.1-0.9,1.9-2,1.9L22.2,46.9z M16,32l0.4,0.3
	l0.3,0.2c0.2,0.1,0.4,0.3,0.6,0.4l0.2,0.1l0.1,0.1l0.6,0.3l0.3,0.1l0.2,0.1l0.5,0.2l0.3,0.1l0.3,0.1l0.4,0.1l0.4,0.1l0.3,0.1
	l0.3,0.1l0.6,0.1h0.3h0.2c0.4,0,0.8,0.1,1.1,0.1s0.8,0,1.1-0.1h0.2h0.3l0.6-0.1l0.3-0.1l0.3-0.1l0.4-0.1l0.4-0.1l0.3-0.1l0.4-0.1
	l0.5-0.2l0.2-0.1l0.3-0.1l0.5-0.3l-7.3-7.3L16,32z M13.8,29.3c0.2,0.3,0.3,0.5,0.5,0.8l5.9-6l-6.4-6.4c-1.1,1.8-1.6,3.8-1.6,5.8
	c0,0.2,0,0.4,0,0.5v0.2c0,0.7,0.2,1.5,0.3,2.2c0.1,0.3,0.2,0.7,0.3,1c0.1,0.4,0.3,0.7,0.4,1S13.5,29,13.8,29.3l-0.3,0.2L13.8,29.3z
	 M33.8,28.3c0.2-0.4,0.3-0.7,0.4-1s0.2-0.7,0.3-1c0.2-0.7,0.3-1.4,0.3-2.2V24c0-0.2,0-0.4,0-0.5c0-1.4-0.3-2.8-0.8-4.1l-1.5,1.5
	l-0.3-0.3c-0.4-0.2-0.7-0.2-1.1-0.3c-0.4,0-0.5,0.2-0.6,0.2c-0.3,0.4-0.1,1.4,0,1.8l0.2,0.2L29.4,24L33.8,28.3z M22.3,16.9l1.5-1.5
	l0.2,0.2l0,0c0.4,0.1,0.8,0.2,1.2,0.2c0.3,0,0.5-0.1,0.7-0.2c0.1-0.2,0.2-0.6-0.1-1.6l-0.2-0.2l1.1-1.1c-2.7-0.8-5.5-0.5-8,0.6
	L22.3,16.9z"/>
<radialGradient id="SVGID_1_" cx="23.4399" cy="25.74" r="23.1101" gradientTransform="matrix(1 0 0 -1 0 49.2)" gradientUnits="userSpaceOnUse">
	<stop  offset="0" style="stop-color:#1A1A1A"/>
	<stop  offset="9.000000e-02" style="stop-color:#292929"/>
	<stop  offset="0.26" style="stop-color:#3E3E3E"/>
	<stop  offset="0.45" style="stop-color:#4D4D4D"/>
	<stop  offset="0.67" style="stop-color:#565656"/>
	<stop  offset="1" style="stop-color:#595959"/>
</radialGradient>
<path class="st1" d="M41.3,36.9c0.6,0,1.2-0.3,1.5-0.8l0.7-1.2c0.5-0.8,0.2-1.8-0.5-2.2c0,0,0,0,0,0l-2.2-1.3
	c0.7-1.6,1.2-3.3,1.5-5.1l2.6,0.1l0,0c0.9,0,1.6-0.7,1.6-1.6v-1.4c0-0.9-0.6-1.6-1.5-1.7l-2.6-0.1c-0.2-1.8-0.6-3.5-1.2-5.1l2.2-1.2
	c0.8-0.4,1.1-1.4,0.7-2.2c0,0,0,0,0,0l-0.7-1.2C43,11,42,10.7,41.2,11.1c0,0,0,0,0,0L39,12.4c-1-1.4-2.3-2.7-3.7-3.8l1.3-2.2
	c0.5-0.8,0.2-1.8-0.5-2.2c0,0,0,0,0,0l-1.2-0.7c-0.8-0.5-1.8-0.2-2.2,0.5c0,0,0,0,0,0l-1.3,2.2c-1.6-0.7-3.3-1.2-5.1-1.5L26.3,2
	c0-0.9-0.7-1.6-1.6-1.7c0,0,0,0,0,0h-1.4c-0.9,0-1.6,0.7-1.7,1.6l-0.1,2.6c-1.8,0.2-3.5,0.6-5.1,1.2l-1.2-2.3
	c-0.4-0.8-1.4-1.1-2.2-0.7c0,0,0,0,0,0l-1.2,0.7C11,4,10.7,4.9,11.1,5.7c0,0,0,0,0,0L12.4,8c-1.4,1-2.7,2.3-3.8,3.6l-2.2-1.4
	c-0.8-0.5-1.8-0.2-2.2,0.5c0,0,0,0,0,0L3.4,12c-0.5,0.8-0.2,1.8,0.5,2.2c0,0,0,0,0,0l2.2,1.4c-0.7,1.6-1.2,3.3-1.5,5.1L2,20.6h0
	c-0.9,0-1.6,0.7-1.6,1.6v1.4c0,0.9,0.7,1.6,1.6,1.7c0,0,0,0,0,0l2.6,0.1c0.2,1.8,0.6,3.5,1.2,5.1l-2.3,1.2c-0.8,0.4-1.1,1.4-0.7,2.2
	c0,0,0,0,0,0l0.7,1.2c0.4,0.8,1.4,1.1,2.2,0.7c0,0,0,0,0,0L8,34.6c1,1.4,2.3,2.7,3.6,3.8l-1.3,2.2c-0.5,0.8-0.2,1.8,0.5,2.2
	c0,0,0,0,0,0l1.2,0.7c0.8,0.4,1.7,0.2,2.2-0.5l1.3-2.2c1.6,0.7,3.3,1.2,5.1,1.5l-0.1,2.6c0,0.9,0.7,1.6,1.6,1.7c0,0,0,0,0,0h1.4l0,0
	c0.9,0,1.6-0.7,1.7-1.5l0.1-2.6c1.8-0.2,3.5-0.6,5.1-1.2l1.2,2.2c0.4,0.8,1.4,1.1,2.2,0.7c0,0,0,0,0,0l1.2-0.7
	c0.8-0.4,1.1-1.4,0.7-2.2c0,0,0,0,0,0L34.6,39c1.4-1,2.7-2.3,3.8-3.6l2.2,1.3C40.8,36.8,41.1,36.9,41.3,36.9z M23.5,35.2
	c-6.5,0-11.7-5.3-11.7-11.7S17,11.7,23.5,11.7S35.2,17,35.2,23.5l0,0C35.2,29.9,29.9,35.2,23.5,35.2z"/>
<radialGradient id="SVGID_2_" cx="20.65" cy="4.73" r="0.51" gradientTransform="matrix(1 0 0 -1 0 49.2)" gradientUnits="userSpaceOnUse">
	<stop  offset="0" style="stop-color:#1A1A1A"/>
	<stop  offset="9.000000e-02" style="stop-color:#292929"/>
	<stop  offset="0.26" style="stop-color:#3E3E3E"/>
	<stop  offset="0.45" style="stop-color:#4D4D4D"/>
	<stop  offset="0.67" style="stop-color:#565656"/>
	<stop  offset="1" style="stop-color:#595959"/>
</radialGradient>
<path class="st2" d="M20.6,43.7v1.1c0,0.1,0,0.2,0,0.3V43.7L20.6,43.7z"/>
<path class="st3" d="M11.6,39.8c-0.2-0.2-0.4-0.3-0.6-0.5l-0.8,1.2C10,41,10,41.6,10.2,42.1c0,0,0-0.1,0.1-0.1L11.6,39.8z"/>
<path class="st3" d="M31.3,7.5l1.3-2.2c0.5-0.8,1.5-1,2.2-0.5c0,0,0,0,0,0l1.2,0.7c0.3,0.2,0.5,0.4,0.6,0.7c0.4-0.7,0.1-1.7-0.6-2.1
	l-1.2-0.7c-0.8-0.5-1.8-0.2-2.2,0.5c0,0,0,0,0,0l-1.3,2.2c-1.6-0.7-3.3-1.2-5.1-1.5v1.4C28,6.3,29.7,6.8,31.3,7.5z"/>
<path class="st3" d="M3.5,33.1l2.2-1.2c-0.2-0.4-0.3-0.8-0.4-1.2l-1.8,1c-0.8,0.4-1.1,1.4-0.7,2.1C3,33.5,3.2,33.3,3.5,33.1z"/>
<path class="st3" d="M2,22.1L2,22.1l2.6,0.1c0.3-1.8,0.8-3.5,1.5-5.1l-0.5-0.3c-0.5,1.3-0.8,2.6-1,3.9l-2.6-0.1H2
	c-0.9,0-1.6,0.7-1.6,1.6v1.4c0,0.1,0,0.2,0,0.3v-0.3C0.4,22.8,1.1,22.1,2,22.1z"/>
<path class="st3" d="M4.1,12.3c0.5-0.8,1.5-1,2.2-0.5c0,0,0,0,0,0L8.6,13c1.1-1.4,2.4-2.6,3.8-3.6l-0.6-1c-1.2,0.9-2.3,2-3.3,3.2
	l-2.2-1.3c-0.8-0.5-1.8-0.2-2.2,0.5c0,0,0,0,0,0L3.4,12c-0.3,0.5-0.3,1.1-0.1,1.6c0,0,0-0.1,0.1-0.1L4.1,12.3z"/>
<path class="st3" d="M11.8,5L13,4.3c0.8-0.4,1.8-0.1,2.2,0.6c0,0,0,0,0,0l1.2,2.2c1.6-0.6,3.4-1.1,5.1-1.2l0.1-2.6
	c0-0.9,0.8-1.6,1.7-1.6c0,0,0,0,0,0h1.4c0.8,0,1.4,0.6,1.6,1.3V2c0-0.9-0.7-1.6-1.6-1.6h-1.4c-0.9,0-1.6,0.7-1.7,1.6l-0.1,2.6
	c-1.8,0.2-3.5,0.6-5.1,1.2l-1.2-2.3c-0.4-0.8-1.4-1.1-2.2-0.7c0,0,0,0,0,0l-1.2,0.7c-0.8,0.4-1.1,1.4-0.7,2.1
	C11.2,5.4,11.5,5.1,11.8,5z"/>
<path class="st3" d="M42.4,23l2.6,0.1c0.8,0,1.4,0.6,1.6,1.3v-1.1c0-0.9-0.7-1.6-1.5-1.6l-2.6-0.1c-0.1-1.3-0.4-2.6-0.8-3.9
	l-0.4,0.2C41.8,19.5,42.2,21.2,42.4,23z"/>
<path class="st3" d="M23.5,35.2c-6.2,0-11.3-4.8-11.7-11c0,0.2,0,0.5,0,0.7c0,6.5,5.3,11.7,11.7,11.7s11.7-5.3,11.7-11.7
	c0-0.2,0-0.5,0-0.7C34.8,30.4,29.7,35.2,23.5,35.2z"/>
<path class="st3" d="M43,34.1c0.3,0.2,0.5,0.4,0.6,0.7c0.4-0.7,0.1-1.7-0.6-2.1l-1.7-1c-0.2,0.4-0.3,0.8-0.5,1.2L43,34.1z"/>
<path class="st3" d="M38.9,13.8l2.2-1.2c0.8-0.4,1.8-0.1,2.2,0.6c0,0,0,0,0,0l0.7,1.2v0.1c0-0.1,0.1-0.2,0.1-0.3
	c0.1-0.4,0.1-0.9-0.1-1.2l-0.7-1.2C43,11,42,10.7,41.2,11.1c0,0,0,0,0,0l-2.2,1.2C38,11.1,37,10,35.9,9l-0.6,1
	C36.7,11.1,37.9,12.4,38.9,13.8z"/>
<path class="st3" d="M35.8,42.6L35.8,42.6c0.2-0.4,0.2-1,0-1.4L35.1,40c-0.2,0.1-0.4,0.3-0.5,0.4L35.8,42.6z"/>
<path class="st4" d="M11.1,5.7L11.1,5.7c0,0-0.1,0.1-0.1,0.2c-0.1,0.4-0.1,0.9,0.1,1.2l0.7,1.2C12,8.3,12.2,8.1,12.4,8L11.1,5.7z"/>
<path class="st4" d="M35.3,8.5c0.2,0.2,0.4,0.3,0.6,0.5l0.8-1.2c0.3-0.5,0.3-1.1,0.1-1.6c0,0,0,0.1-0.1,0.1L35.3,8.5z"/>
<radialGradient id="SVGID_3_" cx="26.26" cy="45.31" r="0.51" gradientTransform="matrix(1 0 0 -1 0 49.2)" gradientUnits="userSpaceOnUse">
	<stop  offset="0" style="stop-color:#1A1A1A"/>
	<stop  offset="9.000000e-02" style="stop-color:#292929"/>
	<stop  offset="0.26" style="stop-color:#3E3E3E"/>
	<stop  offset="0.45" style="stop-color:#4D4D4D"/>
	<stop  offset="0.67" style="stop-color:#565656"/>
	<stop  offset="1" style="stop-color:#595959"/>
</radialGradient>
<path class="st5" d="M26.3,4.6V3.5c0-0.1,0-0.2,0-0.3V4.6L26.3,4.6z"/>
<path class="st4" d="M43.4,15.2l-2.2,1.2c0.2,0.4,0.3,0.8,0.4,1.2l1.8-1c0.8-0.4,1.1-1.4,0.7-2.1C43.9,14.8,43.7,15.1,43.4,15.2z"/>
<path class="st4" d="M46.5,24.7c0,0.9-0.7,1.6-1.6,1.6l0,0l-2.6-0.1c-0.3,1.8-0.8,3.5-1.5,5.1l0.5,0.3c0.5-1.3,0.8-2.6,1-3.9
	l2.6,0.1l0,0c0.9,0,1.6-0.7,1.6-1.6L46.5,24.7c0-0.1,0-0.2,0-0.3L46.5,24.7z"/>
<path class="st4" d="M42.8,36.1c-0.5,0.8-1.5,1-2.2,0.5c0,0,0,0,0,0l-2.2-1.3c-1.1,1.4-2.4,2.6-3.8,3.6l0.5,1c1.2-0.9,2.3-2,3.3-3.2
	l2.2,1.3c0.8,0.5,1.8,0.2,2.2-0.5c0,0,0,0,0,0l0.7-1.2c0.2-0.4,0.3-0.8,0.2-1.2c0-0.1-0.1-0.2-0.1-0.3c0,0,0,0.1-0.1,0.1L42.8,36.1z
	"/>
<path class="st4" d="M35.2,43.4l-1.2,0.7c-0.8,0.4-1.8,0.1-2.2-0.6c0,0,0,0,0,0l-1.2-2.2c-1.6,0.6-3.4,1.1-5.1,1.2L25.3,45
	c0,0.9-0.7,1.6-1.6,1.6l0,0h-1.4c-0.8,0-1.4-0.6-1.6-1.3v1.1c0,0.9,0.7,1.6,1.5,1.6h1.4l0,0c0.9,0,1.6-0.7,1.6-1.6l0.1-2.6
	c1.8-0.2,3.5-0.6,5.1-1.2l1.2,2.2c0.4,0.8,1.4,1.1,2.2,0.7c0,0,0,0,0,0l1.2-0.7c0.8-0.4,1.1-1.4,0.7-2.1
	C35.7,43,35.4,43.2,35.2,43.4z"/>
<path class="st4" d="M23.5,11.7c-6.5,0-11.7,5.3-11.7,11.7c0,0.2,0,0.5,0,0.7c0.4-6.5,5.9-11.4,12.4-11c5.9,0.3,10.7,5.1,11,11
	c0-0.2,0-0.5,0-0.7C35.1,17,29.9,11.8,23.5,11.7z"/>
<path class="st4" d="M8,34.6l-2.3,1.2C5,36.2,4,35.9,3.5,35.1c0,0,0,0,0,0l-0.7-1.2v-0.1c-0.2,0.5-0.2,1,0,1.5l0.7,1.2
	c0.4,0.8,1.4,1.1,2.2,0.7c0,0,0,0,0,0L8,36c0.9,1.2,1.9,2.3,3,3.3l0.6-1C10.2,37.3,9,36,8,34.6z"/>
<path class="st4" d="M4.5,25.3L2,25.3c-0.8,0-1.4-0.5-1.6-1.3v1.1c0,0.9,0.7,1.6,1.6,1.7c0,0,0,0,0,0l2.6,0.1
	c0.1,1.3,0.4,2.6,0.8,3.9l0.4-0.2C5.1,28.9,4.7,27.1,4.5,25.3z"/>
<path class="st4" d="M15.6,40.8L14.3,43c-0.5,0.8-1.5,1-2.2,0.5c0,0,0,0,0,0l-1.2-0.7c-0.3-0.2-0.5-0.4-0.6-0.7
	c-0.4,0.7-0.1,1.7,0.6,2.1L12,45c0.8,0.5,1.8,0.2,2.2-0.5c0,0,0,0,0,0l1.3-2.2c1.6,0.7,3.3,1.2,5.1,1.5v-1.4
	C18.9,42.1,17.2,41.5,15.6,40.8z"/>
<path class="st4" d="M3.9,14.3c-0.3-0.2-0.5-0.4-0.6-0.7c-0.4,0.7-0.1,1.7,0.6,2.1l1.7,1c0.2-0.4,0.3-0.8,0.5-1.2L3.9,14.3z"/>
<rect x="29.1" y="23.5" transform="matrix(0.7074 -0.7069 0.7069 0.7074 -8.2823 27.9333)" class="st4" width="1.1" height="1"/>
<g class="st6">
	<path d="M30.8,20c0.6-0.1,1.2,0,1.7,0.3L29.2,17L26,13.7c0.3,0.5,0.4,1.1,0.3,1.7l3,3L30.8,20z"/>
	<path d="M26.2,15.7c-0.5,0.9-2.4,0.2-2.4,0.2l1.7,1.7C26.1,17.5,26.5,17,26.2,15.7z"/>
	<path d="M30.3,22.5c-0.1-0.2-0.1-0.3-0.1-0.5c0,0.1-0.1,0.2-0.1,0.3L30.3,22.5z"/>
	<path d="M26,15.1c0.1,0.2,0.1,0.4,0.2,0.6c0-0.1,0.1-0.2,0.1-0.3L26,15.1z"/>
	<path d="M25.5,17.6c-0.6,0-1.1,0-1.7-0.2l3.3,3.3l3.3,3.3c-0.2-0.5-0.3-1.1-0.2-1.7l-3-3.1L25.5,17.6z"/>
	<path d="M30.2,22c0.2-0.6,0.9-0.9,2.4-0.3L30.8,20C29.9,20.2,30,21.3,30.2,22z"/>
</g>
<linearGradient id="SVGID_4_" gradientUnits="userSpaceOnUse" x1="35.5069" y1="39.2025" x2="19.6869" y2="22.6225" gradientTransform="matrix(1 0 0 -1 0 49.2)">
	<stop  offset="0" style="stop-color:#E7E6E6"/>
	<stop  offset="0.49" style="stop-color:#E5E4E4"/>
	<stop  offset="0.66" style="stop-color:#DEDEDE"/>
	<stop  offset="0.79" style="stop-color:#D3D2D2"/>
	<stop  offset="0.89" style="stop-color:#C2C2C2"/>
	<stop  offset="0.97" style="stop-color:#ACADAD"/>
	<stop  offset="1" style="stop-color:#A3A4A4"/>
</linearGradient>
<path class="st7" d="M40.9,31.3c-1.7-1.6-4.1-2.2-6.4-1.5l-18-18.2c1.1-3.4-0.7-7-4-8.2C11.3,3,9.9,3,8.6,3.3l3,3.1
	c0.6,0.6,0,1.9-1.1,3.1s-2.6,1.6-3.1,1l-3-3.1c-1.1,3.4,0.7,7,4,8.2c1.3,0.4,2.7,0.5,4,0.1l18,18.2c-1.1,3.4,0.7,7,4.1,8.2
	c1.4,0.5,2.8,0.5,4.2,0l-3.1-3c-0.6-0.5-0.1-1.9,1-3.1s2.5-1.7,3.1-1.2l3.1,3C43.3,35.5,42.7,33,40.9,31.3z"/>
<g class="st8">
	
		<linearGradient id="SVGID_5_" gradientUnits="userSpaceOnUse" x1="15.61" y1="24.5473" x2="30.4752" y2="24.5473" gradientTransform="matrix(1 -5.759509e-03 -5.759509e-03 -1 1.2138 46.2316)">
		<stop  offset="0" style="stop-color:#808184"/>
		<stop  offset="0.36" style="stop-color:#616163"/>
		<stop  offset="0.77" style="stop-color:#434344"/>
		<stop  offset="1" style="stop-color:#383738"/>
	</linearGradient>
	<path class="st9" d="M16.7,14.1L16.7,14.1c0.1-0.1,0.3-0.1,0.4,0l14.3,14.5c0.1,0.1,0.1,0.3,0,0.4v0c-0.1,0.1-0.3,0.1-0.4,0
		L16.7,14.5C16.6,14.4,16.6,14.2,16.7,14.1z"/>
	
		<linearGradient id="SVGID_6_" gradientUnits="userSpaceOnUse" x1="14.6668" y1="23.6096" x2="29.5319" y2="23.6096" gradientTransform="matrix(1 -5.759509e-03 -5.759509e-03 -1 1.2125 46.2208)">
		<stop  offset="0" style="stop-color:#808184"/>
		<stop  offset="0.36" style="stop-color:#616163"/>
		<stop  offset="0.77" style="stop-color:#434344"/>
		<stop  offset="1" style="stop-color:#383738"/>
	</linearGradient>
	<path class="st10" d="M15.8,15L15.8,15c0.1-0.1,0.3-0.1,0.4,0l14.3,14.5c0.1,0.1,0.1,0.3,0,0.4v0c-0.1,0.1-0.3,0.1-0.4,0L15.8,15.5
		C15.7,15.3,15.7,15.2,15.8,15z"/>
	
		<linearGradient id="SVGID_7_" gradientUnits="userSpaceOnUse" x1="13.7307" y1="22.6789" x2="28.5958" y2="22.6789" gradientTransform="matrix(1 -5.759509e-03 -5.759509e-03 -1 1.2141 46.227)">
		<stop  offset="0" style="stop-color:#808184"/>
		<stop  offset="0.36" style="stop-color:#616163"/>
		<stop  offset="0.77" style="stop-color:#434344"/>
		<stop  offset="1" style="stop-color:#383738"/>
	</linearGradient>
	<path class="st11" d="M14.9,16L14.9,16c0.1-0.1,0.3-0.1,0.4,0l14.3,14.5c0.1,0.1,0.1,0.3,0,0.4l0,0c-0.1,0.1-0.3,0.1-0.4,0
		L14.9,16.4C14.7,16.3,14.7,16.1,14.9,16z"/>
</g>
<linearGradient id="SVGID_8_" gradientUnits="userSpaceOnUse" x1="-291.5791" y1="-332.8141" x2="-284.5991" y2="-333.054" gradientTransform="matrix(0.89 0.89 -0.89 0.89 -11.462 571.072)">
	<stop  offset="0" style="stop-color:#1A97D4"/>
	<stop  offset="0.18" style="stop-color:#1C91CB"/>
	<stop  offset="0.47" style="stop-color:#2180B3"/>
	<stop  offset="0.83" style="stop-color:#29658D"/>
	<stop  offset="1" style="stop-color:#2D5778"/>
</linearGradient>
<path class="st12" d="M30.3,22.5l-3.3-3.3l-3.3-3.3c0,0,3.6,1.4,2.2-2.2l3.2,3.3l3.3,3.3C29,18.9,30.3,22.5,30.3,22.5z"/>
<path class="st3" d="M34.6,31.2c3.4-1,7,0.9,8.1,4.3c0.1,0.4,0.2,0.7,0.2,1.1c0.4-3.5-2.2-6.7-5.7-7.1c-0.9-0.1-1.7,0-2.6,0.2l-5-5
	l-0.7,0.7L34.6,31.2z"/>
<path class="st3" d="M7.3,12c0.6,0.6,1.9,0.1,3.1-1s1.7-2.5,1.1-3.1c-0.3,0.6-0.7,1.2-1.1,1.6c-1.2,1.1-2.6,1.6-3.1,1l-3-3.1
	C4,8.3,3.9,9.3,4,10.3c0-0.5,0.1-0.9,0.3-1.4L7.3,12z"/>
<path class="st3" d="M15.1,6.5c1,1,1.6,2.3,1.8,3.7c0.4-3.5-2.1-6.7-5.7-7.1c-0.9-0.1-1.8,0-2.6,0.2l1.2,1.2
	C11.7,4.3,13.7,5,15.1,6.5z"/>
<path class="st3" d="M35.5,40.5l1.9,1.8c0.4-0.1,0.8-0.1,1.2-0.3l-3.1-3c0,0,0-0.1,0-0.1C35.2,39.6,35.2,40.2,35.5,40.5z"/>
<path class="st3" d="M22.3,18.8l0.4-0.4L22,17.7l0.3-0.3l-5.5-5.5c0,0.4-0.1,0.8-0.2,1.1L22.3,18.8z"/>
<path class="st4" d="M42.7,37.8l-3.1-3c-0.6-0.5-2,0-3.1,1.2s-1.5,2.5-1.1,3c0.2-0.6,0.6-1.1,1.1-1.6c1.1-1.2,2.5-1.7,3.1-1.2l3.1,3
	c0.3-0.8,0.3-1.7,0.2-2.6C42.9,37,42.8,37.4,42.7,37.8z"/>
<path class="st4" d="M11.6,6.4L9.8,4.6C9.4,4.6,9,4.7,8.6,4.8l3,3.1l0,0C11.9,7.3,11.9,6.8,11.6,6.4z"/>
<path class="st4" d="M32,40.6c-1.1-1-1.8-2.4-1.9-3.9c-0.4,3.5,2.2,6.7,5.7,7.1c0.9,0.1,1.9,0,2.8-0.3l-1.2-1.2
	C35.4,42.6,33.4,42,32,40.6z"/>
<path class="st4" d="M12.3,15.7c-3.4,1.1-7-0.8-8.1-4.2C4.1,11.1,4,10.7,4,10.3c-0.4,3.5,2.1,6.7,5.7,7.1c0.9,0.1,1.8,0,2.6-0.2
	l17.8,17.9c0-0.4,0.1-0.8,0.3-1.2L12.3,15.7z"/>
<linearGradient id="SVGID_9_" gradientUnits="userSpaceOnUse" x1="21.95" y1="29.61" x2="29.97" y2="29.61" gradientTransform="matrix(1 0 0 -1 0 49.2)">
	<stop  offset="0" style="stop-color:#1A97D4"/>
	<stop  offset="0.18" style="stop-color:#1C91CB"/>
	<stop  offset="0.47" style="stop-color:#2180B3"/>
	<stop  offset="0.83" style="stop-color:#29658D"/>
	<stop  offset="1" style="stop-color:#2D5778"/>
</linearGradient>
<polygon class="st13" points="23.8,17.4 29.6,23.2 30.3,22.5 23.8,15.9 22.3,17.4 23,18.1 "/>
<linearGradient id="SVGID_10_" gradientUnits="userSpaceOnUse" x1="25.838" y1="49.3969" x2="30.928" y2="68.8469" gradientTransform="matrix(0.9964 8.506913e-02 8.506913e-02 -0.9964 -19.8135 91.8682)">
	<stop  offset="0" style="stop-color:#A3A4A4"/>
	<stop  offset="0.12" style="stop-color:#BBBBBB"/>
	<stop  offset="0.27" style="stop-color:#CFCECE"/>
	<stop  offset="0.43" style="stop-color:#DDDCDC"/>
	<stop  offset="0.64" style="stop-color:#E5E4E4"/>
	<stop  offset="1" style="stop-color:#E7E6E6"/>
</linearGradient>
<polygon class="st14" points="26.8,20.4 11.2,36.4 10.3,39 6,42.5 3.8,40.2 7.2,35.9 9.9,35 25.4,19.1 "/>
<polygon class="st3" points="9.9,36.5 25.4,20.6 26,21.2 26.8,20.4 25.4,19.1 9.9,35 7.2,35.9 3.8,40.2 4.4,40.9 7.2,37.4 "/>
<polygon class="st4" points="11.2,36.4 10.3,39 6,42.5 4.4,40.9 3.8,41.7 6,43.9 10.3,40.5 11.2,37.8 26.8,21.9 26,21.2 "/>
<linearGradient id="SVGID_11_" gradientUnits="userSpaceOnUse" x1="-291.6967" y1="-340.816" x2="-284.1567" y2="-340.896" gradientTransform="matrix(0.89 0.89 -0.89 0.89 -11.432 571.092)">
	<stop  offset="0" style="stop-color:#1A97D4"/>
	<stop  offset="0.18" style="stop-color:#1C91CB"/>
	<stop  offset="0.47" style="stop-color:#2180B3"/>
	<stop  offset="0.83" style="stop-color:#29658D"/>
	<stop  offset="1" style="stop-color:#2D5778"/>
</linearGradient>
<path class="st15" d="M26,13.7L36.2,3.4c0.9-1,3.2-0.3,5,1.6s2.5,4.1,1.6,5L32.6,20.3L26,13.7z"/>
<linearGradient id="SVGID_12_" gradientUnits="userSpaceOnUse" x1="22.3801" y1="16.211" x2="31.6201" y2="16.211" gradientTransform="matrix(1 -4.000000e-02 -4.000000e-02 -1 8.358 28.9)">
	<stop  offset="0" style="stop-color:#383738"/>
	<stop  offset="0.23" style="stop-color:#434344"/>
	<stop  offset="0.64" style="stop-color:#616163"/>
	<stop  offset="1" style="stop-color:#808184"/>
</linearGradient>
<path class="st16" d="M31.6,15.8c-0.3,0.3-0.8,0.3-1.2,0c-0.3-0.3-0.3-0.8,0-1.2l0,0l0,0l7.3-7.3l0,0c0.3-0.3,0.8-0.3,1.2,0
	c0.3,0.3,0.3,0.8,0,1.2l0,0L31.6,15.8L31.6,15.8L31.6,15.8z"/>
<linearGradient id="SVGID_13_" gradientUnits="userSpaceOnUse" x1="24.0801" y1="14.3732" x2="33.3201" y2="14.3732" gradientTransform="matrix(1 -4.000000e-02 -4.000000e-02 -1 8.358 28.9)">
	<stop  offset="0" style="stop-color:#383738"/>
	<stop  offset="0.23" style="stop-color:#434344"/>
	<stop  offset="0.64" style="stop-color:#616163"/>
	<stop  offset="1" style="stop-color:#808184"/>
</linearGradient>
<path class="st17" d="M33.3,17.6c-0.3,0.3-0.8,0.3-1.2,0c-0.3-0.3-0.3-0.8,0-1.2l0,0l0,0l7.3-7.3l0,0c0.3-0.3,0.8-0.3,1.2,0
	c0.3,0.3,0.3,0.8,0,1.2l0,0L33.3,17.6L33.3,17.6L33.3,17.6z"/>
<linearGradient id="SVGID_14_" gradientUnits="userSpaceOnUse" x1="20.6801" y1="18.0635" x2="29.9201" y2="18.0635" gradientTransform="matrix(1 -4.000000e-02 -4.000000e-02 -1 8.358 28.9)">
	<stop  offset="0" style="stop-color:#383738"/>
	<stop  offset="0.23" style="stop-color:#434344"/>
	<stop  offset="0.64" style="stop-color:#616163"/>
	<stop  offset="1" style="stop-color:#808184"/>
</linearGradient>
<path class="st18" d="M29.8,14.1c-0.3,0.3-0.8,0.3-1.2,0s-0.3-0.8,0-1.2l0,0l0,0l0,0L36,5.6l0,0c0.3-0.3,0.8-0.3,1.2,0
	c0.3,0.3,0.3,0.8,0,1.2l0,0l0,0L29.8,14.1L29.8,14.1L29.8,14.1z"/>
<linearGradient id="SVGID_15_" gradientUnits="userSpaceOnUse" x1="-315.5294" y1="-319.316" x2="-308.1894" y2="-319.316" gradientTransform="matrix(0.8906 0.8913 -0.8913 0.8906 20.0351 583.1474)">
	<stop  offset="0" style="stop-color:#1A97D4"/>
	<stop  offset="0.18" style="stop-color:#1C91CB"/>
	<stop  offset="0.47" style="stop-color:#2180B3"/>
	<stop  offset="0.83" style="stop-color:#29658D"/>
	<stop  offset="1" style="stop-color:#2D5778"/>
</linearGradient>
<polygon class="st19" points="22,17.7 23.8,16 30.3,22.5 28.6,24.3 "/>
<path class="st3" d="M41.2,6.4C42,7.3,42.7,8.4,43,9.5c0.4-1.1-0.3-3-1.9-4.5c-1.8-1.8-4-2.5-5-1.6L26,13.7l0.7,0.7l9.5-9.5
	C37.1,3.9,39.3,4.6,41.2,6.4z"/>
<path class="st4" d="M42.7,10L32.6,20.3l-5.9-5.9L26,15.1l6.7,6.7l10.1-10.3c0.5-0.6,0.6-1.3,0.3-2C43,9.7,42.8,9.8,42.7,10z"/>
</svg>
