<?xml version="1.0" encoding="utf-8"?>
<!-- Generator: Adobe Illustrator 21.0.0, SVG Export Plug-In . SVG Version: 6.00 Build 0)  -->
<svg version="1.1" id="katman_1" xmlns="http://www.w3.org/2000/svg" xmlns:xlink="http://www.w3.org/1999/xlink" x="0px" y="0px"
	 viewBox="0 0 24 24" style="enable-background:new 0 0 24 24;" xml:space="preserve">
<style type="text/css">
	.st0{fill:#2C2F33;}
	.st1{fill:#E7E9EC;}
</style>
<title>Varlık 17</title>
<g id="_Grup_">
	<g id="_Grup_2">
		<path id="_Yol_" class="st0" d="M6.9,16.9L6.9,16.9L6.9,16.9L6.9,16.9z"/>
		<path id="_Yol_2" class="st0" d="M7.2,16.8l0.1-0.1L7.2,16.8c-0.1,0,0-0.1,0-0.1C7,16.8,7.2,16.8,7.2,16.8z"/>
		<path id="_Yol_3" class="st0" d="M7.3,16.6C7.4,16.6,7.3,16.6,7.3,16.6L7.3,16.6z"/>
		<path id="_Yol_4" class="st0" d="M12.3,14.4C12.3,14.4,12.2,14.4,12.3,14.4C12.2,14.4,12.2,14.4,12.3,14.4z"/>
		<path id="_Yol_5" class="st0" d="M12.2,14.4L12.2,14.4z"/>
		<path id="_Yol_6" class="st0" d="M10.4,14.6c-0.1,0.1-0.1,0.1-0.2,0.1h-0.1c-0.1,0.1,0,0.1-0.1,0.1s-0.2,0.1-0.3,0.1
			c0,0,0,0,0-0.1S9.6,14.9,9.5,15l0,0c-0.3,0.2-0.7,0.4-1,0.6l0,0c-0.4,0.2-0.7,0.4-1,0.7c0.2-0.1,0.6-0.2,0.7-0.4
			c0.1,0,0.2-0.1,0.2-0.1c0.3-0.1,0.4-0.3,0.6-0.4c0,0,0,0,0.1,0L9,15.7h0.1c0,0.1-0.2,0.1-0.2,0.2c0.2-0.1,0.5-0.3,0.6-0.4
			c-0.1,0-0.2,0.1-0.3,0.1s-0.1,0-0.1,0c0.2-0.2,0.5-0.3,0.7-0.4c0.1,0,0.2-0.1,0.2-0.1s0,0,0,0.1s0-0.1,0.1-0.1v0.1
			c0-0.1,0.2-0.1,0.3-0.2s0,0.1-0.1,0.1c0.1,0,0.1-0.1,0.1-0.1v0c0-0.1,0.1-0.1,0.2,0s-0.1-0.1,0-0.1s0,0,0,0s0-0.1,0.1-0.1
			s0,0.1,0,0.1h0.1c0.1-0.1,0,0,0-0.1s0,0.1,0.1,0.1c0.1,0.1,0,0.1-0.1,0.2L11,15c0,0,0.1,0,0.1,0.1c0.2-0.1,0.4-0.2,0.6-0.3h-0.1
			h0.1c0,0,0-0.1,0.1-0.1s0.2,0,0.3-0.1l0,0c0.1,0,0.1-0.1,0.2-0.1s0,0,0,0.1s0.1,0,0.2,0v0.1c0.1,0,0.1-0.1,0.1,0
			c0.1-0.1,0.3-0.2,0.4-0.3l0,0c0-0.1,0.3-0.1,0.3-0.2l0,0l0.1-0.1c0.1-0.1,0.2-0.1,0.3-0.1c0-0.1,0.1-0.1,0.3-0.2
			c0.6-0.2,1.2-0.5,1.7-0.7c0.1,0,0.2-0.1,0.3-0.2c-0.1,0-0.2,0-0.3,0.1c-0.1,0-0.1,0-0.2-0.1h0.1c-0.1,0.1-0.1,0-0.2,0.1v-0.1
			c0,0-0.1,0-0.2,0V13c-0.1,0-0.1,0-0.2,0l0,0c0,0-0.3,0.1-0.2,0s0,0.1-0.1,0.1l0,0c-0.1,0-0.1,0.1-0.2,0.1v-0.1
			c-0.3,0.1,0,0.2-0.3,0.3l0,0l-0.1,0.1H14c-0.1,0.1-0.4,0.1-0.5,0.3s-0.2,0-0.3,0.1l0,0c-0.1,0-0.5,0.1-0.6,0s0,0,0,0
			C12.5,14,12.4,14,12.3,14s0.1,0,0,0s-0.1,0.1-0.3,0.2c0,0,0,0,0.1-0.1c-0.2,0.1-0.4,0.2-0.6,0.3l-0.9,0.3l0,0
			c-0.1,0-0.2,0.1-0.4,0.2L10.4,14.6z"/>
		<path id="_Yol_7" class="st0" d="M8.9,15.9L8.9,15.9L9,15.8C9,15.8,9,15.8,8.9,15.9z"/>
		<polygon id="_Yol_8" class="st0" points="8.9,15.7 8.9,15.8 9,15.7 		"/>
		<polygon id="_Yol_9" class="st0" points="10.6,15 10.5,15 10.3,15.2 		"/>
		<path id="_Yol_10" class="st0" d="M12.3,14.4C12.3,14.4,12.2,14.4,12.3,14.4L12.3,14.4L12.3,14.4z"/>
		<path id="_Yol_11" class="st0" d="M13.5,14.1C13.5,14,13.6,14.1,13.5,14.1C13.4,13.9,13.5,14.1,13.5,14.1z"/>
		<path id="_Yol_12" class="st0" d="M13.7,13.9C13.6,13.9,13.6,13.9,13.7,13.9C13.7,13.9,13.6,13.9,13.7,13.9z"/>
	</g>
	<g id="_Grup_3">
		<path id="_Yol_13" class="st0" d="M7.5,18L7.5,18L7.5,18L7.5,18z"/>
		<path id="_Yol_14" class="st0" d="M7.7,17.9l0.1-0.1L7.7,17.9c-0.1,0,0-0.1,0-0.1C7.6,17.8,7.7,17.8,7.7,17.9z"/>
		<path id="_Yol_15" class="st0" d="M7.9,17.7C8,17.7,7.9,17.6,7.9,17.7C7.9,17.6,7.9,17.7,7.9,17.7z"/>
		<path id="_Yol_16" class="st0" d="M13.1,15.2L13.1,15.2C13,15.2,13,15.3,13.1,15.2z"/>
		<path id="_Yol_17" class="st0" d="M13,15.2L13,15.2z"/>
		<path id="_Yol_18" class="st0" d="M11.1,15.5c-0.1,0.1-0.1,0.1-0.2,0.1h-0.1c-0.1,0.1,0,0.1-0.1,0.1s-0.2,0.1-0.3,0.1
			c0,0,0,0,0-0.1s-0.1,0.1-0.2,0.2l0,0c-0.3,0.2-0.7,0.4-1,0.7l0,0c-0.4,0.2-0.7,0.5-1,0.8c0.3-0.1,0.5-0.3,0.7-0.5
			c0.1,0,0.2-0.1,0.2-0.1c0.3-0.1,0.4-0.3,0.7-0.5c0,0,0,0,0.1,0l-0.2,0.1l0.1-0.1c0,0-0.2,0.1-0.2,0.2c0.2-0.2,0.5-0.3,0.6-0.4
			c-0.1,0-0.2,0.1-0.3,0.1s-0.1,0-0.1,0c0.2-0.2,0.5-0.3,0.8-0.5c0.1,0,0.2-0.1,0.2-0.1s0,0,0,0.1s0-0.1,0.1-0.1v0.1
			c0-0.1,0.2-0.1,0.3-0.2s0,0.1-0.1,0.1c0.1,0,0.1-0.1,0.2-0.1v0.1c0-0.1,0.1-0.1,0.2-0.1s-0.1-0.1,0-0.1s0,0,0,0s0-0.1,0.1-0.1
			s0,0.1,0,0.1h0.1c0.1-0.1,0,0,0-0.1s0.1,0.1,0.1,0.1c-0.1,0.1-0.2,0.1-0.3,0.2l0.2-0.1c0,0,0.1,0,0.1,0.1c0.2-0.1,0.4-0.2,0.6-0.3
			h-0.1h0.1c0,0,0-0.1,0.1-0.1s0.2,0,0.3-0.1l0,0c0.1,0,0.1-0.1,0.2-0.1s0,0,0,0.1s0.1,0,0.2,0v0.1c0.1,0,0.2-0.1,0.1,0
			c0.1-0.1,0.3-0.2,0.4-0.2l0,0c0.1-0.1,0.3-0.1,0.3-0.2l0,0l0.1-0.1c0.1-0.1,0.2-0.1,0.4-0.1c0-0.1,0.2-0.1,0.3-0.2
			c0.6-0.2,1.3-0.4,1.8-0.6c0.1,0,0.2-0.1,0.3-0.2c-0.1,0-0.2,0-0.3,0.1c-0.1,0-0.1,0-0.2-0.1h0.1c-0.1,0.1-0.1,0-0.2,0.1v-0.1
			c0,0.1-0.1,0-0.2,0v0.1c-0.1,0-0.1,0-0.2,0l0,0c0,0-0.3,0.1-0.2,0l-0.1,0.1l0,0c-0.1,0-0.2,0.1-0.2,0.1s0,0,0.1-0.1
			c-0.3,0.1,0,0.2-0.3,0.3l0,0l-0.1,0.1H15c-0.1,0.1-0.4,0.1-0.6,0.2s-0.2,0-0.3,0.1l0,0c-0.1,0-0.5,0.1-0.6,0s0,0,0,0
			c-0.2,0.1-0.2,0.1-0.3,0.1s0.1,0,0,0s-0.1,0.1-0.4,0.2c0,0,0,0,0.1-0.1c-0.2,0.1-0.4,0.2-0.6,0.3c-0.3,0.1-0.6,0.2-1,0.3l0,0
			c-0.1,0-0.3,0.1-0.4,0.2L11.1,15.5z"/>
		<path id="_Yol_19" class="st0" d="M9.6,16.8L9.6,16.8l0.1-0.1C9.7,16.8,9.7,16.8,9.6,16.8z"/>
		<path id="_Yol_20" class="st0" d="M9.6,16.7l-0.1,0.1L9.6,16.7z"/>
		<polygon id="_Yol_21" class="st0" points="11.3,15.9 11.2,15.9 11,16.1 		"/>
		<path id="_Yol_22" class="st0" d="M13.1,15.3C13.1,15.3,13,15.3,13.1,15.3L13.1,15.3L13.1,15.3z"/>
		<path id="_Yol_23" class="st0" d="M14.3,15C14.3,14.9,14.4,15,14.3,15C14.2,14.8,14.3,15,14.3,15z"/>
		<path id="_Yol_24" class="st0" d="M14.5,14.8L14.5,14.8C14.5,14.9,14.5,14.8,14.5,14.8z"/>
	</g>
	<g id="_Grup_4">
		<path id="_Yol_25" class="st0" d="M8.6,18.8L8.6,18.8L8.6,18.8L8.6,18.8z"/>
		<path id="_Yol_26" class="st0" d="M8.8,18.7l0.1-0.1L8.8,18.7c-0.1,0,0-0.1,0-0.1C8.6,18.6,8.8,18.6,8.8,18.7z"/>
		<path id="_Yol_27" class="st0" d="M8.9,18.5C9,18.5,8.9,18.4,8.9,18.5C8.9,18.4,8.9,18.5,8.9,18.5z"/>
		<path id="_Yol_28" class="st0" d="M13.6,16.4L13.6,16.4C13.5,16.4,13.5,16.4,13.6,16.4z"/>
		<path id="_Yol_29" class="st0" d="M13.5,16.4L13.5,16.4z"/>
		<path id="_Yol_30" class="st0" d="M11.8,16.6c-0.1,0-0.1,0.1-0.2,0.1h-0.1c-0.1,0,0,0.1-0.1,0.1s-0.2,0.1-0.3,0.1c0,0,0,0,0-0.1
			s0,0.2-0.1,0.3l0,0c-0.3,0.2-0.7,0.4-1,0.6l0,0c-0.4,0.2-0.7,0.4-0.9,0.7c0.2-0.1,0.5-0.2,0.7-0.4c0.1,0,0.2-0.1,0.2-0.1
			c0.3-0.1,0.4-0.2,0.6-0.4c0,0,0,0,0.1,0l-0.2,0.1h0.1l-0.2,0.1c0.2-0.1,0.5-0.2,0.6-0.4c-0.1,0-0.2,0.1-0.3,0.1s-0.1,0-0.1,0
			c0.2-0.2,0.5-0.3,0.7-0.4c0.1,0,0.1-0.1,0.2,0s0,0,0,0.1s0-0.1,0.1-0.1v0.1c0-0.1,0.2-0.1,0.2-0.1s0,0.1-0.1,0.1
			c0.1,0,0.1-0.1,0.1-0.1v0c0-0.1,0.1,0,0.2,0s-0.1,0,0-0.1s0,0,0,0s0-0.1,0.1-0.1c0,0,0,0,0,0.1h0.1c0.1-0.1,0,0,0-0.1
			s0.1,0.1,0.1,0.1s-0.2,0.1-0.2,0.2l0.2-0.1c0,0,0.1,0,0.1,0.1c0.2-0.1,0.4-0.2,0.5-0.3h-0.1h0.1v-0.1c0.1,0,0.2,0,0.3,0l0,0
			c0.1,0,0.1-0.1,0.2-0.1s0,0,0,0.1s0.1,0,0.1,0v0.1c0.1,0,0.1-0.1,0.1,0c0.1-0.1,0.3-0.2,0.4-0.2l0,0c0-0.1,0.2-0.1,0.3-0.2l0,0
			l0.1-0.1c0.1-0.1,0.2-0.1,0.3-0.1c0-0.1,0.1-0.1,0.2-0.2c0.5-0.2,1.1-0.5,1.5-0.8c0.1,0,0.1-0.1,0.2-0.2c-0.1,0-0.1,0.1-0.2,0.1
			s-0.1,0-0.2,0h0.1c-0.1,0.1-0.1,0-0.1,0.1V15c0,0.1-0.1,0.1-0.1,0.1v0.1c-0.1,0-0.1,0-0.2,0l0,0c0,0-0.3,0.1-0.2,0s0,0.1-0.1,0.1
			l0,0c-0.1,0-0.1,0.1-0.2,0.1v-0.1c-0.3,0.1,0,0.2-0.2,0.3l0,0v0.1h-0.1c0,0.1-0.3,0.1-0.5,0.3c-0.2,0.2-0.2,0-0.3,0.1l0,0
			c-0.1,0-0.4,0.1-0.6,0s0,0,0,0c-0.1,0.1-0.2,0.1-0.3,0.1s0.1,0,0,0s-0.1,0.1-0.3,0.2c0,0,0,0,0.1-0.1c-0.2,0.1-0.4,0.2-0.6,0.3
			C12.5,16.4,12.2,16.5,11.8,16.6L11.8,16.6c0,0-0.1,0.1-0.3,0.1L11.8,16.6z"/>
		<path id="_Yol_31" class="st0" d="M10.4,17.8L10.4,17.8l0.1-0.1C10.5,17.7,10.5,17.8,10.4,17.8z"/>
		<path id="_Yol_32" class="st0" d="M10.4,17.6v0.1V17.6z"/>
		<polygon id="_Yol_33" class="st0" points="12,17 11.9,17 11.7,17.2 		"/>
		<path id="_Yol_34" class="st0" d="M13.6,16.5C13.6,16.5,13.5,16.5,13.6,16.5L13.6,16.5L13.6,16.5z"/>
		<path id="_Yol_35" class="st0" d="M14.7,16.2C14.7,16.1,14.8,16.2,14.7,16.2C14.6,16,14.7,16.1,14.7,16.2z"/>
		<path id="_Yol_36" class="st0" d="M14.9,16C14.8,16,14.8,16,14.9,16L14.9,16z"/>
	</g>
</g>
<path class="st1" d="M5.8,23.7L5.8,23.7L5.8,23.7z"/>
<path class="st0" d="M5.9,23.7H5.7H5.9z"/>
<polygon class="st0" points="11.9,7.7 11.9,1.9 5.8,0.5 5.8,7.7 "/>
<polygon class="st0" points="18.2,7.7 18.2,0.4 12.1,1.8 12.1,7.7 "/>
<polygon class="st0" points="23,7.7 19.8,5.1 18.5,1.1 18.5,7.7 "/>
<g>
	<polygon class="st0" points="0.5,8.1 2,15.7 3.8,11.2 2.7,8.1 	"/>
	<polygon class="st0" points="4.2,5.1 0.6,7.9 2.9,7.9 4,10.8 5.3,7.6 5.5,7.6 5.5,1.1 	"/>
</g>
<path class="st0" d="M5.9,24l-0.2-0.2l-3-2.8l0,0l-0.8-4.3l0,0l3.6-8.8h18.2V8l-2.6,15.8H5.9V24z M5.8,23.6h15.1l2.6-15.5H5.8
	l-3.6,8.6L3,20.8L5.8,23.6z"/>
<path class="st0" d="M6.1,23.8H3.3l-0.6-3.2L6.1,23.8z M3.5,23.6h2l-2.4-2.3L3.5,23.6z"/>
</svg>
