<?xml version="1.0" encoding="utf-8"?>
<!-- Generator: Adobe Illustrator 21.0.0, SVG Export Plug-In . SVG Version: 6.00 Build 0)  -->
<svg version="1.1" id="katman_1" xmlns="http://www.w3.org/2000/svg" xmlns:xlink="http://www.w3.org/1999/xlink" x="0px" y="0px"
	 viewBox="0 0 31.7 32" style="enable-background:new 0 0 31.7 32;" xml:space="preserve">
<style type="text/css">
	.st0{fill:url(#_Yol__1_);}
	.st1{fill:#FFFFFF;}
	.st2{opacity:0.5;fill:#20396E;enable-background:new    ;}
	.st3{fill:#EAF6FE;}
	.st4{fill:none;}
	.st5{opacity:0.1;fill:#FFFFFF;enable-background:new    ;}
	.st6{opacity:0.2;enable-background:new    ;}
</style>
<title>preferences-desktop_2</title>
<linearGradient id="_Yol__1_" gradientUnits="userSpaceOnUse" x1="15.85" y1="1.67" x2="15.85" y2="30.38" gradientTransform="matrix(1 0 0 -1 0 31.73)">
	<stop  offset="0" style="stop-color:#2D5778"/>
	<stop  offset="0.39" style="stop-color:#2D5A7C"/>
	<stop  offset="0.74" style="stop-color:#2B6286"/>
	<stop  offset="1" style="stop-color:#2A6D94"/>
</linearGradient>
<path id="_Yol_" class="st0" d="M2,29.2V2l0,0h27.6c0,0,0,0,0.1,0v27.3L2,29.2L2,29.2z"/>
<rect x="22.4" y="14.4" class="st1" width="2.1" height="15"/>
<rect x="22.4" y="1.7" class="st1" width="2.1" height="6"/>
<rect x="14.6" y="21.5" class="st1" width="2.1" height="7.8"/>
<rect x="14.6" y="1.9" class="st1" width="2.1" height="13"/>
<rect x="6.8" y="14.7" class="st1" width="2.1" height="14.6"/>
<rect x="6.8" y="2" class="st1" width="2.1" height="6"/>
<rect x="22.1" y="14.1" class="st2" width="2.6" height="15.5"/>
<rect x="22.4" y="14.4" class="st3" width="2.1" height="15"/>
<rect x="22.1" y="1.5" class="st2" width="2.6" height="6.5"/>
<rect x="22.4" y="1.7" class="st3" width="2.1" height="6"/>
<rect x="14.4" y="21.3" class="st2" width="2.6" height="8.3"/>
<rect x="14.6" y="21.5" class="st3" width="2.1" height="7.8"/>
<rect x="14.4" y="1.7" class="st2" width="2.6" height="13.5"/>
<rect x="14.6" y="1.9" class="st3" width="2.1" height="13"/>
<rect x="6.6" y="14.5" class="st2" width="2.6" height="15.1"/>
<rect x="6.8" y="14.7" class="st3" width="2.1" height="14.6"/>
<rect x="6.6" y="1.7" class="st2" width="2.6" height="6.5"/>
<rect x="6.8" y="2" class="st3" width="2.1" height="6"/>
<rect x="1.4" y="1.2" class="st4" width="28.9" height="28.9"/>
<rect x="2.1" y="29.2" class="st1" width="27.5" height="0.5"/>
<path class="st1" d="M30.8,0.3H0.9c-0.3,0-0.6,0.3-0.6,0.6c0,0,0,0,0,0v0.5c0-0.3,0.3-0.6,0.6-0.6l0,0h29.9c0.3,0,0.6,0.3,0.6,0.6
	c0,0,0,0,0,0V0.9C31.4,0.5,31.1,0.3,30.8,0.3C30.8,0.2,30.8,0.2,30.8,0.3z"/>
<path class="st2" d="M0.9,31.2c-0.5,0-0.8-0.4-0.8-0.8c0,0,0,0,0,0V0.9C0,0.4,0.4,0,0.9,0h29.9c0.5,0,0.9,0.4,0.9,0.8v29.6
	c0,0.5-0.4,0.8-0.8,0.9c0,0,0,0,0,0L0.9,31.2z M29.3,28.9V2.3h-27v26.6H29.3z"/>
<path id="_Bileşik_Yol_" class="st3" d="M30.8,0.3H0.9c-0.3,0-0.6,0.3-0.6,0.6c0,0,0,0,0,0v29.5c0,0.3,0.3,0.6,0.6,0.6c0,0,0,0,0,0
	h30c0.3,0,0.6-0.3,0.6-0.6c0,0,0,0,0,0V0.9C31.4,0.5,31.1,0.2,30.8,0.3z M29.5,29.2H2.1V2.1l0,0h27.5l0,0V29.2L29.5,29.2z"/>
<circle class="st2" cx="7.9" cy="12.5" r="3.2"/>
<circle class="st3" cx="7.9" cy="12.5" r="3"/>
<circle class="st2" cx="15.7" cy="19.6" r="3.2"/>
<circle class="st3" cx="15.7" cy="19.6" r="3"/>
<circle class="st2" cx="23.4" cy="12.5" r="3.2"/>
<circle class="st3" cx="23.4" cy="12.5" r="3"/>
<polygon class="st5" points="29.5,29.1 29.5,29.2 2.1,29.2 2.1,30.2 29.5,30.2 29.5,29.1 "/>
<path class="st5" d="M30.8,0.3H0.9c-0.3,0-0.6,0.3-0.6,0.6c0,0,0,0,0,0v1c0-0.3,0.3-0.6,0.6-0.6l0,0h29.9c0.3,0,0.6,0.3,0.6,0.6v-1
	C31.4,0.5,31.1,0.2,30.8,0.3z"/>
<path class="st6" d="M27.8,3.1h1.8v-1l0,0H2.1l0,0v1l0,0H27.8z"/>
<path class="st6" d="M30.8,31h-30c-0.3,0-0.6-0.3-0.6-0.6c0,0,0,0,0,0v1c0,0.3,0.3,0.6,0.6,0.6c0,0,0,0,0,0h30
	c0.3,0,0.6-0.3,0.6-0.6c0,0,0,0,0,0v-1C31.5,30.7,31.2,31,30.8,31C30.9,31,30.8,31,30.8,31z"/>
<path class="st5" d="M7.9,10.6c1.4,0,2.7,1,2.9,2.4c0.4-1.6-0.7-3.2-2.3-3.6s-3.2,0.7-3.6,2.3c-0.1,0.4-0.1,0.9,0,1.3
	C5.2,11.6,6.4,10.6,7.9,10.6z"/>
<path class="st6" d="M7.9,15.5c-1.5,0-2.7-1.1-2.9-2.5c-0.4,1.6,0.7,3.2,2.3,3.6s3.2-0.7,3.6-2.3c0.1-0.4,0.1-0.9,0-1.3
	C10.5,14.4,9.3,15.5,7.9,15.5z"/>
<path class="st5" d="M15.7,17.6c1.4,0,2.7,1,2.9,2.5c0.4-1.6-0.7-3.2-2.3-3.6s-3.2,0.7-3.6,2.3c-0.1,0.4-0.1,0.9,0,1.3
	C13,18.6,14.2,17.6,15.7,17.6z"/>
<path class="st6" d="M15.7,22.5c-1.4,0-2.7-1-2.9-2.5c-0.4,1.6,0.7,3.2,2.3,3.6s3.2-0.7,3.6-2.3c0.1-0.4,0.1-0.9,0-1.3
	C18.3,21.5,17.1,22.5,15.7,22.5z"/>
<path class="st5" d="M23.4,10.6c1.4,0,2.7,1,2.9,2.4c0.4-1.6-0.7-3.2-2.3-3.6c-1.6-0.4-3.2,0.7-3.6,2.3c-0.1,0.4-0.1,0.9,0,1.3
	C20.7,11.6,22,10.6,23.4,10.6z"/>
<path class="st6" d="M23.4,15.5c-1.5,0-2.7-1.1-2.9-2.5c-0.4,1.6,0.7,3.2,2.3,3.6s3.2-0.7,3.6-2.3c0.1-0.4,0.1-0.9,0-1.3
	C26.1,14.4,24.9,15.5,23.4,15.5z"/>
</svg>
