<?xml version="1.0" encoding="utf-8"?>
<!-- Generator: Adobe Illustrator 21.0.0, SVG Export Plug-In . SVG Version: 6.00 Build 0)  -->
<svg version="1.1" id="katman_1" xmlns="http://www.w3.org/2000/svg" xmlns:xlink="http://www.w3.org/1999/xlink" x="0px" y="0px"
	 viewBox="0 0 32 24" style="enable-background:new 0 0 32 24;" xml:space="preserve">
<style type="text/css">
	.st0{opacity:0.3;enable-background:new    ;}
	.st1{fill:url(#SVGID_1_);}
	.st2{fill:url(#SVGID_2_);}
	.st3{opacity:0.2;}
	.st4{opacity:0.1;enable-background:new    ;}
	.st5{opacity:0.1;fill:#FFFFFF;enable-background:new    ;}
	.st6{fill:#F2F2F2;}
</style>
<title>gnome-window-manager_2</title>
<path class="st0" d="M32,0.8C32,0.3,31.7,0,31.2,0c0,0,0,0,0,0H0.8C0.3,0,0,0.3,0,0.8v22.4h31.8V3.4H32V0.8z"/>
<linearGradient id="SVGID_1_" gradientUnits="userSpaceOnUse" x1="15.905" y1="1.15" x2="15.905" y2="21.54" gradientTransform="matrix(1 0 0 -1 0 23.73)">
	<stop  offset="0" style="stop-color:#D7D7D6"/>
	<stop  offset="6.000000e-02" style="stop-color:#DEDDDC"/>
	<stop  offset="0.22" style="stop-color:#EAE9E8"/>
	<stop  offset="0.44" style="stop-color:#F1EFEE"/>
	<stop  offset="1" style="stop-color:#F3F1F0"/>
</linearGradient>
<rect x="0.2" y="2.2" class="st1" width="31.3" height="20.8"/>
<linearGradient id="SVGID_2_" gradientUnits="userSpaceOnUse" x1="16" y1="-8.83" x2="16" y2="23.24" gradientTransform="matrix(1 0 0 -1 0 23.73)">
	<stop  offset="5.000000e-02" style="stop-color:#1A1A1A"/>
	<stop  offset="0.39" style="stop-color:#1D1D1D"/>
	<stop  offset="0.66" style="stop-color:#272727"/>
	<stop  offset="0.91" style="stop-color:#383838"/>
	<stop  offset="1" style="stop-color:#404040"/>
</linearGradient>
<path class="st2" d="M31.8,3.2V0.8c0-0.3-0.2-0.5-0.5-0.5l0,0H0.8c-0.3,0-0.5,0.2-0.5,0.5v2.4H31.8z"/>
<g class="st3">
	<path d="M28.6,2.6l0.6-0.7l-0.5-0.7h0.5l0.3,0.4l0.3-0.4h0.5l-0.5,0.7l0.6,0.7h-0.5l-0.3-0.4l-0.3,0.4L28.6,2.6z"/>
</g>
<g class="st3">
	<path d="M26.9,2.6V2.1h-0.6V1.7h0.6V1.2h0.4v0.5h0.6v0.3h-0.6v0.5H26.9z"/>
</g>
<rect x="0.2" y="23" class="st4" width="31.3" height="1"/>
<path class="st5" d="M31.2,0.3H0.8c-0.3,0-0.5,0.2-0.5,0.5v1c0-0.3,0.2-0.5,0.5-0.5h30.4c0.3,0,0.5,0.2,0.5,0.5c0,0,0,0,0,0v-1
	C31.8,0.5,31.5,0.2,31.2,0.3z"/>
<rect x="0.2" y="3.2" class="st4" width="31.5" height="1"/>
<path class="st6" d="M28.6,2.5l0.6-0.7L28.7,1h0.5l0.3,0.4L29.7,1h0.5l-0.5,0.7l0.6,0.7h-0.5L29.4,2l-0.3,0.4L28.6,2.5z"/>
<path class="st6" d="M26.9,2.4V1.9h-0.6V1.6h0.6V1.1h0.4v0.5h0.6v0.4h-0.6v0.5L26.9,2.4z"/>
</svg>
