<?xml version="1.0" encoding="utf-8"?>
<!-- Generator: Adobe Illustrator 21.0.0, SVG Export Plug-In . SVG Version: 6.00 Build 0)  -->
<svg version="1.1" id="katman_1" xmlns="http://www.w3.org/2000/svg" xmlns:xlink="http://www.w3.org/1999/xlink" x="0px" y="0px"
	 viewBox="0 0 62.4 64" style="enable-background:new 0 0 62.4 64;" xml:space="preserve">
<style type="text/css">
	.st0{opacity:0.7;fill:#333333;enable-background:new    ;}
	.st1{fill:#1A1A1A;}
	.st2{fill:url(#SVGID_1_);}
	.st3{opacity:0.5;fill:#FFFFFF;enable-background:new    ;}
	.st4{fill:url(#SVGID_2_);}
	.st5{fill:url(#SVGID_3_);}
	.st6{fill:url(#SVGID_4_);}
	.st7{fill:url(#SVGID_5_);}
	.st8{fill:url(#SVGID_6_);}
	.st9{fill:url(#SVGID_7_);}
	.st10{fill:url(#SVGID_8_);}
	.st11{fill:url(#SVGID_9_);}
	.st12{fill:url(#SVGID_10_);}
	.st13{fill:url(#SVGID_11_);}
	.st14{fill:url(#SVGID_12_);}
	.st15{fill:#58595B;}
	.st16{opacity:0.2;fill:#FFFFFF;enable-background:new    ;}
	.st17{opacity:0.1;fill:#FFFFFF;enable-background:new    ;}
	.st18{opacity:0.2;fill:#010101;enable-background:new    ;}
	.st19{fill:#FF0000;}
	.st20{fill:url(#SVGID_13_);}
	.st21{fill:url(#SVGID_14_);}
	.st22{fill:#00FFFF;}
	.st23{opacity:0.2;fill:#383838;enable-background:new    ;}
</style>
<title>Varlık 7</title>
<path class="st0" d="M12.1,62.7l0.4-4.4h-1.6l0.2-5H3.4c-1.2,0-2.3-0.8-2.5-2c0-0.1,0-0.1,0-0.2c-0.3-0.2-0.4-0.5-0.5-0.8
	c0-0.1-0.2-5-0.3-6.7c-0.1-2.9,0-10.8,0-13.2v-0.1c0-0.1,0-0.2,0-0.2C0,29.9,0,29.7,0,29.6c0-1.3,0.2-4.4,0.3-5.5s0.6-3.5,0.8-4.5
	c0.1-0.4,0.5-0.7,0.9-0.7h10.4L11.9,5.2h1.9V0h34.7v5.2h2L50,18.9h10.5c0.4,0,0.7,0.3,0.8,0.7c0.2,1,0.7,3.6,0.8,4.5
	s0.2,4.2,0.3,5.5c0,0.1,0,0.3-0.1,0.4c0,0.1,0.1,0.2,0,0.3c0,0.1,0,9.5-0.1,13.1c0,1.3-0.1,6.7-0.1,6.7c0,0.2-0.1,0.5-0.2,0.7
	c0,0.1,0,0.3-0.1,0.4c-0.3,1.2-1.4,2-2.6,2h-7.8l0.2,5h-1.5l0.3,4.4L12.1,62.7z"/>
<path class="st1" d="M61.4,50.5L61.4,50.5c0,1.2-1,2.2-2.1,2.2H3.4c-1.2,0-2.2-1-2.2-2.2l0,0l0,0l0,0H61.4L61.4,50.5z"/>
<linearGradient id="SVGID_1_" gradientUnits="userSpaceOnUse" x1="31.34" y1="10.5" x2="31.34" y2="13.67" gradientTransform="matrix(1 0 0 -1 0 63.73)">
	<stop  offset="5.000000e-02" style="stop-color:#0F0F0F"/>
	<stop  offset="0.31" style="stop-color:#161616"/>
	<stop  offset="0.7" style="stop-color:#2B2B2B"/>
	<stop  offset="1" style="stop-color:#404040"/>
</linearGradient>
<path class="st2" d="M1.3,50.6h60.1l0,0l0,0c0,1.1-0.9,2-2,2h-56C2.3,52.6,1.4,51.7,1.3,50.6L1.3,50.6L1.3,50.6z"/>
<path class="st3" d="M1.2,50.5L1.2,50.5c0,0.3,0.1,0.7,0.2,1h59.7c0.2-0.3,0.2-0.7,0.2-1H1.2z"/>
<polygon class="st1" points="13,20.9 12.4,5.6 50,5.6 49.5,20.9 "/>
<path class="st1" d="M0.9,29.8c-0.2,0-0.4-0.2-0.4-0.4c0,0,0,0,0,0c0-1,0.1-4.4,0.3-5.5s0.7-3.7,0.8-4.5c0-0.2,0.2-0.3,0.4-0.3h10.6
	c0.2,0,0.4,0.2,0.4,0.4c0,0,0,0,0,0.1c-0.1,0.8-0.5,3.4-0.5,4.4c-0.1,1.2-0.1,4.5-0.1,5.4c0,0.2-0.2,0.4-0.4,0.4L0.9,29.8z"/>
<path class="st1" d="M50.5,29.8c-0.2,0-0.4-0.2-0.4-0.4c0-1,0-4.2-0.1-5.5c-0.1-1-0.4-3.4-0.5-4.4c0-0.2,0.1-0.4,0.3-0.4
	c0,0,0,0,0.1,0h10.6c0.2,0,0.3,0.1,0.3,0.3c0.2,0.8,0.7,3.5,0.8,4.5s0.2,4.4,0.3,5.4c0,0.2-0.2,0.4-0.3,0.4c0,0,0,0,0,0H50.5z"/>
<path class="st1" d="M1.9,50.8c-0.5,0.1-1-0.3-1-0.8c0,0,0,0,0,0c0,0-0.2-4.9-0.3-6.6c-0.1-3.3,0.1-13.2,0.1-13.3
	c0-0.2,0.2-0.4,0.4-0.4c0,0,0,0,0,0h60.6c0.2,0,0.4,0.2,0.4,0.4c0,0,0,0,0,0c0,0.1,0,9.5-0.1,13.1c0,1.3-0.1,6.7-0.1,6.7
	c0,0.5-0.4,0.8-0.9,0.8c0,0,0,0-0.1,0L1.9,50.8z"/>
<linearGradient id="SVGID_2_" gradientUnits="userSpaceOnUse" x1="12.43" y1="-597.55" x2="49.89" y2="-597.55" gradientTransform="matrix(1 0 0 1 0 610.77)">
	<stop  offset="0" style="stop-color:#E7E6E6"/>
	<stop  offset="9.000000e-02" style="stop-color:#A3A4A4"/>
	<stop  offset="0.92" style="stop-color:#A3A4A4"/>
	<stop  offset="1" style="stop-color:#E7E6E6"/>
</linearGradient>
<polygon class="st4" points="49.9,5.7 12.4,5.7 13,20.8 49.4,20.8 "/>
<linearGradient id="SVGID_3_" gradientUnits="userSpaceOnUse" x1="13.14" y1="-597.585" x2="49.19" y2="-597.585" gradientTransform="matrix(1 0 0 1 0 610.77)">
	<stop  offset="0" style="stop-color:#A3A4A4"/>
	<stop  offset="3.000000e-02" style="stop-color:#B1B1B1"/>
	<stop  offset="0.1" style="stop-color:#D5D5D5"/>
	<stop  offset="0.12" style="stop-color:#E7E6E6"/>
	<stop  offset="0.89" style="stop-color:#E7E6E6"/>
	<stop  offset="1" style="stop-color:#A3A4A4"/>
</linearGradient>
<polygon class="st5" points="13.1,5.6 13.7,20.8 48.8,20.8 49.2,5.6 "/>
<rect x="14.2" y="0.3" class="st1" width="33.7" height="20.5"/>
<linearGradient id="SVGID_4_" gradientUnits="userSpaceOnUse" x1="31.085" y1="42.89" x2="31.085" y2="65.19" gradientTransform="matrix(1 0 0 -1 0 63.73)">
	<stop  offset="0" style="stop-color:#A3A4A4"/>
	<stop  offset="1.000000e-02" style="stop-color:#A6A7A7"/>
	<stop  offset="0.14" style="stop-color:#BFC0C0"/>
	<stop  offset="0.28" style="stop-color:#D3D3D4"/>
	<stop  offset="0.44" style="stop-color:#E1E1E2"/>
	<stop  offset="0.64" style="stop-color:#E9E9EA"/>
	<stop  offset="1" style="stop-color:#EBEBEC"/>
</linearGradient>
<rect x="14.3" y="0.4" class="st6" width="33.6" height="20.4"/>
<rect x="9.6" y="20.7" class="st1" width="43.6" height="9.2"/>
<linearGradient id="SVGID_5_" gradientUnits="userSpaceOnUse" x1="31.2747" y1="34.23" x2="31.2747" y2="42.65" gradientTransform="matrix(1 0 0 -1 0 63.73)">
	<stop  offset="5.000000e-02" style="stop-color:#0F0F0F"/>
	<stop  offset="0.19" style="stop-color:#131313"/>
	<stop  offset="0.32" style="stop-color:#1E1E1E"/>
	<stop  offset="0.45" style="stop-color:#313131"/>
	<stop  offset="0.53" style="stop-color:#404040"/>
	<stop  offset="0.61" style="stop-color:#2F2F2F"/>
	<stop  offset="0.73" style="stop-color:#1D1D1D"/>
	<stop  offset="0.85" style="stop-color:#121212"/>
	<stop  offset="1" style="stop-color:#0F0F0F"/>
</linearGradient>
<path class="st7" d="M49.7,30h-37c0,0-0.2-4.6-0.1-6.4c0-1,0.3-2,0.7-2.9c0,0,28.6,0.3,35.9,0.1C50.4,24,49.7,30,49.7,30z"/>
<linearGradient id="SVGID_6_" gradientUnits="userSpaceOnUse" x1="6.7408" y1="33.9" x2="6.7408" y2="44.3706" gradientTransform="matrix(1 0 0 -1 0 63.73)">
	<stop  offset="0" style="stop-color:#B1B3B6"/>
	<stop  offset="0.16" style="stop-color:#B4B6B9"/>
	<stop  offset="0.28" style="stop-color:#BDBFC1"/>
	<stop  offset="0.39" style="stop-color:#CDCECF"/>
	<stop  offset="0.49" style="stop-color:#E4E3E3"/>
	<stop  offset="0.5" style="stop-color:#E7E6E6"/>
	<stop  offset="0.55" style="stop-color:#DFDFDF"/>
	<stop  offset="0.72" style="stop-color:#C6C7C9"/>
	<stop  offset="0.88" style="stop-color:#B6B8BB"/>
	<stop  offset="1" style="stop-color:#B1B3B6"/>
</linearGradient>
<path class="st8" d="M11.9,29.8h-11c-0.2,0-0.3-0.1-0.3-0.3l0,0c0-1,0.1-4.4,0.3-5.4s0.6-3.7,0.8-4.5c0-0.1,0.2-0.2,0.3-0.2h10.6
	c0.2,0,0.3,0.1,0.3,0.3c0,0,0,0,0,0c-0.1,0.9-0.5,3.4-0.5,4.4c-0.1,1.2-0.1,4.5-0.1,5.5C12.2,29.6,12.1,29.8,11.9,29.8z"/>
<linearGradient id="SVGID_7_" gradientUnits="userSpaceOnUse" x1="55.6642" y1="33.61" x2="55.6642" y2="44.52" gradientTransform="matrix(1 0 0 -1 0 63.73)">
	<stop  offset="0" style="stop-color:#B1B3B6"/>
	<stop  offset="0.16" style="stop-color:#B4B6B9"/>
	<stop  offset="0.28" style="stop-color:#BDBFC1"/>
	<stop  offset="0.39" style="stop-color:#CDCECF"/>
	<stop  offset="0.49" style="stop-color:#E4E3E3"/>
	<stop  offset="0.5" style="stop-color:#E7E6E6"/>
	<stop  offset="0.55" style="stop-color:#DFDFDF"/>
	<stop  offset="0.72" style="stop-color:#C6C7C9"/>
	<stop  offset="0.88" style="stop-color:#B6B8BB"/>
	<stop  offset="1" style="stop-color:#B1B3B6"/>
</linearGradient>
<path class="st9" d="M50.5,29.8h11c0.2,0,0.3-0.1,0.3-0.3v0c0-1-0.1-4.4-0.3-5.4s-0.7-3.7-0.8-4.5c0-0.1-0.1-0.2-0.3-0.2H49.8
	c-0.2,0-0.3,0.1-0.3,0.3c0,0,0,0,0,0c0.1,0.9,0.5,3.4,0.5,4.4c0.1,1.2,0.1,4.5,0.1,5.5C50.2,29.6,50.3,29.8,50.5,29.8z"/>
<linearGradient id="SVGID_8_" gradientUnits="userSpaceOnUse" x1="31.1792" y1="13.66" x2="31.1792" y2="42.37" gradientTransform="matrix(1 0 0 -1 0 63.73)">
	<stop  offset="0" style="stop-color:#818486"/>
	<stop  offset="0.18" style="stop-color:#8D9091"/>
	<stop  offset="0.51" style="stop-color:#ADAEAF"/>
	<stop  offset="0.95" style="stop-color:#E1E0E0"/>
	<stop  offset="1" style="stop-color:#E7E6E6"/>
</linearGradient>
<path class="st10" d="M60.7,50.7H1.9c-0.5,0.1-0.9-0.2-1-0.7c0,0,0,0,0-0.1c0,0-0.2-4.9-0.3-6.6c-0.1-3.3,0.1-13.3,0.1-13.3
	c0-0.2,0.1-0.3,0.3-0.3c0,0,0,0,0,0h60.6c0.2,0,0.3,0.1,0.3,0.3v0c0,0,0,9.5-0.1,13.1c0,1.3-0.1,6.8-0.1,6.8
	C61.6,50.4,61.2,50.7,60.7,50.7C60.8,50.7,60.8,50.7,60.7,50.7z"/>
<linearGradient id="SVGID_9_" gradientUnits="userSpaceOnUse" x1="11.35" y1="13.62" x2="51.11" y2="13.62" gradientTransform="matrix(1 0 0 -1 0 63.73)">
	<stop  offset="0" style="stop-color:#E7E6E6"/>
	<stop  offset="9.000000e-02" style="stop-color:#A3A4A4"/>
	<stop  offset="0.92" style="stop-color:#A3A4A4"/>
	<stop  offset="1" style="stop-color:#E7E6E6"/>
</linearGradient>
<polygon class="st11" points="51.1,57.7 11.4,57.7 12,42.5 50.6,42.5 "/>
<linearGradient id="SVGID_10_" gradientUnits="userSpaceOnUse" x1="12.1" y1="13.945" x2="50.36" y2="13.945" gradientTransform="matrix(1 0 0 -1 0 63.73)">
	<stop  offset="0" style="stop-color:#A3A4A4"/>
	<stop  offset="3.000000e-02" style="stop-color:#B1B1B1"/>
	<stop  offset="0.1" style="stop-color:#D5D5D5"/>
	<stop  offset="0.12" style="stop-color:#E7E6E6"/>
	<stop  offset="0.89" style="stop-color:#E7E6E6"/>
	<stop  offset="1" style="stop-color:#A3A4A4"/>
</linearGradient>
<polygon class="st12" points="12.1,57 12.7,42.5 49.9,42.5 50.4,57 "/>
<linearGradient id="SVGID_11_" gradientUnits="userSpaceOnUse" x1="31.305" y1="1.68" x2="31.305" y2="21.34" gradientTransform="matrix(1 0 0 -1 0 63.73)">
	<stop  offset="0" style="stop-color:#E7E6E6"/>
	<stop  offset="1" style="stop-color:#E9E3E2"/>
</linearGradient>
<polygon class="st13" points="50,62.1 12.6,62.1 14.2,42.4 48.4,42.4 "/>
<path class="st1" d="M50.9,42.6H11.6v-2.4c0-2.5,2-4.5,4.5-4.5h30.3c2.5,0,4.5,2,4.5,4.5V42.6z"/>
<linearGradient id="SVGID_12_" gradientUnits="userSpaceOnUse" x1="31.23" y1="29.23" x2="31.23" y2="20.26" gradientTransform="matrix(1 0 0 -1 0 63.73)">
	<stop  offset="0" style="stop-color:#404040"/>
	<stop  offset="0.37" style="stop-color:#252525"/>
	<stop  offset="0.7" style="stop-color:#151515"/>
	<stop  offset="0.95" style="stop-color:#0F0F0F"/>
</linearGradient>
<path class="st14" d="M11.8,42.3h38.8v-2.1c0-2.3-1.9-4.2-4.2-4.2H16.1c-2.3,0-4.2,1.9-4.2,4.2V42.3z"/>
<rect x="17.9" y="44.7" class="st15" width="26.8" height="0.8"/>
<rect x="17.7" y="47" class="st15" width="27.3" height="0.8"/>
<rect x="17.4" y="49.3" class="st15" width="27.9" height="0.8"/>
<rect x="17.1" y="51.6" class="st15" width="28.5" height="0.8"/>
<rect x="16.8" y="53.9" class="st15" width="29" height="0.8"/>
<rect x="16.5" y="56.2" class="st15" width="29.6" height="0.8"/>
<rect x="16.2" y="58.5" class="st15" width="30.2" height="0.8"/>
<rect x="0.7" y="29.7" class="st1" width="61.1" height="0.3"/>
<path class="st16" d="M0.6,32.8c0-0.5,0-0.7,0-0.7c0-0.2,0.1-0.3,0.3-0.3c0,0,0,0,0,0h60.6c0.2,0,0.3,0.1,0.3,0.3l0,0
	c0,0,0,0.3,0,0.7l0,0c0-1.6,0-2.7,0-2.7c0-0.2-0.1-0.3-0.3-0.3l0,0H0.9c-0.2,0-0.3,0.1-0.3,0.3l0,0C0.7,30.1,0.7,31.2,0.6,32.8
	L0.6,32.8z"/>
<path class="st17" d="M46.3,35.9H16.1c-2.4,0-4.4,2-4.4,4.4l0,0v2c0-2.4,2-4.4,4.4-4.4l0,0h30.2c2.4,0,4.4,2,4.4,4.4l0,0v-2
	C50.7,37.9,48.7,35.9,46.3,35.9L46.3,35.9z"/>
<path class="st16" d="M0.7,27c0-0.4,0.1-0.8,0.1-1c0.1-1,0.7-3.7,0.8-4.5c0-0.2,0.2-0.3,0.4-0.3h10.6c0.1,0,0.2,0,0.3,0.1
	c0,0,0,0,0,0.1v-0.7h-0.1v-0.3v-1c-0.1-0.1-0.1-0.1-0.2-0.1H2c-0.2,0-0.3,0.1-0.4,0.3C1.5,20.3,0.9,23,0.8,24
	c-0.1,0.6-0.1,1.8-0.2,3H0.7z"/>
<path class="st16" d="M49.8,21.2h10.6c0.2,0,0.3,0.1,0.3,0.3c0.2,0.8,0.7,3.5,0.8,4.5c0,0.2,0.1,0.6,0.1,1h0.1c0-1.2-0.1-2.4-0.2-3
	c-0.1-1-0.7-3.7-0.8-4.5c0-0.2-0.2-0.3-0.3-0.3H49.8c-0.1,0-0.2,0-0.2,0.1v1v0.3h0v0.7l0,0C49.6,21.2,49.7,21.2,49.8,21.2z"/>
<polygon class="st16" points="49.2,5.6 47.9,5.6 47.9,7.5 49.2,7.5 49.9,7.5 50,5.6 "/>
<rect x="14.2" y="0.3" class="st16" width="33.7" height="1.9"/>
<polygon class="st16" points="14.2,7.5 14.2,5.6 13.1,5.6 12.4,5.6 12.4,7.5 13.1,7.5 "/>
<polygon class="st18" points="12.6,64 50,64 49.8,62.1 12.8,62.1 "/>
<path class="st16" d="M13,20.7v-0.8l-0.1,0.5L13,20.7L13,20.7z"/>
<path class="st16" d="M49.5,20v0.7h0.1v-0.3L49.5,20z"/>
<polygon class="st18" points="49.8,59.6 51.1,59.6 51,57.7 49.6,57.7 "/>
<path class="st18" d="M61.7,50L61.7,50c0,0.2-0.1,0.4-0.2,0.5c0,0.2,0,0.3-0.1,0.5l0,0c-0.2,1-1.1,1.6-2.1,1.6h-8.4l0.1,2h8.3
	c1,0,1.8-0.7,2.1-1.6l0,0c0-0.2,0.1-0.3,0.1-0.5c0.1-0.1,0.2-0.3,0.2-0.5L61.7,50L61.7,50z"/>
<polygon class="st18" points="11.4,57.7 11.4,59.6 12.8,59.6 13,57.7 "/>
<path class="st18" d="M1.3,51L1.3,51c0-0.1,0-0.2,0-0.3C1,50.6,0.8,50.3,0.8,50l0,0H0.7c0.1,1.1,0.1,1.9,0.1,2
	c0,0.3,0.2,0.5,0.4,0.7c0,0.1,0,0.2,0,0.3l0,0c0.3,1,1.1,1.6,2.1,1.6h8.1l0.1-2H3.4C2.4,52.6,1.5,52,1.3,51z"/>
<circle class="st19" cx="56.6" cy="35.1" r="1.1"/>
<ellipse class="st1" cx="56.6" cy="29.7" rx="2.1" ry="3.2"/>
<radialGradient id="SVGID_13_" cx="56.56" cy="34.03" r="2.61" gradientTransform="matrix(1 0 0 -1 0 63.73)" gradientUnits="userSpaceOnUse">
	<stop  offset="0" style="stop-color:#404040"/>
	<stop  offset="0.38" style="stop-color:#2F2F2F"/>
	<stop  offset="0.95" style="stop-color:#0F0F0F"/>
</radialGradient>
<ellipse class="st20" cx="56.6" cy="29.7" rx="2" ry="3.1"/>
<ellipse class="st1" cx="56.6" cy="29.7" rx="1.3" ry="1.9"/>
<radialGradient id="SVGID_14_" cx="56.56" cy="50.6162" r="1.07" gradientTransform="matrix(1 0 0 -1.74 0 117.8702)" gradientUnits="userSpaceOnUse">
	<stop  offset="0" style="stop-color:#EBEBEC"/>
	<stop  offset="0.22" style="stop-color:#E7E7E8"/>
	<stop  offset="0.47" style="stop-color:#D9DADA"/>
	<stop  offset="0.72" style="stop-color:#C3C4C4"/>
	<stop  offset="0.99" style="stop-color:#A5A6A6"/>
	<stop  offset="1" style="stop-color:#A3A4A4"/>
</radialGradient>
<ellipse class="st21" cx="56.6" cy="29.7" rx="1.2" ry="1.8"/>
<path class="st16" d="M56.6,35c0.4,0,0.8,0.2,1,0.6c0.1-0.2,0.1-0.3,0.1-0.5c0-0.6-0.5-1.1-1.1-1.1s-1.1,0.5-1.1,1.1
	c0,0.2,0,0.3,0.1,0.5C55.8,35.2,56.2,35,56.6,35z"/>
<path class="st18" d="M56.6,36.2c-0.4,0-0.8-0.2-1-0.6c-0.1,0.2-0.1,0.3-0.1,0.5c0,0.6,0.5,1.1,1.1,1.1s1.1-0.5,1.1-1.1
	c0-0.2,0-0.3-0.1-0.5C57.3,35.9,57,36.1,56.6,36.2z"/>
<path class="st16" d="M56.6,27.6c1,0,1.8,1.1,2,2.6c0-0.2,0-0.3,0-0.5c0-1.7-0.9-3.1-2-3.1s-2,1.4-2,3.1c0,0.2,0,0.3,0,0.5
	C54.8,28.7,55.6,27.6,56.6,27.6z"/>
<path class="st18" d="M56.6,32.8c-1,0-1.8-1.1-2-2.6c0,0.2,0,0.3,0,0.5c0,1.7,0.9,3.1,2,3.1s2-1.4,2-3.1c0-0.2,0-0.3,0-0.5
	C58.4,31.7,57.5,32.8,56.6,32.8z"/>
<path class="st16" d="M56.6,28.9c0.5,0,1,0.6,1.1,1.3c0-0.2,0-0.3,0-0.5c0-1-0.5-1.8-1.2-1.8s-1.2,0.8-1.2,1.8c0,0.2,0,0.3,0,0.5
	C55.6,29.4,56,28.9,56.6,28.9z"/>
<circle class="st22" cx="56.6" cy="38" r="1.1"/>
<path class="st16" d="M56.6,37.9c0.4,0,0.8,0.2,1,0.6c0.1-0.2,0.1-0.3,0.1-0.5c0-0.6-0.5-1.1-1.1-1.1s-1.1,0.5-1.1,1.1
	c0,0.2,0,0.3,0.1,0.5C55.8,38.2,56.2,37.9,56.6,37.9z"/>
<path class="st18" d="M56.6,39.1c-0.4,0-0.8-0.2-1-0.6c-0.1,0.2-0.1,0.3-0.1,0.5c0,0.6,0.5,1.1,1.1,1.1s1.1-0.5,1.1-1.1
	c0-0.2,0-0.3-0.1-0.5C57.3,38.9,57,39.1,56.6,39.1z"/>
<polygon class="st23" points="49,49.5 48.4,42.4 14.2,42.4 13.6,49.5 "/>
</svg>
