<?xml version="1.0" encoding="utf-8"?>
<!-- Generator: Adobe Illustrator 21.0.0, SVG Export Plug-In . SVG Version: 6.00 Build 0)  -->
<svg version="1.1" id="katman_1" xmlns="http://www.w3.org/2000/svg" xmlns:xlink="http://www.w3.org/1999/xlink" x="0px" y="0px"
	 viewBox="0 0 21.7 22" style="enable-background:new 0 0 21.7 22;" xml:space="preserve">
<style type="text/css">
	.st0{opacity:0.2;fill:#010101;enable-background:new    ;}
	.st1{fill:#7A3E1C;}
	.st2{fill:url(#SVGID_1_);}
	.st3{fill:url(#SVGID_2_);}
	.st4{fill:#FFFFFF;}
	.st5{opacity:0.7;fill:#414042;enable-background:new    ;}
	.st6{fill:none;}
	.st7{fill:#58595B;}
	.st8{opacity:0.1;fill:#FFFFFF;enable-background:new    ;}
	.st9{fill:url(#SVGID_3_);}
</style>
<title>applications-office_4</title>
<path class="st0" d="M20.9,20.3H8.5c-0.4,0-0.7-0.3-0.7-0.7v0.7c0,0.4,0.3,0.7,0.7,0.7h12.4c0.4,0,0.7-0.3,0.7-0.7v-0.7
	C21.7,20,21.3,20.3,20.9,20.3z"/>
<path class="st0" d="M12.4,21.3h-12V22h12c0.2,0,0.4-0.2,0.4-0.4v-0.7C12.8,21.1,12.6,21.3,12.4,21.3C12.4,21.3,12.4,21.3,12.4,21.3
	z"/>
<path class="st1" d="M14.3,0H2.8v3.5H2.7v4.9H2.6V20h11.7c0.4,0,0.7-0.3,0.7-0.7V0.7C15.1,0.3,14.8,0,14.3,0C14.3,0,14.3,0,14.3,0z"
	/>
<linearGradient id="SVGID_1_" gradientUnits="userSpaceOnUse" x1="2.86" y1="14.005" x2="12" y2="14.005" gradientTransform="matrix(1 0 0 -1 0 24)">
	<stop  offset="0" style="stop-color:#7A3E1C"/>
	<stop  offset="1" style="stop-color:#C96F29"/>
</linearGradient>
<path class="st2" d="M13.3,19.8H2.8l0,0V0.2l0,0h10.5c0.9,0,1.6,0.7,1.6,1.6v16.5C14.9,19.1,14.2,19.8,13.3,19.8
	C13.3,19.8,13.3,19.8,13.3,19.8z"/>
<polygon class="st1" points="2.8,0 0,1.6 0,1.9 3,1.9 3,0 "/>
<linearGradient id="SVGID_2_" gradientUnits="userSpaceOnUse" x1="3.56" y1="23.065" x2="0.93" y2="23.065" gradientTransform="matrix(1 0 0 -1 0 24)">
	<stop  offset="0" style="stop-color:#7A3E1C"/>
	<stop  offset="1" style="stop-color:#C96F29"/>
</linearGradient>
<polygon class="st3" points="0.2,1.7 2.8,1.7 2.8,0.2 "/>
<path class="st4" d="M12.5,6.1v0.2C12.5,6.3,12.5,6.2,12.5,6.1l-0.7-1l0-0.1L12.5,6.1C12.5,6,12.5,6.1,12.5,6.1z"/>
<polygon class="st4" points="12.5,8.5 12.5,8.7 12.5,8.6 12.5,8.4 "/>
<path class="st5" d="M21.6,3.9v14c0,1.5-1.2,2.6-2.7,2.6H10c-1.5,0-2.6-1.2-2.6-2.6v-14c0-1.5,1.2-2.7,2.6-2.7H19
	C20.4,1.2,21.6,2.4,21.6,3.9z"/>
<path class="st5" d="M8.5,1.2h11.9c0.7,0,1.2,0.5,1.2,1.2v16.9c0,0.7-0.5,1.2-1.2,1.2H8.5c-0.7,0-1.2-0.5-1.2-1.2V2.4
	C7.3,1.7,7.9,1.2,8.5,1.2z"/>
<path class="st4" d="M8.5,1.6h11.9c0.4,0,0.8,0.3,0.8,0.8v16.9c0,0.4-0.3,0.8-0.8,0.8H8.5c-0.4,0-0.8-0.3-0.8-0.8V2.4
	C7.8,2,8.1,1.6,8.5,1.6z"/>
<line class="st6" x1="9.8" y1="17.2" x2="19.2" y2="17.2"/>
<rect x="9.8" y="17.1" class="st7" width="9.4" height="0.4"/>
<line class="st6" x1="9.8" y1="14.7" x2="19.2" y2="14.7"/>
<rect x="9.8" y="14.5" class="st7" width="9.4" height="0.4"/>
<line class="st6" x1="9.8" y1="12.2" x2="19.2" y2="12.2"/>
<rect x="9.8" y="12" class="st7" width="9.4" height="0.4"/>
<line class="st6" x1="9.8" y1="9.6" x2="19.2" y2="9.6"/>
<rect x="9.8" y="9.4" class="st7" width="9.4" height="0.4"/>
<line class="st6" x1="9.8" y1="7.1" x2="19.2" y2="7.1"/>
<rect x="9.8" y="6.9" class="st7" width="9.4" height="0.4"/>
<line class="st6" x1="9.8" y1="4.5" x2="19.2" y2="4.5"/>
<rect x="9.8" y="4.3" class="st7" width="9.4" height="0.4"/>
<polygon class="st4" points="12.5,8.5 12.5,8.7 12.5,8.6 12.5,8.4 "/>
<path class="st8" d="M14.3,0.2H2.8v0.7h11.5c0.3,0,0.5,0.2,0.5,0.5v0V0.7C14.9,0.4,14.6,0.2,14.3,0.2z"/>
<polygon class="st8" points="0.2,1.7 1.3,1.7 2.8,0.9 2.8,0.2 "/>
<path class="st8" d="M20.7,1.4H8.2c-0.4,0-0.7,0.3-0.7,0.7l0,0v0.7c0-0.4,0.3-0.7,0.7-0.7h12.4c0.4,0,0.7,0.3,0.7,0.7V2.1
	C21.4,1.7,21.1,1.4,20.7,1.4C20.7,1.4,20.7,1.4,20.7,1.4z"/>
<path class="st8" d="M12.5,6.7c0,0,0,0.1,0,0.1V6.1c0,0,0-0.1,0-0.1L12,5.2l-0.2,0.3L12.5,6.7z"/>
<path class="st8" d="M12.4,3.8c-0.1,0.2-0.2,0.5-0.4,0.7l-0.3,0.4L12,5.2l0.1-0.1c0.2-0.3,0.4-0.7,0.5-1.2
	C12.5,3.9,12.5,3.8,12.4,3.8z"/>
<path class="st1" d="M0,21.5v-20h8.7l0.4,0.7l0.2,0.3l0.1,0.1l0,0l0.9-0.4C10.6,2,11,1.9,11.3,1.9l0,0c0.3,0,0.8,0.5,1,0.6
	c0.2,0.2,0.3,0.5,0.4,0.7c0.1,0.3-0.4,1.1-0.5,1.3L12,4.9l0.6,1c0,0.1,0.1,0.1,0.1,0.2v2.3l0,0v12.5c0,0.3-0.2,0.5-0.6,0.5L0,21.5z"
	/>
<linearGradient id="SVGID_3_" gradientUnits="userSpaceOnUse" x1="6.405" y1="2.72" x2="6.405" y2="22.17" gradientTransform="matrix(1 0 0 -1 0 24)">
	<stop  offset="0" style="stop-color:#DD932D"/>
	<stop  offset="6.000000e-02" style="stop-color:#FAAE42"/>
	<stop  offset="0.42" style="stop-color:#F8DB6E"/>
	<stop  offset="1" style="stop-color:#FEDEB1"/>
</linearGradient>
<path class="st9" d="M8.6,1.7L9,2.3c0.2,0.2,0.3,0.4,0.3,0.4h0.1l0.7-0.3l0.3-0.1c0.3-0.2,0.7-0.3,1-0.3l0,0c0.2,0,0.7,0.4,0.8,0.6
	c0.2,0.2,0.3,0.4,0.4,0.7c-0.1,0.4-0.2,0.8-0.5,1.2l-0.3,0.4L12.5,6c0,0,0,0.1,0,0.1v2.3l0,0v12.5c0,0.2-0.2,0.4-0.4,0.4H0.2V1.7
	H8.6z"/>
<path class="st8" d="M12.6,3.3c-0.1-0.2-0.2-0.5-0.4-0.7C12,2.4,11.5,2,11.3,2.1l0,0c-0.3,0.1-0.7,0.2-1,0.3l-0.3,0.1L9.4,2.8H9.2
	c0,0-0.1-0.2-0.3-0.4L8.5,1.7H0.2v0.7h8.4L8.9,3c0.2,0.2,0.3,0.4,0.3,0.4h0.1l0.7-0.3L10.4,3c0.3-0.2,0.7-0.3,1-0.3l0,0
	c0.2,0,0.7,0.4,0.8,0.6c0.1,0.1,0.2,0.3,0.3,0.4C12.5,3.6,12.5,3.5,12.6,3.3z"/>
</svg>
