<?xml version="1.0" encoding="utf-8"?>
<!-- Generator: Adobe Illustrator 21.0.0, SVG Export Plug-In . SVG Version: 6.00 Build 0)  -->
<svg version="1.1" id="katman_1" xmlns="http://www.w3.org/2000/svg" xmlns:xlink="http://www.w3.org/1999/xlink" x="0px" y="0px"
	 viewBox="0 0 53.4 64" style="enable-background:new 0 0 53.4 64;" xml:space="preserve">
<style type="text/css">
	.st0{opacity:0.7;fill:#1A1A1A;enable-background:new    ;}
	.st1{fill:url(#SVGID_1_);}
	.st2{opacity:0.7;}
	.st3{fill:#42210B;}
	.st4{fill:url(#SVGID_2_);}
	.st5{opacity:0.1;fill:#FFFFFF;enable-background:new    ;}
	.st6{opacity:0.1;enable-background:new    ;}
</style>
<title>Varlık 1</title>
<path class="st0" d="M15,25.7v-5.6c-0.2-6.4,4.9-11.8,11.3-12s11.8,4.9,12,11.3c0,0.2,0,0.5,0,0.7v5.6h8.2v-5.6
	C46.6,9.3,38.1,0.4,27.3,0h-1.2C15.3,0.4,6.7,9.2,6.8,20.1v5.6H15z"/>
<linearGradient id="SVGID_1_" gradientUnits="userSpaceOnUse" x1="26.685" y1="40.53" x2="26.685" y2="64.9" gradientTransform="matrix(1 0 0 -1 0 63.73)">
	<stop  offset="0" style="stop-color:#A3A4A4"/>
	<stop  offset="2.000000e-02" style="stop-color:#A6A7A7"/>
	<stop  offset="0.27" style="stop-color:#C2C2C2"/>
	<stop  offset="0.52" style="stop-color:#D7D6D6"/>
	<stop  offset="0.76" style="stop-color:#E3E2E2"/>
	<stop  offset="1" style="stop-color:#E7E6E6"/>
</linearGradient>
<path class="st1" d="M38.8,25.2v-5.1C39,13.4,33.7,7.8,27,7.6s-12.3,5.1-12.5,11.8c0,0.2,0,0.5,0,0.7v5.1H7.2v-5.1
	C7.2,9.5,15.5,0.8,26.1,0.5h1.2c10.6,0.3,18.9,9,18.9,19.6v5.1H38.8z"/>
<g class="st2">
	<path class="st3" d="M50.5,63H2.9C1.3,63,0,61.7,0,60.1c0,0,0,0,0,0V27.2c0-1.6,1.3-2.9,2.9-2.9c0,0,0,0,0,0h47.6
		c1.6,0,2.9,1.3,2.9,2.9v32.9C53.4,61.7,52.1,63,50.5,63C50.5,63,50.5,63,50.5,63z M2.9,25.3c-1,0-1.9,0.8-1.9,1.9l0,0v32.9
		c0,1,0.8,1.9,1.9,1.9c0,0,0,0,0,0h47.6c1,0,1.9-0.8,1.9-1.9V27.2c0-1-0.8-1.9-1.9-1.9H2.9z"/>
</g>
<linearGradient id="SVGID_2_" gradientUnits="userSpaceOnUse" x1="26.685" y1="1.19" x2="26.685" y2="38.96" gradientTransform="matrix(1 0 0 -1 0 63.73)">
	<stop  offset="0" style="stop-color:#DD922E"/>
	<stop  offset="6.000000e-02" style="stop-color:#F9AE42"/>
	<stop  offset="0.42" style="stop-color:#F8DB6E"/>
	<stop  offset="1" style="stop-color:#FDDEB1"/>
</linearGradient>
<path class="st4" d="M2.8,24.8h47.7c1.3,0,2.4,1.1,2.4,2.4v33c0,1.3-1.1,2.4-2.4,2.4H2.8c-1.3,0-2.4-1.1-2.4-2.4v-33
	C0.4,25.8,1.5,24.8,2.8,24.8z"/>
<path class="st3" d="M30.6,45v8.9c0,1-0.8,1.9-1.9,1.9h-4.2c-1,0-1.9-0.8-1.9-1.9V45c-2.1-2.1-2.1-5.5,0-7.6
	c0.9-0.9,2.1-1.4,3.4-1.5c0.3,0,0.9,0,1.2,0c3,0.2,5.2,2.8,4.9,5.8C32.1,42.9,31.5,44.1,30.6,45z"/>
<path class="st5" d="M27.3,0.5h-1.1c-10.6,0.3-19,9-18.9,19.6v2C7.1,11.5,15.5,2.8,26.1,2.4h1.2c10.6,0.3,18.9,9,18.9,19.6v-2
	C46.2,9.4,37.8,0.8,27.3,0.5z"/>
<path class="st6" d="M38.8,20.1C39,13.4,33.7,7.8,27,7.6s-12.3,5.1-12.5,11.8c0,0.2,0,0.5,0,0.7v2c-0.2-6.7,5.1-12.3,11.8-12.5
	s12.3,5.1,12.5,11.8c0,0.2,0,0.5,0,0.7V20.1z"/>
<path class="st5" d="M50.6,24.8H2.8c-1,0-1.8,0.8-1.8,1.8v2c0-1,0.8-1.8,1.8-1.8h47.8c1,0,1.8,0.8,1.8,1.8v0v-2
	C52.4,25.6,51.6,24.8,50.6,24.8L50.6,24.8z"/>
<path class="st6" d="M50.6,62H2.8c-1,0-1.8-0.8-1.8-1.8v2c0,1,0.8,1.8,1.8,1.8h47.8c1,0,1.8-0.8,1.8-1.8v0v-2
	C52.4,61.2,51.6,62,50.6,62L50.6,62z"/>
</svg>
