<?xml version="1.0" encoding="utf-8"?>
<!-- Generator: Adobe Illustrator 21.0.0, SVG Export Plug-In . SVG Version: 6.00 Build 0)  -->
<svg version="1.1" id="katman_1" xmlns="http://www.w3.org/2000/svg" xmlns:xlink="http://www.w3.org/1999/xlink" x="0px" y="0px"
	 viewBox="0 0 31.2 32" style="enable-background:new 0 0 31.2 32;" xml:space="preserve">
<style type="text/css">
	.st0{opacity:0.7;fill:#230128;enable-background:new    ;}
	.st1{fill:url(#_Dikdörtgen__1_);}
	.st2{opacity:0.1;fill:#FFFFFF;enable-background:new    ;}
	.st3{opacity:0.2;enable-background:new    ;}
	.st4{fill:#FFFFFF;}
</style>
<title>system-hibernate_2</title>
<path class="st0" d="M15.7,31.4C7,31.4,0,24.4,0,15.8S7,0.1,15.7,0.1c8.6,0,15.6,7,15.6,15.6c0,0,0,0,0,0
	C31.3,24.4,24.3,31.4,15.7,31.4z"/>
<radialGradient id="_Dikdörtgen__1_" cx="15.595" cy="16.025" r="15.4" gradientTransform="matrix(1 0 0 -1 3.000069e-02 31.65)" gradientUnits="userSpaceOnUse">
	<stop  offset="9.000000e-02" style="stop-color:#B276AD"/>
	<stop  offset="0.3" style="stop-color:#AC6AA6"/>
	<stop  offset="0.67" style="stop-color:#9B4B94"/>
	<stop  offset="1" style="stop-color:#892A81"/>
</radialGradient>
<path id="_Dikdörtgen_" class="st1" d="M31,15.6L31,15.6C31,24.1,24.1,31,15.6,31l0,0C7.1,31,0.2,24.1,0.2,15.6l0,0
	c0-8.5,6.9-15.4,15.4-15.4l0,0C24.1,0.3,31,7.1,31,15.6z"/>
<path class="st2" d="M31,15.6c0-8.5-6.9-15.4-15.4-15.4l0,0C7.1,0.3,0.2,7.1,0.2,15.6c0,0,0,0,0,0l0,0c0,0.2,0,0.3,0,0.5
	C0.5,7.8,7.3,1.2,15.6,1.3l0,0c8.3,0,15.1,6.6,15.4,14.9C31,16,31,15.8,31,15.6L31,15.6z"/>
<path class="st3" d="M15.6,31.6L15.6,31.6C7.3,31.6,0.5,25,0.3,16.7c0,0.2,0,0.3,0,0.5l0,0c0,8.5,6.9,15.4,15.4,15.4l0,0
	c8.5,0,15.4-6.9,15.4-15.4l0,0c0-0.2,0-0.3,0-0.5C30.7,25,23.9,31.6,15.6,31.6z"/>
<path class="st4" d="M15.6,5.4C10,5.4,5.5,9.9,5.5,15.5S10,25.6,15.6,25.6c5.6,0,10.1-4.5,10.1-10.1c0,0,0,0,0,0
	C25.7,9.9,21.2,5.4,15.6,5.4z M15.6,23.1c-4.2,0-7.6-3.4-7.6-7.6s3.4-7.6,7.6-7.6c4.2,0,7.6,3.4,7.6,7.6c0,0,0,0,0,0
	C23.3,19.7,19.8,23.1,15.6,23.1z"/>
<path class="st4" d="M15,11.3h1.3c0.3,0,0.6,0.3,0.6,0.6v7.3c0,0.3-0.3,0.6-0.6,0.6H15c-0.3,0-0.6-0.3-0.6-0.6v-7.3
	C14.4,11.5,14.7,11.3,15,11.3z"/>
<path class="st3" d="M15.7,8.7c4,0,7.3,3.1,7.6,7.1c0-0.2,0-0.3,0-0.5c-0.2-4.2-3.7-7.5-7.9-7.3c-4,0.1-7.2,3.4-7.3,7.3
	c0,0.2,0,0.3,0,0.5C8.3,11.8,11.7,8.6,15.7,8.7z"/>
<path class="st3" d="M15.7,25.6c-5.4,0-9.8-4.2-10.1-9.6c0,0.2,0,0.3,0,0.5c0.2,5.6,4.9,10,10.4,9.8c5.3-0.2,9.6-4.5,9.8-9.8
	c0-0.2,0-0.3,0-0.5C25.6,21.4,21.1,25.6,15.7,25.6z"/>
<path class="st3" d="M16.3,19.7h-1.3c-0.3,0-0.6-0.3-0.6-0.6l0,0v1c0,0.3,0.3,0.6,0.6,0.6c0,0,0,0,0,0h1.3c0.3,0,0.6-0.3,0.6-0.6v0
	v-1C16.9,19.4,16.7,19.7,16.3,19.7L16.3,19.7z"/>
</svg>
