<?xml version="1.0" encoding="utf-8"?>
<!-- Generator: Adobe Illustrator 21.0.0, SVG Export Plug-In . SVG Version: 6.00 Build 0)  -->
<svg version="1.1" id="katman_1" xmlns="http://www.w3.org/2000/svg" xmlns:xlink="http://www.w3.org/1999/xlink" x="0px" y="0px"
	 viewBox="0 0 24.7 32" style="enable-background:new 0 0 24.7 32;" xml:space="preserve">
<style type="text/css">
	.st0{opacity:0.2;enable-background:new    ;}
	.st1{fill:url(#SVGID_1_);}
	.st2{opacity:0.1;enable-background:new    ;}
	.st3{fill:#F5F5F5;}
	.st4{opacity:0.1;fill:#FFFFFF;enable-background:new    ;}
	.st5{opacity:0.5;enable-background:new    ;}
</style>
<title>libreoffice-writer_4</title>
<path class="st0" d="M0,29.2v1.1C0,31.2,0.7,32,1.7,32c0,0,0,0,0,0H23c0.9,0,1.7-0.8,1.7-1.7l0,0v-1.1c0,0.9-0.7,1.7-1.7,1.7
	c0,0,0,0,0,0H1.7C0.8,30.9,0,30.1,0,29.2C0,29.2,0,29.2,0,29.2z"/>
<linearGradient id="SVGID_1_" gradientUnits="userSpaceOnUse" x1="12.35" y1="1.8599" x2="12.35" y2="33.2901" gradientTransform="matrix(1 0 0 -1 0 33.29)">
	<stop  offset="0" style="stop-color:#3B4184"/>
	<stop  offset="1" style="stop-color:#395DA8"/>
</linearGradient>
<path class="st1" d="M24.7,29.7V1.7C24.7,0.8,23.9,0,23,0c0,0,0,0,0,0H1.7C0.8,0,0,0.8,0,1.7v28.1c0,0.9,0.8,1.7,1.7,1.7
	c0,0,0,0,0,0H23C23.9,31.4,24.7,30.7,24.7,29.7C24.7,29.8,24.7,29.8,24.7,29.7z"/>
<path class="st2" d="M2.2,2.8v26.9h20.2V12.2L13,2.8H2.2z M16.2,2.8l6.3,6.3V2.8H16.2z"/>
<polygon class="st3" points="2.2,2.2 2.2,29.2 22.5,29.2 22.5,11.7 13,2.2 "/>
<polygon class="st3" points="16.2,2.2 22.5,8.5 22.5,2.2 "/>
<path class="st4" d="M1.7,0C0.8,0,0,0.8,0,1.7v0.6c0-0.9,0.8-1.7,1.7-1.7l0,0H23c0.9,0,1.7,0.7,1.7,1.7c0,0,0,0,0,0V1.7
	C24.7,0.8,23.9,0,23,0c0,0,0,0,0,0H1.7z"/>
<path class="st5" d="M5.6,24.7v-1.1h9v1.1L5.6,24.7z M5.6,21.4v-1.1h13.5v1.1H5.6z M5.6,18v-1.1h13.5V18L5.6,18z M5.6,14.6v-1.1
	h13.5v1.1L5.6,14.6z"/>
<path class="st4" d="M5.6,25.2v-1.1h9v1.1L5.6,25.2z M5.6,21.9v-1.1h13.5v1.1H5.6z M5.6,18.5v-1.1h13.5v1.1H5.6z M5.6,15.1V14h13.5
	v1.1L5.6,15.1z"/>
</svg>
