<?xml version="1.0" encoding="utf-8"?>
<!-- Generator: Adobe Illustrator 21.0.0, SVG Export Plug-In . SVG Version: 6.00 Build 0)  -->
<svg version="1.1" id="katman_1" xmlns="http://www.w3.org/2000/svg" xmlns:xlink="http://www.w3.org/1999/xlink" x="0px" y="0px"
	 viewBox="0 0 62.6 64" style="enable-background:new 0 0 62.6 64;" xml:space="preserve">
<style type="text/css">
	.st0{opacity:0.7;fill:#590C14;enable-background:new    ;}
	.st1{fill:url(#_Dikdörtgen__1_);}
	.st2{fill:#F3F3F3;}
	.st3{opacity:0.1;fill:#FFFFFF;enable-background:new    ;}
	.st4{opacity:0.2;fill:#010101;enable-background:new    ;}
</style>
<title>system-software-update</title>
<path class="st0" d="M31.3,62.6C14,62.6,0,48.6,0,31.3S14,0,31.3,0s31.3,14,31.3,31.3c0,0,0,0,0,0C62.5,48.6,48.6,62.5,31.3,62.6z"
	/>
<linearGradient id="_Dikdörtgen__1_" gradientUnits="userSpaceOnUse" x1="8.715" y1="57.275" x2="55.615" y2="10.375" gradientTransform="matrix(1 0 0 -1 0 66)">
	<stop  offset="0" style="stop-color:#00AB4E"/>
	<stop  offset="9.000000e-02" style="stop-color:#36B140"/>
	<stop  offset="0.24" style="stop-color:#8ABA2A"/>
	<stop  offset="0.36" style="stop-color:#C8C11A"/>
	<stop  offset="0.44" style="stop-color:#EEC510"/>
	<stop  offset="0.49" style="stop-color:#FDC70C"/>
	<stop  offset="0.53" style="stop-color:#FCC112"/>
	<stop  offset="0.71" style="stop-color:#F7A62B"/>
	<stop  offset="0.87" style="stop-color:#F4963A"/>
	<stop  offset="1" style="stop-color:#F3903F"/>
</linearGradient>
<path id="_Dikdörtgen_" class="st1" d="M62.1,31.3L62.1,31.3c0,17-13.8,30.8-30.8,30.8l0,0c-17,0-30.8-13.8-30.8-30.8l0,0
	c0-17,13.8-30.8,30.8-30.8l0,0C48.3,0.5,62.1,14.3,62.1,31.3z"/>
<path class="st2" d="M49.9,22.9l-4.7,1.4L45,24.4c3.7,7.6,0.5,16.7-7,20.4c-4.1,2-8.8,2.1-13,0.2l4.3-1.3c0.2-0.1,0.3-0.2,0.2-0.4
	l-0.7-2.4c-0.1-0.2-0.2-0.3-0.4-0.2L20.6,43l-2.4,0.7c-0.3,0.1-0.5,0.5-0.4,0.8l0.7,2.4l2.3,7.8c0.1,0.2,0.2,0.3,0.4,0.2l2.4-0.7
	c0.2-0.1,0.3-0.2,0.2-0.4l-1.3-4.4c10.1,4.9,22.3,0.6,27.1-9.5C52.2,34.5,52.3,28.3,49.9,22.9L49.9,22.9z"/>
<path class="st2" d="M31.3,15.8c2.5,0,5,0.6,7.2,1.8l-4.3,1.3c-0.2,0.1-0.3,0.2-0.2,0.4l0.7,2.4c0.1,0.2,0.2,0.3,0.4,0.2l7.8-2.3
	l2.4-0.7c0.3-0.1,0.5-0.5,0.4-0.8L45,15.7l-2.3-7.7c-0.1-0.2-0.2-0.3-0.4-0.2l-2.4,0.7c-0.2,0.1-0.3,0.2-0.2,0.4l1.3,4.3
	c-9.9-5.4-22.2-1.7-27.6,8.1c-2.8,5.1-3.2,11.2-1.2,16.7l4.9-1.4c-3.1-7.8,0.8-16.7,8.7-19.8C27.5,16.1,29.4,15.8,31.3,15.8z"/>
<path class="st3" d="M62.1,31.3c0-17-13.8-30.8-30.8-30.8l0,0c-17,0-30.8,13.8-30.8,30.8l0,0c0,0.3,0,0.6,0,1
	C1,15.6,14.6,2.4,31.3,2.4l0,0c16.6,0,30.2,13.2,30.8,29.8C62,31.9,62,31.6,62.1,31.3L62.1,31.3z"/>
<path class="st4" d="M31.3,62.1L31.3,62.1C14.7,62.1,1,48.9,0.5,32.2c0,0.3,0,0.6,0,1l0,0c0,17,13.8,30.7,30.8,30.8l0,0
	c17,0,30.8-13.8,30.8-30.8l0,0c0-0.3,0-0.6,0-1C61.6,48.9,47.9,62.1,31.3,62.1z"/>
<path class="st3" d="M20.6,44.9l7.8-2.3c0.2-0.1,0.4,0,0.4,0.2l0.3,0.9l0.2-0.1c0.2-0.1,0.3-0.2,0.2-0.4l-0.7-2.4
	c-0.1-0.2-0.2-0.3-0.4-0.2L20.6,43l-2.4,0.7c-0.3,0.1-0.5,0.5-0.4,0.8l0.4,1.2l0.1,0L20.6,44.9z"/>
<path class="st3" d="M31.3,48.2c8.4,0,15.2-6.8,15.3-15.2c0-0.3,0-0.6,0-0.9c-0.6,8.4-7.8,14.8-16.2,14.2c-0.8-0.1-1.5-0.2-2.3-0.3
	l-3,0.9C27,47.8,29.1,48.3,31.3,48.2z"/>
<path class="st3" d="M51.6,31.8c0-0.2,0-0.5,0-0.7c0-2.8-0.6-5.6-1.7-8.2l-4.7,1.4L45,24.4c0.3,0.5,0.5,1.1,0.7,1.6l4.2-1.2
	C50.9,27,51.4,29.4,51.6,31.8z"/>
<path class="st4" d="M20.8,54.6l-2.3-7.8l-0.4-1.2c-0.3,0.1-0.4,0.5-0.4,0.8l0.7,2.4l2.3,7.8c0.1,0.2,0.2,0.3,0.4,0.2l2.4-0.7
	c0.2-0.1,0.3-0.2,0.2-0.4l-0.4-1.5l-2.2,0.7C21,54.9,20.9,54.8,20.8,54.6z"/>
<path class="st3" d="M45.7,26l-0.5,0.2L45,26.3c0.9,1.8,1.4,3.8,1.5,5.8c0-0.3,0-0.7,0-1C46.6,29.3,46.3,27.6,45.7,26z"/>
<path class="st4" d="M31.3,51.4c-3,0-6-0.7-8.8-2l0.7,2.2c10.3,4.5,22.3-0.2,26.7-10.5c1.1-2.6,1.7-5.3,1.7-8.1c0-0.4,0-0.8,0-1.2
	C51.2,42.7,42.2,51.4,31.3,51.4z"/>
<path class="st4" d="M28,46l1.2-0.4c0.2-0.1,0.3-0.2,0.2-0.4L29,43.7L25,45C26,45.4,27,45.8,28,46z"/>
<path class="st3" d="M31.3,12.6c3.4,0,6.7,0.8,9.7,2.5l-0.7-2.3c-10-5-22.2-0.9-27.2,9.2c-1.4,2.8-2.1,5.9-2.1,9c0,0.3,0,0.7,0,1
	C11.5,21.2,20.4,12.6,31.3,12.6z"/>
<path class="st3" d="M42.7,9.9l2.3,7.8l0.4,1.2c0.3-0.1,0.4-0.5,0.3-0.8L45,15.7l-2.3-7.7c-0.1-0.2-0.2-0.3-0.4-0.2l-2.4,0.7
	c-0.2,0.1-0.3,0.2-0.2,0.4l0.4,1.4l2.2-0.6C42.4,9.6,42.6,9.7,42.7,9.9z"/>
<path class="st3" d="M40.1,10.3l-0.2,0.1c-0.2,0.1-0.3,0.2-0.2,0.4l0.6,2.1l0.7,0.3L40.1,10.3z"/>
<path class="st4" d="M31.3,15.8C22.9,15.8,16,22.6,16,31c0,0.3,0,0.7,0,1c0.5-8.4,7.7-14.8,16.1-14.3c1.3,0.1,2.5,0.3,3.7,0.7
	l2.7-0.8C36.3,16.4,33.8,15.8,31.3,15.8z"/>
<path class="st4" d="M45.3,18.8L45.3,18.8l-2.5,0.8l-7.8,2.3c-0.2,0.1-0.4,0-0.4-0.2l-0.3-0.9l-0.2,0.1c-0.2,0.1-0.3,0.2-0.2,0.4
	l0.7,2.4c0.1,0.2,0.2,0.3,0.4,0.2l7.8-2.3l2.4-0.7c0.3-0.1,0.5-0.5,0.4-0.8L45.3,18.8z"/>
<path class="st4" d="M11,32.1c0,0.3,0,0.6,0,0.9c0,2.4,0.4,4.8,1.2,7l4.9-1.4c-0.2-0.6-0.4-1.2-0.6-1.8L12.2,38
	C11.5,36.1,11.1,34.1,11,32.1z"/>
</svg>
