<?xml version="1.0" encoding="utf-8"?>
<!-- Generator: Adobe Illustrator 21.0.0, SVG Export Plug-In . SVG Version: 6.00 Build 0)  -->
<svg version="1.1" id="katman_1" xmlns="http://www.w3.org/2000/svg" xmlns:xlink="http://www.w3.org/1999/xlink" x="0px" y="0px"
	 viewBox="0 0 15.9 16" style="enable-background:new 0 0 15.9 16;" xml:space="preserve">
<style type="text/css">
	.st0{opacity:0.7;fill:#2C5879;enable-background:new    ;}
	.st1{fill:url(#SVGID_1_);}
	.st2{fill:#F1F2F2;}
	.st3{opacity:0.1;fill:#FFFFFF;enable-background:new    ;}
	.st4{opacity:0.1;fill:#020202;enable-background:new    ;}
	.st5{fill:url(#SVGID_2_);}
	.st6{fill:url(#SVGID_3_);}
</style>
<title>web-browser_5</title>
<path class="st0" d="M7.6,15.1C3.4,15.1,0,11.7,0,7.6S3.4,0,7.6,0s7.6,3.4,7.6,7.6C15.1,11.7,11.7,15.1,7.6,15.1z M10.6,11.5
	c-0.5,1.1-1.2,2.1-2,2.9c1.5-0.2,2.8-0.9,3.9-2C11.9,12,11.3,11.7,10.6,11.5z M2.6,12.4c1,1.1,2.4,1.8,3.9,2c-0.8-0.8-1.5-1.8-2-2.9
	C3.8,11.7,3.2,12.1,2.6,12.4L2.6,12.4z M7.9,14.3c0.9-0.8,1.7-1.9,2.2-3C9.3,11.1,8.6,11,7.9,11V14.3z M5.1,11.3
	c0.5,1.1,1.3,2.2,2.2,3V11C6.5,11,5.8,11.1,5.1,11.3L5.1,11.3z M10.9,10.9c0.7,0.3,1.4,0.6,2,1c1-1.2,1.5-2.6,1.6-4.1h-3
	C11.4,8.9,11.2,9.9,10.9,10.9L10.9,10.9z M0.6,7.9c0.1,1.5,0.6,3,1.6,4.1c0.6-0.4,1.3-0.7,2-1c-0.4-1-0.6-2-0.6-3.1L0.6,7.9z
	 M4.2,7.9c0,1,0.2,2,0.6,2.9c0.8-0.2,1.6-0.4,2.4-0.4V7.9H4.2z M7.9,10.4c0.8,0,1.6,0.2,2.4,0.4c0.4-0.9,0.5-1.9,0.6-2.9h-3
	L7.9,10.4z M14.5,7.3c-0.1-1.6-0.7-3.1-1.7-4.3c-0.6,0.4-1.3,0.7-2,1c0.4,1.1,0.7,2.2,0.7,3.3L14.5,7.3z M10.9,7.3
	c0-1.1-0.3-2.1-0.7-3.1C9.4,4.3,8.7,4.5,7.9,4.5v2.8L10.9,7.3z M7.2,7.3V4.5c-0.8,0-1.6-0.1-2.3-0.4c-0.4,1-0.6,2-0.7,3.1L7.2,7.3z
	 M3.6,7.3c0-1.1,0.3-2.3,0.7-3.3c-0.7-0.3-1.4-0.6-2-1c-1,1.2-1.7,2.7-1.7,4.3L3.6,7.3z M5.2,3.6c0.7,0.2,1.4,0.3,2.1,0.3v-3
	C6.4,1.6,5.7,2.5,5.2,3.6z M7.8,3.9c0.7,0,1.4-0.1,2.1-0.3c-0.5-1-1.2-2-2.1-2.7L7.8,3.9z M2.8,2.5c0.6,0.4,1.2,0.6,1.8,0.9
	c0.5-1,1.1-1.9,1.9-2.7C5.1,0.9,3.8,1.5,2.8,2.5z M8.6,0.7c0.8,0.8,1.4,1.7,1.9,2.7c0.6-0.2,1.2-0.5,1.8-0.9
	C11.3,1.5,10,0.9,8.6,0.7z"/>
<linearGradient id="SVGID_1_" gradientUnits="userSpaceOnUse" x1="7.55" y1="1.03" x2="7.55" y2="15.29" gradientTransform="matrix(1 0 0 -1 0 15.73)">
	<stop  offset="0" style="stop-color:#2D5879"/>
	<stop  offset="1" style="stop-color:#2C6E95"/>
</linearGradient>
<path class="st1" d="M14.8,7.6c0,4-3.2,7.3-7.2,7.3s-7.3-3.2-7.3-7.2c0-4,3.2-7.3,7.2-7.3c0,0,0,0,0,0C11.6,0.3,14.8,3.5,14.8,7.6z"
	/>
<path class="st2" d="M7.6,15c-4.1,0-7.4-3.3-7.4-7.4c0-4.1,3.3-7.4,7.4-7.4c4.1,0,7.4,3.3,7.4,7.4C15,11.7,11.7,15,7.6,15
	C7.6,15,7.6,15,7.6,15z M2.4,12.4c1.2,1.2,2.7,2,4.4,2.2c-1-0.9-1.8-2-2.3-3.2C3.8,11.6,3.1,12,2.4,12.4z M10.6,11.3
	c-0.5,1.2-1.3,2.3-2.3,3.2c1.7-0.2,3.3-0.9,4.4-2.2C12,12,11.3,11.6,10.6,11.3L10.6,11.3z M7.7,14.5c1.1-0.9,1.9-2,2.5-3.3
	c-0.8-0.2-1.6-0.4-2.5-0.4V14.5z M4.9,11.2c0.6,1.3,1.4,2.4,2.5,3.3v-3.7C6.5,10.9,5.7,11,4.9,11.2z M10.7,11
	c0.8,0.3,1.5,0.7,2.2,1.1c1.1-1.2,1.7-2.8,1.7-4.4h-3.3C11.3,8.8,11.1,10,10.7,11z M0.5,7.7c0,1.6,0.6,3.2,1.7,4.4
	c0.7-0.5,1.4-0.9,2.2-1.1C4,10,3.8,8.8,3.8,7.7L0.5,7.7z M7.7,10.5c0.9,0,1.8,0.2,2.6,0.4c0.4-1,0.6-2.1,0.6-3.2H7.7L7.7,10.5z
	 M4.1,7.7c0,1.1,0.2,2.2,0.6,3.2c0.9-0.3,1.7-0.4,2.6-0.4V7.7H4.1z M14.6,7.4c0-1.7-0.7-3.3-1.8-4.6c-0.7,0.4-1.4,0.8-2.2,1.1
	c0.5,1.1,0.7,2.3,0.7,3.5H14.6z M11,7.4c0-1.2-0.3-2.3-0.7-3.4C9.4,4.2,8.6,4.4,7.7,4.4v3L11,7.4z M7.4,7.4v-3
	C6.5,4.4,5.7,4.2,4.8,4C4.4,5.1,4.1,6.2,4.1,7.4L7.4,7.4z M3.8,7.4C3.8,6.2,4,5,4.5,3.9C3.7,3.6,3,3.2,2.3,2.8
	C1.2,4.1,0.5,5.7,0.5,7.4H3.8z M5,3.6C5.8,3.9,6.6,4,7.4,4V0.6C6.4,1.4,5.6,2.5,5,3.6z M7.7,4c0.8,0,1.6-0.1,2.4-0.4
	C9.6,2.5,8.7,1.4,7.7,0.6V4z M2.6,2.5c0.6,0.4,1.3,0.8,2.1,1c0.5-1.1,1.3-2.2,2.2-3C5.3,0.7,3.7,1.4,2.6,2.5z M8.2,0.5
	c0.9,0.8,1.7,1.9,2.2,3c0.7-0.2,1.4-0.6,2.1-1C11.4,1.4,9.9,0.7,8.2,0.5L8.2,0.5z"/>
<path class="st3" d="M7.6,0.6c4,0,7.3,3.2,7.4,7.2c0-0.1,0-0.2,0-0.2c0-4.1-3.3-7.4-7.4-7.4S0.1,3.4,0.1,7.6c0,0.1,0,0.2,0,0.2
	C0.3,3.8,3.6,0.6,7.6,0.6z"/>
<path class="st4" d="M7.6,15c-4,0-7.3-3.2-7.4-7.2c0,0.1,0,0.2,0,0.2c0,4.1,3.3,7.4,7.4,7.4c4.1,0,7.4-3.3,7.4-7.4
	c0-0.1,0-0.2,0-0.2C14.9,11.8,11.6,15,7.6,15z"/>
<path class="st4" d="M8.9,14.7H7.1c-0.3,0-0.5-0.2-0.5-0.5v0.5c0,0.3,0.2,0.5,0.5,0.5h1.7c0.3,0,0.5-0.2,0.5-0.5v-0.5
	C9.3,14.5,9.1,14.7,8.9,14.7z"/>
<path class="st4" d="M15.2,8.9V8.4c0,0.3-0.2,0.5-0.5,0.5h-3.5l0.5,0.5h3C15,9.4,15.2,9.2,15.2,8.9z"/>
<path class="st4" d="M15.8,14.1l-1.2,1.2c-0.2,0.2-0.5,0.2-0.7,0l-4.6-4.6v0.5l4.6,4.6c0.2,0.2,0.5,0.2,0.7,0l1.2-1.2
	C16,14.5,16,14.2,15.8,14.1L15.8,14.1z"/>
<linearGradient id="SVGID_2_" gradientUnits="userSpaceOnUse" x1="7.1188" y1="9.829" x2="14.9788" y2="0.369" gradientTransform="matrix(1 0 0 -1 0 15.73)">
	<stop  offset="0" style="stop-color:#2C6E95"/>
	<stop  offset="0.54" style="stop-color:#2D6083"/>
	<stop  offset="1" style="stop-color:#2D5879"/>
</linearGradient>
<path class="st5" d="M14.2,15.5c-0.1,0-0.3,0-0.3-0.1l-4.6-4.6v3.5c0,0.3-0.2,0.5-0.5,0.5H7.1c-0.3,0-0.5-0.2-0.5-0.5V6.9
	c0-0.4,0.3-0.7,0.7-0.7l0,0h7.3c0.3,0,0.5,0.2,0.5,0.5v1.7c0,0.3-0.2,0.5-0.5,0.5h-3.5l4.6,4.6c0.2,0.2,0.2,0.5,0,0.7l-1.2,1.2
	C14.5,15.4,14.4,15.5,14.2,15.5z"/>
<linearGradient id="SVGID_3_" gradientUnits="userSpaceOnUse" x1="8.4189" y1="9.0693" x2="14.9389" y2="-0.8807" gradientTransform="matrix(1 0 0 -1 0 15.73)">
	<stop  offset="0" style="stop-color:#E8E6E5"/>
	<stop  offset="0.25" style="stop-color:#E4E2E1"/>
	<stop  offset="0.48" style="stop-color:#D9D7D6"/>
	<stop  offset="0.72" style="stop-color:#C5C4C4"/>
	<stop  offset="0.95" style="stop-color:#AAAAAA"/>
	<stop  offset="1" style="stop-color:#A3A3A3"/>
</linearGradient>
<path class="st6" d="M9.1,14.3v-4.1l5,5c0.1,0.1,0.2,0.1,0.3,0l1.2-1.2c0.1-0.1,0.1-0.2,0-0.3l-5-5h4.1c0.1,0,0.2-0.1,0.2-0.2V6.7
	c0-0.1-0.1-0.2-0.2-0.2H7.4c-0.3,0-0.5,0.2-0.5,0.5l0,0v7.3c0,0.1,0.1,0.2,0.2,0.2h1.7C9,14.5,9.1,14.4,9.1,14.3z"/>
<path class="st3" d="M7.4,7h7.3c0.1,0,0.2,0.1,0.2,0.2V6.7c0-0.1-0.1-0.2-0.2-0.2H7.4c-0.3,0-0.5,0.2-0.5,0.5l0,0v0.5
	C6.9,7.2,7.1,7,7.4,7z"/>
</svg>
