<?xml version="1.0" encoding="utf-8"?>
<!-- Generator: Adobe Illustrator 21.0.0, SVG Export Plug-In . SVG Version: 6.00 Build 0)  -->
<svg version="1.1" id="katman_1" xmlns="http://www.w3.org/2000/svg" xmlns:xlink="http://www.w3.org/1999/xlink" x="0px" y="0px"
	 viewBox="0 0 22 20.7" style="enable-background:new 0 0 22 20.7;" xml:space="preserve">
<style type="text/css">
	.st0{fill:#793D1A;}
	.st1{opacity:0.2;enable-background:new    ;}
	.st2{fill:url(#SVGID_1_);}
	.st3{fill:url(#SVGID_2_);}
	.st4{fill:url(#SVGID_3_);}
	.st5{opacity:0.1;enable-background:new    ;}
	.st6{opacity:0.1;fill:#FFFFFF;enable-background:new    ;}
	.st7{opacity:0.7;}
</style>
<title>folder-drag-accept_4</title>
<path class="st0" d="M21.7,15.7L21.7,15.7V2c0-0.3-0.2-0.5-0.5-0.5l0,0h-8v-1c0-0.3-0.3-0.5-0.5-0.5H6.8C6.5,0,6.3,0.2,6.3,0.5
	c0,0,0,0,0,0v1H4.9C4.6,1.5,4.4,1.7,4.3,2v14H19l0.8,4h0.3l1.5-4h0.1v-0.1v-0.1L21.7,15.7z"/>
<polygon class="st1" points="20,20.7 22,15.9 21.6,15.9 20,20 "/>
<linearGradient id="SVGID_1_" gradientUnits="userSpaceOnUse" x1="13.02" y1="6.08" x2="13.02" y2="22.86" gradientTransform="matrix(1 0 0 -1 0 22)">
	<stop  offset="0" style="stop-color:#793D1A;stop-opacity:0.8"/>
	<stop  offset="1" style="stop-color:#C96E28"/>
</linearGradient>
<path class="st2" d="M13,1.6v-1c0-0.2-0.2-0.4-0.4-0.4H6.8c-0.2,0-0.4,0.2-0.4,0.4c0,0,0,0,0,0v1c0,0,0,0.1-0.1,0.1l0,0H4.9
	C4.7,1.7,4.5,1.8,4.5,2v13.9h17.1V2c0-0.2-0.2-0.4-0.4-0.4l0,0h-8.1C13.1,1.7,13,1.6,13,1.6C13,1.6,13,1.6,13,1.6z"/>
<linearGradient id="SVGID_2_" gradientUnits="userSpaceOnUse" x1="23.6963" y1="1.3959" x2="19.7963" y2="4.9859" gradientTransform="matrix(1 0 0 -1 0 22)">
	<stop  offset="0" style="stop-color:#C96E28"/>
	<stop  offset="1" style="stop-color:#793D1A;stop-opacity:0.8"/>
</linearGradient>
<polygon class="st3" points="20,20 21.6,15.9 19.2,15.9 "/>
<path class="st0" d="M3.8,20.2c-0.2,0-0.4-0.1-0.5-0.3l-1.1-2.1l-2-2c-0.1-0.1-0.1-0.2-0.2-0.4v-3.7c0-0.1,0-0.2,0.1-0.3l1-1.6
	L0.8,9.3C0.5,8.9-0.1,7.8,0,7.4C0.2,7,0.4,6.6,0.7,6.3c0.2-0.3,1-1,1.4-1c0.6,0.1,1.1,0.3,1.7,0.5l1.5,0.7h0.1l0.1-0.2
	c0.3-0.4,0.6-0.8,1-1.2l0,0h13.1c0.3,0,0.5,0.2,0.5,0.5v14.5L3.8,20.2L3.8,20.2z"/>
<linearGradient id="SVGID_3_" gradientUnits="userSpaceOnUse" x1="10.09" y1="2.15" x2="10.09" y2="16.51" gradientTransform="matrix(1 0 0 -1 0 22)">
	<stop  offset="0" style="stop-color:#DD922E"/>
	<stop  offset="6.000000e-02" style="stop-color:#F9AE42"/>
	<stop  offset="0.42" style="stop-color:#F8DB6E"/>
	<stop  offset="1" style="stop-color:#FDDEB1"/>
</linearGradient>
<path class="st4" d="M19.6,5.2h-13C6.2,5.7,5.8,6.1,5.4,6.6L5.2,6.7L4.1,6.2L3.7,6c-0.5-0.2-1-0.4-1.6-0.5c-0.3,0-1.1,0.6-1.3,0.9
	C0.6,6.7,0.3,7,0.2,7.4c0.1,0.7,0.4,1.3,0.8,1.8l0.4,0.6l-1,1.7c0,0.1-0.1,0.1-0.1,0.2v3.7c0,0.1,0,0.2,0.1,0.2l2,2l0,0l1.1,2.1
	C3.5,19.9,3.6,20,3.8,20L20,20V5.6C20,5.4,19.8,5.2,19.6,5.2z"/>
<path class="st5" d="M20.2,4.7h-13C7,4.9,6.8,5,6.7,5.2h13c0.2,0,0.4,0.2,0.4,0.3V20l0.6-0.8V5C20.6,4.8,20.4,4.7,20.2,4.7z"/>
<path class="st6" d="M6.8,0.8h5.8C12.9,0.9,13,1,13,1.2V0.5c0-0.2-0.2-0.4-0.4-0.4H6.8c-0.2,0-0.4,0.2-0.4,0.4c0,0,0,0,0,0v0.7
	C6.5,1,6.6,0.8,6.8,0.8L6.8,0.8z"/>
<path class="st6" d="M4.9,2.3h1.5c0,0,0.1,0,0.1-0.1l0,0V1.6c0,0,0,0.1-0.1,0.1l0,0H4.9C4.7,1.7,4.5,1.8,4.5,2v0.7
	C4.5,2.5,4.7,2.3,4.9,2.3z"/>
<path class="st6" d="M21.2,1.7h-8.1c0,0-0.1,0-0.1-0.1c0,0,0,0,0,0v0.7c0,0,0,0.1,0.1,0.1l0,0h8.1c0.2,0,0.4,0.2,0.4,0.4
	c0,0,0,0,0,0V2C21.5,1.8,21.4,1.7,21.2,1.7z"/>
<path class="st6" d="M19.6,5.2h-13C6.2,5.7,5.8,6.1,5.4,6.6L5.2,6.7L4.1,6.2L3.7,6c-0.5-0.2-1-0.4-1.6-0.5c-0.3,0-1.1,0.6-1.3,0.9
	C0.6,6.7,0.3,7,0.2,7.4c0,0.2,0,0.3,0.1,0.5C0.4,7.6,0.6,7.3,0.8,7c0.2-0.3,1-0.9,1.3-0.9c0.6,0.1,1.1,0.3,1.6,0.5l0.4,0.2l1.1,0.5
	l0.2-0.1c0.4-0.5,0.8-1,1.2-1.4h13C19.9,5.8,20,6,20,6.2V5.6C20,5.4,19.8,5.2,19.6,5.2C19.7,5.2,19.7,5.2,19.6,5.2z"/>
<path class="st1" d="M3.5,19.8l-1.1-2.1l0,0l-2-2c-0.1-0.1-0.1-0.1-0.1-0.2V16c0,0.1,0,0.2,0.1,0.2l2,2l0,0l1.1,2.1
	c0.1,0.1,0.2,0.2,0.3,0.2H20V20H3.8C3.6,20,3.5,19.9,3.5,19.8z"/>
<g class="st7">
	<path class="st0" d="M3.4,15.2c0,0,0,0,0.1,0v-0.1L3.4,15.2z"/>
	<path class="st0" d="M3.7,15.1l0.1-0.2L3.7,15.1c-0.1-0.1,0-0.1,0-0.2C3.6,15,3.7,15,3.7,15.1z"/>
	<path class="st0" d="M4,14.9C4.1,14.8,4,14.8,4,14.9C4,14.8,3.9,14.9,4,14.9z"/>
	<path class="st0" d="M10.3,12.1L10.3,12.1C10.2,12.1,10.2,12.1,10.3,12.1z"/>
	<path class="st0" d="M10.2,12.1L10.2,12.1L10.2,12.1z"/>
	<path class="st0" d="M7.9,12.4c-0.1,0.1-0.2,0.1-0.3,0.2H7.5c-0.1,0.1,0,0.1-0.1,0.1c-0.1,0-0.3,0.1-0.4,0.2c0,0,0-0.1,0-0.1
		S7,12.9,6.8,13l0,0c-0.4,0.3-0.9,0.5-1.3,0.8l0,0C5,14,4.6,14.3,4.2,14.7c0.3-0.1,0.6-0.3,0.9-0.5c0.1,0,0.2-0.1,0.3-0.1
		c0.4-0.2,0.5-0.3,0.8-0.5c0.1,0,0,0,0.1,0l-0.3,0.2l0.2-0.1C6.2,13.7,6,13.8,6,13.8c0.2-0.2,0.6-0.3,0.8-0.5
		c-0.1,0-0.2,0.1-0.3,0.2s-0.2,0-0.2,0c0.3-0.2,0.7-0.4,1-0.5c0.1,0,0.2-0.1,0.2-0.1s0,0,0,0.1c0.1-0.1,0-0.1,0.2-0.2v0.1
		c0-0.1,0.2-0.1,0.3-0.2c0.1-0.1,0,0.1-0.1,0.1c0.1,0,0.1-0.1,0.2-0.1v0.1c0.1-0.1,0.2-0.1,0.2-0.1s-0.1-0.1,0-0.1s0,0,0.1,0
		s0-0.1,0.1-0.1s0,0.1,0,0.1c0,0,0.1,0,0.2-0.1c0.1-0.1,0,0,0-0.1s0.1,0.1,0.1,0.1c-0.1,0.1-0.3,0.2-0.3,0.2l0.2-0.1
		c0,0,0.2,0,0.1,0.1c0.3-0.1,0.5-0.2,0.7-0.4c0,0-0.1,0-0.1,0s0.1,0,0.1,0s0-0.1,0.1-0.2c0.1,0,0.3-0.1,0.4-0.1v-0.1
		c0.1,0,0.1-0.1,0.2-0.1s0,0-0.1,0.1s0.1,0,0.2-0.1v0.1c0.1,0,0.2-0.1,0.2,0c0.2-0.1,0.3-0.2,0.5-0.3v0.1c0.1-0.1,0.3-0.1,0.4-0.2
		l0,0l0.1-0.1c0,0,0.1,0,0.1,0c0,0,0,0,0,0c0.1-0.1,0.3-0.1,0.4-0.2c0-0.1,0.2-0.2,0.3-0.2c0.8-0.2,1.5-0.6,2.2-0.8
		c0.1-0.1,0.2-0.1,0.4-0.2c-0.1,0-0.2,0.1-0.3,0.1c-0.1,0-0.2,0-0.3-0.1h0.1c-0.1,0.1-0.1,0-0.2,0.1v-0.1c0,0.1-0.2,0.1-0.2,0v0.1
		c-0.1,0-0.2,0-0.2-0.1v0.1c-0.1,0-0.4,0.1-0.3,0c0,0-0.1,0.1-0.1,0.1v-0.1c-0.1,0-0.2,0.1-0.2,0.1c0,0,0.1-0.1,0.1-0.1
		c-0.4,0.1,0,0.2-0.4,0.4l0,0l-0.1,0.1h-0.1c-0.1,0.2-0.5,0.2-0.7,0.3s-0.2,0-0.4,0.1V11c-0.1,0-0.6,0.1-0.8,0.1c-0.1,0.1,0,0,0,0.1
		c-0.2,0.2-0.2,0.1-0.4,0.1s0.1,0,0.1,0.1c-0.2,0-0.1,0.1-0.4,0.2c0,0,0.1-0.1,0.1-0.1c-0.2,0.2-0.5,0.3-0.8,0.4
		c-0.3,0.1-0.8,0.3-1.2,0.4l0,0C8.2,12.2,8,12.3,7.9,12.4L7.9,12.4z"/>
	<path class="st0" d="M6,13.9L6,13.9l0.2-0.1C6.1,13.9,6.1,13.9,6,13.9z"/>
	<polygon class="st0" points="6,13.8 5.9,13.8 6.1,13.8 	"/>
	<polygon class="st0" points="8.1,12.9 8.1,12.9 7.8,13.1 	"/>
	<path class="st0" d="M10.3,12.1c0,0-0.1,0.1-0.1,0.1L10.3,12.1L10.3,12.1z"/>
	<path class="st0" d="M11.8,11.7c0-0.1,0.1,0,0-0.1S11.8,11.7,11.8,11.7z"/>
	<path class="st0" d="M12.1,11.5c0,0-0.1,0-0.1,0.1C12.1,11.6,12.1,11.5,12.1,11.5z"/>
	<path class="st0" d="M4.1,16.5c0,0,0,0,0.1,0v-0.1L4.1,16.5z"/>
	<path class="st0" d="M4.5,16.4l0.1-0.2L4.5,16.4c-0.1-0.1,0-0.1,0-0.2C4.3,16.3,4.5,16.3,4.5,16.4z"/>
	<path class="st0" d="M4.7,16.1C4.8,16.1,4.7,16.1,4.7,16.1C4.7,16.1,4.7,16.1,4.7,16.1z"/>
	<path class="st0" d="M11.3,13.2L11.3,13.2C11.2,13.2,11.2,13.2,11.3,13.2z"/>
	<path class="st0" d="M11.2,13.1L11.2,13.1L11.2,13.1z"/>
	<path class="st0" d="M8.8,13.5c-0.1,0.1-0.2,0.1-0.3,0.2H8.4c-0.1,0.1,0,0.1-0.1,0.1c-0.1,0-0.3,0.1-0.4,0.2c-0.1,0,0-0.1,0-0.1
		s-0.1,0.1-0.3,0.2l0,0c-0.4,0.3-0.9,0.6-1.3,0.9c0,0,0,0,0.1,0C5.9,15.3,5.4,15.6,5,16c0.3-0.2,0.7-0.4,1-0.6
		c0.1,0,0.2-0.2,0.3-0.1c0.4-0.2,0.5-0.4,0.9-0.6c0.1,0,0,0,0.1,0L7,14.9l0.2-0.1C7.1,14.9,6.9,15,6.9,15c0.2-0.2,0.7-0.4,0.8-0.5
		c-0.1,0-0.2,0.1-0.4,0.2s-0.2,0-0.2,0c0.3-0.2,0.6-0.4,1-0.6C8.3,14,8.5,14,8.5,14s0,0,0,0.1c0.1-0.1,0-0.1,0.2-0.2V14
		c0-0.1,0.2-0.1,0.4-0.2s0,0.1-0.1,0.1c0.1,0,0.1-0.1,0.2-0.1v0.1c0.1-0.1,0.2-0.1,0.3-0.1s-0.1-0.1,0-0.1s0,0,0.1,0s0-0.1,0.1-0.1
		s0,0.1,0,0.1c0.1,0,0.1-0.1,0.2-0.1c0.1-0.1,0,0,0-0.1s0.1,0.1,0.2,0.1c-0.1,0.1-0.3,0.2-0.3,0.2l0.2-0.1c0,0,0.2,0,0.1,0.1
		c0.3-0.1,0.5-0.2,0.8-0.4h-0.1c0,0,0.1,0,0.2,0s0-0.1,0.1-0.2c0.1,0,0.3-0.1,0.4-0.1v-0.1c0.1,0,0.1-0.1,0.2-0.1s0,0-0.1,0.1
		s0.1,0,0.2-0.1l-0.1,0.1c0.1,0,0.2-0.1,0.2,0c0.2-0.1,0.4-0.2,0.6-0.3v0.1c0.1-0.1,0.4-0.1,0.4-0.2l0,0l0.2-0.1
		c0.1,0,0.1,0.1,0.1,0c0.1-0.1,0.3-0.1,0.5-0.1c0-0.1,0.2-0.2,0.4-0.2c0.8-0.2,1.6-0.5,2.4-0.8c0.1-0.1,0.3-0.1,0.4-0.2
		c-0.1,0-0.2,0.1-0.4,0.1c-0.1,0-0.2-0.1-0.3-0.1h0.1c-0.2,0.1-0.1,0-0.2,0.1v-0.1c0,0.1-0.2,0.1-0.2,0v0.1c-0.1,0-0.2,0-0.2-0.1
		v0.1c-0.1,0-0.4,0.1-0.3,0c0,0-0.1,0.1-0.1,0.1v-0.1c-0.1,0-0.2,0.1-0.2,0.1c0,0,0.1-0.1,0.1-0.1c-0.4,0.1,0,0.2-0.4,0.3l0,0
		l-0.1,0.1H14c-0.1,0.2-0.5,0.1-0.7,0.3s-0.2,0-0.4,0.1v0.1c-0.1,0-0.7,0.1-0.8,0c-0.1,0.1,0,0,0,0.1c-0.2,0.1-0.3,0.1-0.4,0.1
		s0.1,0,0.1,0.1c-0.2,0-0.1,0.1-0.4,0.2c0,0,0.1-0.1,0.1-0.1c-0.3,0.1-0.5,0.3-0.8,0.4c-0.4,0.1-0.8,0.3-1.2,0.4l0,0
		C9.1,13.3,8.9,13.3,8.8,13.5L8.8,13.5z"/>
	<path class="st0" d="M6.9,15.1L6.9,15.1L7.1,15C7,15,7,15.1,6.9,15.1z"/>
	<polygon class="st0" points="6.8,15 6.7,15 6.9,15 	"/>
	<polygon class="st0" points="9,14 9,14 8.7,14.2 	"/>
	<path class="st0" d="M11.3,13.2c0,0-0.1,0.1-0.1,0.1L11.3,13.2L11.3,13.2z"/>
	<path class="st0" d="M12.9,12.9c0-0.1,0.1,0,0-0.1S12.9,12.8,12.9,12.9z"/>
	<path class="st0" d="M13.2,12.6c0,0-0.1,0-0.1,0.1C13.2,12.7,13.2,12.6,13.2,12.6z"/>
	<path class="st0" d="M5.5,17.5c0,0,0,0,0.1,0v-0.1L5.5,17.5z"/>
	<path class="st0" d="M5.8,17.4l0.1-0.2L5.8,17.4c-0.1-0.1,0-0.1,0-0.2C5.7,17.3,5.8,17.3,5.8,17.4z"/>
	<path class="st0" d="M6,17.1C6.1,17.1,6,17.1,6,17.1C6,17.1,6,17.1,6,17.1z"/>
	<path class="st0" d="M11.9,14.6L11.9,14.6C11.9,14.6,11.8,14.6,11.9,14.6z"/>
	<path class="st0" d="M11.9,14.6L11.9,14.6L11.9,14.6z"/>
	<path class="st0" d="M9.7,14.9C9.6,14.9,9.5,15,9.4,15H9.4c-0.1,0.1,0,0.1-0.1,0.1c-0.1,0-0.2,0.1-0.4,0.1c0,0,0-0.1,0-0.1
		s-0.1,0.1-0.2,0.2l0,0c-0.3,0.2-0.8,0.4-1.2,0.7l0,0C7,16.3,6.6,16.6,6.2,17c0.2-0.1,0.7-0.3,0.8-0.5c0.1,0,0.2-0.1,0.3-0.1
		c0.4-0.1,0.4-0.3,0.8-0.5c0.1,0,0,0,0.1,0.1L8,16.1h0.2c-0.1,0.1-0.2,0.1-0.2,0.2c0.2-0.2,0.6-0.3,0.8-0.4c-0.1,0-0.2,0.1-0.3,0.1
		s-0.1,0-0.1,0c0.3-0.2,0.6-0.3,0.9-0.5c0.1,0,0.2-0.1,0.2-0.1s0,0,0,0.1s0-0.1,0.1-0.2v0.1c0-0.1,0.2-0.1,0.3-0.2s0,0.1-0.1,0.1
		c0.1,0,0.1-0.1,0.2-0.1v0.1c0.1-0.1,0.2-0.1,0.2-0.1s-0.1-0.1,0-0.1s0,0,0.1,0s0-0.1,0.1-0.1s0,0.1,0,0.1c0,0,0.1,0,0.1,0
		c0.1-0.1,0,0,0-0.1s0.1,0.1,0.1,0.1c-0.1,0.1-0.2,0.2-0.3,0.2l0.2-0.1c0,0,0.2,0,0.1,0.1c0.2-0.1,0.5-0.2,0.7-0.4h-0.1
		c0,0,0.1,0,0.1,0s0-0.1,0.1-0.2c0.1,0,0.2-0.1,0.4-0.1v-0.1c0.1,0,0.1-0.1,0.2-0.1s0,0,0,0.1s0.1,0,0.2-0.1v0.1
		c0.1,0,0.2-0.1,0.2,0c0.1-0.1,0.3-0.2,0.5-0.3v0.1c0.1-0.1,0.3-0.1,0.4-0.2l0,0l0.1-0.1c0,0,0.1,0,0.1,0c0.1-0.1,0.3-0.1,0.4-0.2
		c0-0.1,0.2-0.2,0.3-0.2c0.7-0.3,1.4-0.6,2-1c0.1,0,0.2-0.2,0.3-0.3c-0.1,0.1-0.1,0.1-0.3,0.2s-0.2,0-0.3,0h0.1
		c-0.1,0.1-0.1,0-0.2,0.1v-0.1c0,0.1-0.1,0.1-0.2,0.1v0.1c-0.1,0-0.2,0-0.2,0v0.1c-0.1,0-0.3,0.2-0.3,0c0,0,0,0.1-0.1,0.1v-0.1
		c-0.1,0-0.2,0.1-0.2,0.1c0,0,0-0.1,0-0.1c-0.4,0.1,0,0.2-0.3,0.4l0,0l-0.1,0.1h-0.1c-0.1,0.2-0.4,0.2-0.6,0.3s-0.2,0-0.3,0.1v0.1
		c-0.1,0-0.6,0.1-0.8,0c-0.1,0.1,0,0,0,0.1c-0.2,0.1-0.2,0.1-0.4,0.1s0.1,0,0.1,0.1c-0.2,0-0.1,0.1-0.4,0.2c0,0,0.1,0,0.1-0.1
		c-0.2,0.1-0.5,0.3-0.7,0.4c-0.3,0.1-0.8,0.3-1.1,0.4l0,0C9.9,14.7,9.8,14.9,9.7,14.9L9.7,14.9z"/>
	<path class="st0" d="M7.9,16.3L7.9,16.3l0.1-0.1C8,16.2,8,16.3,7.9,16.3z"/>
	<polygon class="st0" points="7.9,16.1 7.8,16.2 8,16.1 	"/>
	<polygon class="st0" points="9.9,15.4 9.9,15.4 9.6,15.5 	"/>
	<path class="st0" d="M11.9,14.7c0,0-0.1,0.1-0.1,0.1L11.9,14.7L11.9,14.7z"/>
	<path class="st0" d="M13.4,14.3C13.4,14.2,13.5,14.3,13.4,14.3C13.3,14.1,13.4,14.3,13.4,14.3z"/>
	<path class="st0" d="M13.6,14C13.6,14,13.6,14,13.6,14C13.6,14.1,13.6,14.1,13.6,14z"/>
</g>
</svg>
