<?xml version="1.0" encoding="utf-8"?>
<!-- Generator: Adobe Illustrator 21.0.0, SVG Export Plug-In . SVG Version: 6.00 Build 0)  -->
<svg version="1.1" id="katman_1" xmlns="http://www.w3.org/2000/svg" xmlns:xlink="http://www.w3.org/1999/xlink" x="0px" y="0px"
	 viewBox="0 0 24 20.8" style="enable-background:new 0 0 24 20.8;" xml:space="preserve">
<style type="text/css">
	.st0{opacity:0.2;enable-background:new    ;}
	.st1{fill:#793D1A;}
	.st2{fill:url(#SVGID_1_);}
	.st3{fill:url(#SVGID_2_);}
	.st4{fill:url(#SVGID_3_);}
	.st5{opacity:0.1;enable-background:new    ;}
	.st6{opacity:0.1;fill:#FFFFFF;enable-background:new    ;}
	.st7{opacity:0.7;}
</style>
<title>system-file-manager_3</title>
<polygon class="st0" points="22,20.7 24,17.6 23.5,17.6 22,20 "/>
<path class="st1" d="M23.8,2.2c0-0.3-0.3-0.6-0.6-0.6h-8.8V0.6c0-0.3-0.3-0.6-0.6-0.6H7.5C7.1,0,6.9,0.3,6.9,0.6v1.1H5.3
	C5,1.6,4.7,1.9,4.7,2.2l0,0v2L4.2,4C3.6,3.7,2.9,3.5,2.3,3.3C1.9,3.3,1,4.1,0.7,4.4C0.4,4.8,0.2,5.2,0,5.7c-0.2,0.4,0.6,1.8,0.9,2.2
	l0.4,0.6l-1.1,1.8c-0.1,0.1-0.1,0.2-0.1,0.3v4.2c0,0.1,0.1,0.3,0.2,0.4l2.2,2.3l1.2,2.5c0.1,0.2,0.3,0.3,0.5,0.3h17.7H22l1.7-2.6
	l0.1-0.2L23.8,2.2z"/>
<linearGradient id="SVGID_1_" gradientUnits="userSpaceOnUse" x1="14.275" y1="4.27" x2="14.275" y2="22.68" gradientTransform="matrix(1 0 0 -1 0 21.73)">
	<stop  offset="0" style="stop-color:#793D1A;stop-opacity:0.8"/>
	<stop  offset="1" style="stop-color:#C96E28"/>
</linearGradient>
<path class="st2" d="M14.3,1.7V0.6c0-0.2-0.2-0.4-0.4-0.4H7.5c-0.2,0-0.4,0.2-0.4,0.4c0,0,0,0,0,0v1.1c0,0.1,0,0.1-0.1,0.1H5.3
	C5.1,1.8,4.9,2,4.9,2.2l0,0v15.2h18.7V2.2c0-0.2-0.2-0.4-0.4-0.4h-8.8C14.3,1.8,14.3,1.8,14.3,1.7C14.3,1.7,14.3,1.7,14.3,1.7z"/>
<linearGradient id="SVGID_2_" gradientUnits="userSpaceOnUse" x1="24.6388" y1="1.3086" x2="21.8488" y2="3.8686" gradientTransform="matrix(1 0 0 -1 0 21.73)">
	<stop  offset="0" style="stop-color:#C96E28"/>
	<stop  offset="1" style="stop-color:#793D1A;stop-opacity:0.8"/>
</linearGradient>
<polygon class="st3" points="22,20 23.6,17.4 21,17.4 "/>
<linearGradient id="SVGID_3_" gradientUnits="userSpaceOnUse" x1="11.095" y1="1.87" x2="11.095" y2="18.25" gradientTransform="matrix(1 0 0 -1 0 21.73)">
	<stop  offset="0" style="stop-color:#DD922E"/>
	<stop  offset="6.000000e-02" style="stop-color:#F9AE42"/>
	<stop  offset="0.42" style="stop-color:#F8DB6E"/>
	<stop  offset="1" style="stop-color:#FDDEB1"/>
</linearGradient>
<path class="st4" d="M21.6,3.2H7.3C6.8,3.7,6.4,4.2,6,4.8L5.8,4.9L4.6,4.3L4.1,4.1C3.5,3.8,2.9,3.6,2.3,3.5c-0.3,0-1.2,0.7-1.4,1
	C0.6,4.9,0.4,5.3,0.2,5.7c0.1,0.7,0.4,1.4,0.8,2l0.5,0.7l-1.1,2c0,0.1-0.1,0.1-0.1,0.2v4.2c0,0.1,0,0.2,0.1,0.3l2.2,2.3v0l1.2,2.5
	C3.8,19.9,3.9,20,4.1,20L22,20V3.6C22,3.4,21.8,3.2,21.6,3.2C21.6,3.2,21.6,3.2,21.6,3.2z"/>
<path class="st5" d="M22.2,2.6H7.9C7.7,2.8,7.5,3,7.3,3.2h14.2c0.2,0,0.4,0.2,0.4,0.4V20l0.6-0.9V3C22.6,2.8,22.4,2.6,22.2,2.6
	C22.2,2.6,22.2,2.6,22.2,2.6z"/>
<path class="st6" d="M7.5,0.9h6.4c0.2,0,0.4,0.2,0.4,0.4V0.6c0-0.2-0.2-0.4-0.4-0.4H7.5c-0.2,0-0.4,0.2-0.4,0.4c0,0,0,0,0,0v0.7
	C7.1,1.1,7.3,0.9,7.5,0.9z"/>
<path class="st6" d="M5.3,2.6H7c0.1,0,0.1,0,0.1-0.1V1.7c0,0.1,0,0.1-0.1,0.1H5.3C5.1,1.8,4.9,2,4.9,2.2l0,0V3
	C4.9,2.8,5,2.6,5.3,2.6C5.3,2.6,5.3,2.5,5.3,2.6z"/>
<path class="st6" d="M23.2,1.8h-8.9c-0.1,0-0.1,0-0.1-0.1c0,0,0,0,0,0v0.7c0,0.1,0,0.1,0.1,0.1l0,0h8.9c0.2,0,0.4,0.2,0.4,0.4V2.2
	C23.6,2,23.5,1.8,23.2,1.8z"/>
<path class="st6" d="M21.6,3.2H7.3C6.8,3.7,6.4,4.2,6,4.8L5.8,4.9L4.6,4.3L4.1,4.1C3.5,3.8,2.9,3.6,2.3,3.5c-0.3,0-1.2,0.7-1.4,1
	C0.6,4.9,0.4,5.3,0.2,5.7c0,0.2,0,0.4,0.1,0.5c0.2-0.4,0.4-0.7,0.6-1c0.3-0.3,1.1-1,1.4-1c0.6,0.1,1.2,0.3,1.8,0.6L4.5,5l1.2,0.6
	l0.3,0C6.4,5,6.8,4.4,7.3,3.9h14.2c0.2,0,0.4,0.2,0.4,0.4V3.6C22,3.4,21.8,3.2,21.6,3.2z"/>
<path class="st0" d="M3.8,19.8l-1.2-2.4v0l-2.2-2.3c-0.1-0.1-0.1-0.2-0.1-0.3v0.7c0,0.1,0,0.2,0.1,0.3L2.6,18v0l1.2,2.5
	c0.1,0.1,0.2,0.2,0.4,0.2h17.8V20H4.1C4,20,3.9,19.9,3.8,19.8z"/>
<g class="st7">
	<path class="st1" d="M14.4,10.4c-1.2-1.6-3.6-1.9-5.2-0.7s-1.9,3.6-0.7,5.2s3.6,1.9,5.2,0.7c0.9-0.7,1.4-1.8,1.4-2.9
		C15.1,11.8,14.9,11,14.4,10.4z M11.4,15.7c-1.7,0-3.1-1.4-3.1-3.1s1.4-3.1,3.1-3.1s3.1,1.4,3.1,3.1l0,0
		C14.5,14.3,13.2,15.7,11.4,15.7C11.4,15.7,11.4,15.7,11.4,15.7L11.4,15.7z"/>
</g>
<g class="st7">
	<path class="st1" d="M16.1,12.6c0-0.8,0.4-1.5,1.1-1.9l-0.6-1.1L16,8.5c-1,0.6-2.4,0.2-3-0.8c-0.2-0.3-0.3-0.7-0.3-1.1h-2.5
		c0,1.2-1,2.2-2.2,2.2c-0.4,0-0.8-0.1-1.1-0.3l-1.3,2.2c1.1,0.6,1.4,2,0.8,3c-0.2,0.3-0.5,0.6-0.8,0.8l0.6,1l0.1,0.1l0,0l0.6,1.1
		c1.1-0.6,2.4-0.2,3,0.8c0.2,0.3,0.3,0.7,0.3,1.1h2.5c0-1.2,1-2.2,2.2-2.2c0.4,0,0.8,0.1,1.1,0.3l1.3-2.2
		C16.6,14.1,16.1,13.4,16.1,12.6z M11.4,16.6c-1.6,0-3-0.9-3.6-2.3l0,0c-0.9-2,0-4.3,2-5.2c2-0.9,4.3,0,5.2,2c0.9,2,0,4.3-2,5.2
		C12.5,16.5,12,16.6,11.4,16.6L11.4,16.6z"/>
</g>
</svg>
