<?xml version="1.0" encoding="utf-8"?>
<!-- Generator: Adobe Illustrator 21.0.0, SVG Export Plug-In . SVG Version: 6.00 Build 0)  -->
<svg version="1.1" id="katman_1" xmlns="http://www.w3.org/2000/svg" xmlns:xlink="http://www.w3.org/1999/xlink" x="0px" y="0px"
	 viewBox="0 0 37 48" style="enable-background:new 0 0 37 48;" xml:space="preserve">
<style type="text/css">
	.st0{opacity:0.7;fill:#333333;enable-background:new    ;}
	.st1{opacity:0.1;fill:#010101;enable-background:new    ;}
	.st2{fill:url(#SVGID_1_);}
	.st3{fill:url(#SVGID_2_);}
	.st4{fill:url(#SVGID_3_);}
	.st5{opacity:0.1;fill:#FFFFFF;enable-background:new    ;}
	.st6{fill:url(#SVGID_4_);}
	.st7{fill:url(#SVGID_5_);}
	.st8{fill:url(#SVGID_6_);}
	.st9{fill:url(#SVGID_7_);}
	.st10{fill:url(#SVGID_8_);}
</style>
<title>preferences-desktop-pripherals_1</title>
<path class="st0" d="M16.3,46.9c-2.8,0-6.8-2-8.5-3.8s-1.9-3.5-2-5.4c0-1.1-0.2-2.2-0.5-3.3c-0.4-1.3-1-2.6-1.8-3.8
	c-0.8-1.3-1.4-2.6-1.9-4c-0.8-2.5-1.1-5.1-0.8-7.8c0.5-2.4,1.6-4.5,3.3-6.3c1.2-1.2,2.6-2.1,4.2-2.5c0-0.4,0-0.8,0-1.2
	c0-2.3-0.1-4.4,0.8-6.2c0.6-1.2,1.7-1.9,3.6-2.3c1.6-0.3,3.3-0.5,5-0.5c1.9-0.1,3.8,0.3,5.5,1C33,5.9,37,11.7,37,21
	c0,9.5-4.9,18.3-13,23.2c-0.3,0.2-0.6,0.4-0.9,0.6C21.1,46.3,18.7,47.1,16.3,46.9z"/>
<path class="st0" d="M6.7,26.7c-0.3,0-0.5,0-0.8-0.1c-3.4-0.6-5.9-3.5-5.9-7c0-1.8,0.4-4.4,4.3-6c0.7-0.3,1.4-0.4,2.1-0.4
	c0.7,0,1.5,0.2,2.1,0.6c1.2,1.2,1.2,3.8,1.2,5.7v0.3c0.1,1.8-0.1,3.5-0.5,5.2C8.8,26.1,7.8,26.7,6.7,26.7z"/>
<path class="st1" d="M23.8,43.9c-2,1.3-3.2,2.7-7.5,2.7c-3.1-0.3-6-1.5-8.3-3.6c-2.7-2.7-1.4-5.2-2.4-8.5c-0.8-2.8-2.6-4.8-3.6-7.8
	c-0.5-1.6-0.8-3.2-0.9-4.9C1.1,23.9,1.4,26,2,28.1c1,3,2.8,5,3.6,7.8c1,3.3-0.2,5.8,2.4,8.5c2.3,2.1,5.1,3.4,8.2,3.7
	c4.4,0,5.5-1.4,7.5-2.7c8-4.9,12.8-13.6,12.8-22.9c0-0.3,0-0.5,0-0.8C36.4,30.7,31.6,39.1,23.8,43.9z"/>
<radialGradient id="SVGID_1_" cx="26.3483" cy="22.3917" r="21.4" gradientTransform="matrix(0.96 0 0 -0.96 -6.51 44.9108)" gradientUnits="userSpaceOnUse">
	<stop  offset="0" style="stop-color:#F7F7F7"/>
	<stop  offset="0.3" style="stop-color:#F3F3F3"/>
	<stop  offset="0.61" style="stop-color:#E7E7E7"/>
	<stop  offset="0.92" style="stop-color:#D3D3D3"/>
	<stop  offset="1" style="stop-color:#CCCCCC"/>
</radialGradient>
<path class="st2" d="M36.6,21c0,9.3-4.8,18-12.8,22.9c-2,1.3-3.2,2.7-7.5,2.7c-3.1-0.3-6-1.5-8.3-3.6c-2.7-2.7-1.4-5.2-2.4-8.5
	c-0.8-2.8-2.6-4.8-3.6-7.8c-0.8-2.4-1-5-0.7-7.5c0.4-2.3,1.5-4.4,3.1-6.1c2.2-2,3.9-2.4,4.4-2.4c0-2.9-0.3-5.5,0.7-7.5
	c0.5-1,1.4-1.7,3.4-2.2c1.2-0.3,6.8-1.2,10.2,0.5C32.9,6.3,36.6,11.9,36.6,21z"/>
<path class="st0" d="M14.9,21.2c-2.2,0-4.1-1.8-4.1-4.1l0,0V1.2L11,1.1c0.6-0.3,1.2-0.5,1.8-0.6c1.6-0.3,3.3-0.5,5-0.5
	c1.9-0.1,3.7,0.3,5.5,1c1.9,0.9,3.7,2,5.4,3.2l0.1,0.1V14c0,3.9-3.2,7.1-7.1,7.1h0L14.9,21.2z"/>
<linearGradient id="SVGID_2_" gradientUnits="userSpaceOnUse" x1="11.19" y1="37.1381" x2="28.4301" y2="37.1381" gradientTransform="matrix(1 0 0 -1 0 47.73)">
	<stop  offset="0" style="stop-color:#CCCCCC"/>
	<stop  offset="1" style="stop-color:#F7F7F7"/>
</linearGradient>
<path class="st3" d="M23.1,1.4c-3.4-1.7-9-0.8-10.2-0.5c-0.6,0.1-1.2,0.3-1.7,0.6v15.6c0,2,1.7,3.7,3.7,3.7l0,0h6.8
	c3.7,0,6.8-3,6.8-6.8c0,0,0,0,0,0V4.6C26.7,3.3,25,2.3,23.1,1.4z"/>
<path class="st0" d="M6.7,26.3c-0.2,0-0.5,0-0.7-0.1c-3.3-0.5-5.6-3.4-5.6-6.7c0-1.7,0.4-4.1,4.1-5.7c0.6-0.3,1.3-0.4,2-0.4
	c0.6,0,1.3,0.1,1.8,0.5c1.1,1,1.1,3.6,1.1,5.4v0.3c0.1,1.7-0.1,3.5-0.5,5.1C8.5,25.8,7.7,26.4,6.7,26.3z"/>
<path class="st0" d="M19.8,12.4c-0.9,0-1.6-0.7-1.6-1.6V6.7c0.1-0.9,0.8-1.5,1.7-1.4c0.8,0.1,1.4,0.7,1.4,1.4v4.1
	C21.4,11.7,20.7,12.4,19.8,12.4z"/>
<linearGradient id="SVGID_3_" gradientUnits="userSpaceOnUse" x1="18.59" y1="38.95" x2="21.02" y2="38.95" gradientTransform="matrix(1 0 0 -1 0 47.73)">
	<stop  offset="0" style="stop-color:#DD922E"/>
	<stop  offset="0.71" style="stop-color:#F9AE42"/>
	<stop  offset="1" style="stop-color:#F8DB6E"/>
</linearGradient>
<path class="st4" d="M19.8,5.5L19.8,5.5C20.5,5.5,21,6,21,6.7v4.1c0,0.7-0.5,1.2-1.2,1.2h0c-0.7,0-1.2-0.5-1.2-1.2V6.7
	C18.6,6,19.1,5.5,19.8,5.5z"/>
<path class="st0" d="M19.8,22.3c-0.9,0-1.6-0.7-1.6-1.6v-5.6c0.1-0.9,0.8-1.5,1.7-1.4c0.8,0.1,1.4,0.7,1.4,1.4v5.6
	C21.4,21.6,20.7,22.3,19.8,22.3z"/>
<path class="st5" d="M4.4,14.5c2.2-2.1,3.9-2.4,4.4-2.4c0-0.5,0-1,0-1.4c-0.5,0-2.2,0.4-4.3,2.4c-1.6,1.7-2.7,3.8-3.2,6.1
	C1.1,20,1,20.9,1.1,21.8c0-0.4,0.1-0.8,0.1-1.2C1.7,18.3,2.8,16.1,4.4,14.5z"/>
<linearGradient id="SVGID_4_" gradientUnits="userSpaceOnUse" x1="8.71" y1="38.145" x2="8.74" y2="38.145" gradientTransform="matrix(1 0 0 -1 0 47.73)">
	<stop  offset="0" style="stop-color:#CCCCCC"/>
	<stop  offset="1" style="stop-color:#F7F7F7"/>
</linearGradient>
<path class="st6" d="M8.7,8.5c0,0.7,0,1.4,0,2.1l0,0C8.7,9.9,8.7,9.2,8.7,8.5z"/>
<linearGradient id="SVGID_5_" gradientUnits="userSpaceOnUse" x1="18.59" y1="29.79" x2="21.02" y2="29.79" gradientTransform="matrix(1 0 0 -1 0 47.73)">
	<stop  offset="0" style="stop-color:#CCCCCC"/>
	<stop  offset="1" style="stop-color:#F7F7F7"/>
</linearGradient>
<path class="st7" d="M19.8,13.9L19.8,13.9c0.7,0,1.2,0.5,1.2,1.2v5.6c0,0.7-0.5,1.2-1.2,1.2h0c-0.7,0-1.2-0.5-1.2-1.2v-5.6
	C18.6,14.5,19.1,13.9,19.8,13.9z"/>
<linearGradient id="SVGID_6_" gradientUnits="userSpaceOnUse" x1="19.06" y1="31.67" x2="20.55" y2="31.67" gradientTransform="matrix(1 0 0 -1 0 47.73)">
	<stop  offset="0" style="stop-color:#DD922E"/>
	<stop  offset="0.71" style="stop-color:#F9AE42"/>
	<stop  offset="1" style="stop-color:#F8DB6E"/>
</linearGradient>
<path class="st8" d="M19.8,14.4L19.8,14.4c0.4,0,0.8,0.3,0.8,0.8v1.7c0,0.4-0.3,0.8-0.8,0.8l0,0c-0.4,0-0.8-0.3-0.8-0.8v-1.7
	C19.1,14.8,19.4,14.4,19.8,14.4z"/>
<linearGradient id="SVGID_7_" gradientUnits="userSpaceOnUse" x1="19.06" y1="27.93" x2="20.55" y2="27.93" gradientTransform="matrix(1 0 0 -1 0 47.73)">
	<stop  offset="0" style="stop-color:#DD922E"/>
	<stop  offset="0.71" style="stop-color:#F9AE42"/>
	<stop  offset="1" style="stop-color:#F8DB6E"/>
</linearGradient>
<path class="st9" d="M19.8,18.2L19.8,18.2c0.4,0,0.8,0.3,0.8,0.8v1.7c0,0.4-0.3,0.8-0.8,0.8l0,0c-0.4,0-0.8-0.3-0.8-0.8v-1.7
	C19.1,18.5,19.4,18.2,19.8,18.2z"/>
<path class="st5" d="M12.9,2.3c1.2-0.3,6.8-1.2,10.2,0.5c9.5,4.8,13.3,10.2,13.5,18.8c0-0.2,0-0.5,0-0.7c0-9-3.7-14.7-13.5-19.6
	c-3.4-1.7-9-0.8-10.2-0.5c-2,0.5-2.9,1.2-3.4,2.2c-0.7,1.7-1,3.6-0.8,5.5c0-1.4,0.2-2.7,0.8-4C10,3.6,10.9,2.8,12.9,2.3z"/>
<radialGradient id="SVGID_8_" cx="11.8383" cy="46.1956" r="5.38" gradientTransform="matrix(0.96 0 0 -1.63 -6.51 95.2599)" gradientUnits="userSpaceOnUse">
	<stop  offset="0" style="stop-color:#F7F7F7"/>
	<stop  offset="0.3" style="stop-color:#F3F3F3"/>
	<stop  offset="0.61" style="stop-color:#E7E7E7"/>
	<stop  offset="0.92" style="stop-color:#D3D3D3"/>
	<stop  offset="1" style="stop-color:#CCCCCC"/>
</radialGradient>
<path class="st10" d="M9,19.6c0.1,1.7-0.1,3.4-0.5,5.1c-0.3,1-1.4,1.5-2.4,1.2c0,0,0,0,0,0c-3.1-0.5-5.3-3.2-5.3-6.3
	c0-1.7,0.5-3.9,3.9-5.3c1.1-0.5,2.3-0.5,3.4,0C9,15.2,9,17.8,9,19.6z"/>
<path class="st5" d="M4.6,15.7c1.1-0.5,2.3-0.5,3.4,0c0.9,0.8,1,2.9,1,4.6c0-0.2,0-0.5,0-0.7c0-1.8,0-4.4-1-5.3
	c-1.1-0.5-2.3-0.5-3.4,0c-3.4,1.5-3.9,3.7-3.9,5.3c0,0.2,0,0.5,0,0.7C0.9,18.7,1.7,16.9,4.6,15.7z"/>
</svg>
