<?xml version="1.0" encoding="utf-8"?>
<!-- Generator: Adobe Illustrator 21.0.0, SVG Export Plug-In . SVG Version: 6.00 Build 0)  -->
<svg version="1.1" id="katman_1" xmlns="http://www.w3.org/2000/svg" xmlns:xlink="http://www.w3.org/1999/xlink" x="0px" y="0px"
	 viewBox="0 0 16 10.7" style="enable-background:new 0 0 16 10.7;" xml:space="preserve">
<style type="text/css">
	.st0{fill:#FFFFFF;}
	.st1{fill:#2D3033;}
	.st2{fill:#D1D3D4;}
	.st3{fill:url(#_Bileşik_Yol__1_);}
</style>
<title>gnome-desktop-config_5</title>
<rect id="_Dikdörtgen_" x="0.9" y="0.9" class="st0" width="14.1" height="8.9"/>
<polygon id="_Yol_" class="st1" points="0.7,9.9 0.7,0.9 7.5,0.9 14.9,8.6 15.7,9.9 "/>
<path class="st2" d="M14.9,8.5L14.9,8.5c-1.9-1.4-4.3-1.8-6.6-1.1c0,0,1.2-3.9-0.7-6.4l0,0L14.9,8.5z"/>
<path class="st1" d="M0.4,10.7c-0.2,0-0.4-0.2-0.4-0.4V0.4C0,0.2,0.2,0,0.4,0c0,0,0,0,0,0h15.3C15.8,0,16,0.2,16,0.4v9.9
	c0,0.2-0.2,0.4-0.4,0.4H0.4z M14.9,9.6V1.1H1.1v8.5H14.9z"/>
<linearGradient id="_Bileşik_Yol__1_" gradientUnits="userSpaceOnUse" x1="8" y1="1.4" x2="8" y2="11.93" gradientTransform="matrix(1 0 0 -1 0 12)">
	<stop  offset="0" style="stop-color:#A3A3A3"/>
	<stop  offset="0.13" style="stop-color:#BCBBBB"/>
	<stop  offset="0.27" style="stop-color:#D0CECE"/>
	<stop  offset="0.43" style="stop-color:#DEDCDB"/>
	<stop  offset="0.64" style="stop-color:#E6E4E3"/>
	<stop  offset="1" style="stop-color:#E8E6E5"/>
</linearGradient>
<path id="_Bileşik_Yol_" class="st3" d="M15.6,0.1H0.4c-0.2,0-0.3,0.1-0.3,0.3c0,0,0,0,0,0v9.9c0,0.2,0.1,0.3,0.3,0.3c0,0,0,0,0,0
	h15.3c0.2,0,0.3-0.1,0.3-0.3l0,0V0.4C15.9,0.2,15.8,0.1,15.6,0.1z M15,9.7H1V1h14V9.7z"/>
</svg>
