<?xml version="1.0" encoding="utf-8"?>
<!-- Generator: Adobe Illustrator 21.0.0, SVG Export Plug-In . SVG Version: 6.00 Build 0)  -->
<svg version="1.1" id="katman_1" xmlns="http://www.w3.org/2000/svg" xmlns:xlink="http://www.w3.org/1999/xlink" x="0px" y="0px"
	 viewBox="0 0 12.4 16" style="enable-background:new 0 0 12.4 16;" xml:space="preserve">
<style type="text/css">
	.st0{opacity:0.2;enable-background:new    ;}
	.st1{fill:url(#SVGID_1_);}
	.st2{opacity:0.1;enable-background:new    ;}
	.st3{fill:#F5F5F5;}
	.st4{opacity:0.1;fill:#FFFFFF;enable-background:new    ;}
	.st5{opacity:0.5;}
	.st6{opacity:0.1;}
</style>
<title>libreoffice-draw_7</title>
<path class="st0" d="M0,14.6v0.6C0,15.6,0.4,16,0.8,16h10.7c0.5,0,0.8-0.4,0.8-0.8l0,0v-0.6c0,0.5-0.4,0.8-0.8,0.8l0,0H0.8
	C0.4,15.4,0,15.1,0,14.6C0,14.6,0,14.6,0,14.6z"/>
<linearGradient id="SVGID_1_" gradientUnits="userSpaceOnUse" x1="6.175" y1="1.57" x2="6.175" y2="17.29" gradientTransform="matrix(1 0 0 -1 0 17.29)">
	<stop  offset="0" style="stop-color:#F6A200"/>
	<stop  offset="1" style="stop-color:#FCC00D"/>
</linearGradient>
<path class="st1" d="M12.4,14.9v-14C12.4,0.4,12,0,11.5,0c0,0,0,0,0,0H0.8C0.4,0,0,0.4,0,0.8v14c0,0.5,0.4,0.8,0.8,0.8c0,0,0,0,0,0
	h10.7C12,15.7,12.3,15.3,12.4,14.9z"/>
<path class="st2" d="M1.1,1.4v13.5h10.1V6.1L6.5,1.4H1.1z M8.1,1.4l3.1,3.1V1.4H8.1z"/>
<path class="st3" d="M1.1,1.1v13.5h10.1V5.8L6.5,1.1H1.1z M8.1,1.1l3.1,3.1V1.1H8.1z"/>
<path class="st4" d="M0.8,0C0.4,0,0,0.4,0,0.8v0.3c0-0.5,0.4-0.8,0.8-0.8l0,0h10.7c0.5,0,0.8,0.4,0.8,0.8c0,0,0,0,0,0V0.8
	C12.4,0.4,12,0,11.5,0c0,0,0,0,0,0H0.8z"/>
<g class="st5">
	<path d="M5.2,12.1c-0.5,0-0.9-0.3-1.2-0.6c-0.3-0.7-0.5-1.4-0.5-2.1H3H2.2V9.1l0.8,0h0.5c0-0.4,0.1-0.9,0.3-1.3
		c0.1-0.5,0.4-0.8,0.9-1C5.9,6.5,6.5,7.4,7,8.1s0.8,1,1.3,0.8s0.3-0.8,0.1-1.5S8.1,6,8.6,5.7S9.9,6.3,10,6.5l0.1,0.1L10,6.8L9.9,6.7
		C9.5,6.3,9,5.9,8.8,6C8.4,6.2,8.5,6.8,8.6,7.5S9,9,8.4,9.2S7.3,9,6.8,8.4S5.8,6.9,4.7,7.1C4.4,7.3,4.1,7.6,4,7.9
		C3.9,8.3,3.8,8.7,3.8,9.2c0.9,0,1.7,0.4,2.3,1.1C6.6,11,6.4,11.6,6,11.9C5.8,12.1,5.5,12.1,5.2,12.1z M3.7,9.4c0,0.7,0.1,1.4,0.4,2
		c0.4,0.5,1.1,0.7,1.7,0.3c0.4-0.3,0.4-0.8,0-1.4C5.3,9.8,4.5,9.4,3.7,9.4z"/>
</g>
<g class="st6">
	<path d="M5.2,12.4c-0.5,0-0.9-0.3-1.2-0.6c-0.3-0.7-0.5-1.4-0.5-2.1L3,9.6H2.2V9.3H3h0.5c0-0.4,0.1-0.8,0.3-1.2
		c0.1-0.5,0.4-0.8,0.9-1C5.9,6.8,6.5,7.7,7,8.4s0.8,1,1.3,0.8C8.8,9,8.6,8.4,8.4,7.7S8.1,6.3,8.6,6s1.3,0.6,1.4,0.7l0.1,0.1L10,7
		L9.9,6.9C9.6,6.6,9,6.1,8.8,6.2C8.4,6.5,8.5,7.1,8.7,7.7S9,9.2,8.4,9.5S7.3,9.2,6.8,8.6S5.8,7.1,4.7,7.4C4.4,7.5,4.1,7.8,4,8.2
		C3.9,8.6,3.8,9,3.8,9.4c0.9,0,1.7,0.4,2.3,1.1c0.5,0.8,0.3,1.4-0.1,1.7C5.8,12.3,5.5,12.4,5.2,12.4z M3.7,9.6c0,0.7,0.1,1.4,0.4,2
		c0.4,0.5,1.1,0.7,1.7,0.4c0.4-0.3,0.4-0.8,0-1.4C5.3,10,4.5,9.7,3.7,9.6z"/>
</g>
</svg>
