<?xml version="1.0" encoding="utf-8"?>
<!-- Generator: Adobe Illustrator 21.0.0, SVG Export Plug-In . SVG Version: 6.00 Build 0)  -->
<svg version="1.1" id="katman_1" xmlns="http://www.w3.org/2000/svg" xmlns:xlink="http://www.w3.org/1999/xlink" x="0px" y="0px"
	 viewBox="0 0 16 16" style="enable-background:new 0 0 16 16;" xml:space="preserve">
<style type="text/css">
	.st0{opacity:0.5;fill:#1A1A1A;enable-background:new    ;}
	.st1{fill:url(#SVGID_1_);}
	.st2{fill:url(#SVGID_2_);}
	.st3{opacity:0.5;fill:#20396E;enable-background:new    ;}
	.st4{fill:url(#SVGID_3_);}
	.st5{fill:url(#SVGID_4_);}
	.st6{fill:url(#SVGID_5_);}
</style>
<title>notification-network-wired_5</title>
<path class="st0" d="M11.1,13.2c-0.1,0-0.1,0-0.2,0L4.4,9.8C4.2,9.7,4.1,9.5,4.2,9.3c0,0,0,0,0,0l0.4-0.7c0.1-0.1,0.2-0.2,0.3-0.2
	c0.1,0,0.1,0,0.2,0l6.6,3.4c0.2,0.1,0.3,0.3,0.2,0.5c0,0,0,0,0,0L11.5,13C11.4,13.1,11.3,13.2,11.1,13.2z"/>
<linearGradient id="SVGID_1_" gradientUnits="userSpaceOnUse" x1="41.1137" y1="-8.5479" x2="48.6937" y2="-8.5479" gradientTransform="matrix(0.95 -2.000000e-02 2.000000e-02 -0.99 -34.42 3.25)">
	<stop  offset="0" style="stop-color:#E7E6E6"/>
	<stop  offset="0.22" style="stop-color:#DFDFDF"/>
	<stop  offset="0.55" style="stop-color:#CACACA"/>
	<stop  offset="0.95" style="stop-color:#A8A9A9"/>
	<stop  offset="1" style="stop-color:#A3A4A4"/>
</linearGradient>
<path class="st1" d="M11.5,12.6L11.5,12.6c-0.2,0.3-0.6,0.4-0.9,0.3l-5.8-3C4.5,9.8,4.4,9.4,4.5,9.1c0,0,0,0,0-0.1l0,0
	c0.2-0.3,0.6-0.4,0.9-0.3l5.9,3C11.6,11.9,11.7,12.3,11.5,12.6C11.6,12.6,11.5,12.6,11.5,12.6z"/>
<path class="st0" d="M4.9,7.7c-0.1,0-0.3-0.1-0.3-0.2L4.2,6.7c-0.1-0.2,0-0.4,0.2-0.5L11.2,3c0.1,0,0.1,0,0.2,0
	c0.1,0,0.3,0.1,0.3,0.2l0.4,0.7c0.1,0.2,0,0.4-0.2,0.5L5.1,7.6C5,7.6,5,7.6,4.9,7.7L4.9,7.7z"/>
<linearGradient id="SVGID_2_" gradientUnits="userSpaceOnUse" x1="67.1056" y1="38.6793" x2="76.7056" y2="43.3193" gradientTransform="matrix(0.91 4.000000e-02 -4.000000e-02 -0.98 -54.97 42.28)">
	<stop  offset="0" style="stop-color:#E7E6E6"/>
	<stop  offset="0.22" style="stop-color:#DFDFDF"/>
	<stop  offset="0.55" style="stop-color:#CACACA"/>
	<stop  offset="0.95" style="stop-color:#A8A9A9"/>
	<stop  offset="1" style="stop-color:#A3A4A4"/>
</linearGradient>
<path class="st2" d="M4.5,7.1L4.5,7.1c0.2,0.3,0.5,0.5,0.9,0.3l6.1-2.9c0.3-0.2,0.5-0.5,0.3-0.9c0,0,0,0,0,0l0,0
	c-0.2-0.3-0.5-0.5-0.9-0.3L4.8,6.2C4.5,6.3,4.4,6.7,4.5,7.1C4.5,7,4.5,7,4.5,7.1z"/>
<ellipse class="st3" cx="13.2" cy="2.7" rx="2.7" ry="2.7"/>
<radialGradient id="SVGID_3_" cx="13.11" cy="15.3" r="2.57" gradientTransform="matrix(1 0 0 -1 7.000000e-02 18)" gradientUnits="userSpaceOnUse">
	<stop  offset="0" style="stop-color:#2A6D94"/>
	<stop  offset="1" style="stop-color:#2D5778"/>
</radialGradient>
<ellipse class="st4" cx="13.2" cy="2.7" rx="2.6" ry="2.6"/>
<ellipse class="st3" cx="2.7" cy="8" rx="2.7" ry="2.7"/>
<radialGradient id="SVGID_4_" cx="2.63" cy="9.97" r="2.57" gradientTransform="matrix(1 0 0 -1 0 18)" gradientUnits="userSpaceOnUse">
	<stop  offset="0" style="stop-color:#2A6D94"/>
	<stop  offset="1" style="stop-color:#2D5778"/>
</radialGradient>
<ellipse class="st5" cx="2.7" cy="8" rx="2.6" ry="2.6"/>
<ellipse class="st3" cx="13.3" cy="13.3" rx="2.7" ry="2.7"/>
<radialGradient id="SVGID_5_" cx="13.17" cy="4.7" r="2.57" gradientTransform="matrix(1 0 0 -1 0 18)" gradientUnits="userSpaceOnUse">
	<stop  offset="0" style="stop-color:#2A6D94"/>
	<stop  offset="1" style="stop-color:#2D5778"/>
</radialGradient>
<ellipse class="st6" cx="13.3" cy="13.3" rx="2.6" ry="2.6"/>
</svg>
