<?xml version="1.0" encoding="utf-8"?>
<!-- Generator: Adobe Illustrator 21.0.0, SVG Export Plug-In . SVG Version: 6.00 Build 0)  -->
<svg version="1.1" id="katman_1" xmlns="http://www.w3.org/2000/svg" xmlns:xlink="http://www.w3.org/1999/xlink" x="0px" y="0px"
	 viewBox="0 0 18.4 22" style="enable-background:new 0 0 18.4 22;" xml:space="preserve">
<style type="text/css">
	.st0{opacity:0.7;fill:#1A1A1A;enable-background:new    ;}
	.st1{fill:url(#SVGID_1_);}
	.st2{opacity:0.7;}
	.st3{fill:#42210B;}
	.st4{fill:url(#SVGID_2_);}
	.st5{opacity:0.1;fill:#FFFFFF;enable-background:new    ;}
	.st6{opacity:0.1;enable-background:new    ;}
</style>
<title>Varlık 9</title>
<path class="st0" d="M5.2,8.8V6.9c0-2.2,1.8-4,4-4s4,1.8,4,4v1.9H16V6.9c0-3.7-2.9-6.8-6.6-6.9H9C5.3,0.1,2.3,3.2,2.3,6.9v1.9H5.2z"
	/>
<linearGradient id="SVGID_1_" gradientUnits="userSpaceOnUse" x1="9.19" y1="13.76" x2="9.19" y2="22.13" gradientTransform="matrix(1 0 0 -1 0 21.73)">
	<stop  offset="0" style="stop-color:#A3A4A4"/>
	<stop  offset="2.000000e-02" style="stop-color:#A6A7A7"/>
	<stop  offset="0.27" style="stop-color:#C2C2C2"/>
	<stop  offset="0.52" style="stop-color:#D7D6D6"/>
	<stop  offset="0.76" style="stop-color:#E3E2E2"/>
	<stop  offset="1" style="stop-color:#E7E6E6"/>
</linearGradient>
<path class="st1" d="M13.3,8.7V6.9c0-2.3-1.9-4.2-4.2-4.2S5,4.6,5,6.9c0,0,0,0,0,0v1.8H2.5V6.9c0-3.6,2.9-6.6,6.5-6.7h0.4
	c3.6,0.1,6.5,3.1,6.5,6.7v1.8H13.3z"/>
<g class="st2">
	<path class="st3" d="M17.4,21.7H1c-0.6,0-1-0.4-1-1V9.4c0-0.6,0.4-1,1-1h16.4c0.6,0,1,0.4,1,1v11.3C18.3,21.2,17.9,21.7,17.4,21.7z
		 M1,8.7C0.6,8.7,0.4,9,0.4,9.3l0,0v11.3c0,0.4,0.3,0.6,0.6,0.6h16.4c0.4,0,0.6-0.3,0.6-0.6V9.4c0-0.4-0.3-0.6-0.6-0.6L1,8.7z"/>
</g>
<linearGradient id="SVGID_2_" gradientUnits="userSpaceOnUse" x1="9.17" y1="0.23" x2="9.17" y2="13.21" gradientTransform="matrix(1 0 0 -1 0 21.73)">
	<stop  offset="0" style="stop-color:#DD922E"/>
	<stop  offset="6.000000e-02" style="stop-color:#F9AE42"/>
	<stop  offset="0.42" style="stop-color:#F8DB6E"/>
	<stop  offset="1" style="stop-color:#FDDEB1"/>
</linearGradient>
<path class="st4" d="M1,8.5h16.4c0.4,0,0.8,0.4,0.8,0.8v11.4c0,0.4-0.4,0.8-0.8,0.8H1c-0.4,0-0.8-0.4-0.8-0.8V9.3
	C0.2,8.9,0.5,8.5,1,8.5z"/>
<path class="st3" d="M10.5,15.5v3c0,0.4-0.3,0.6-0.6,0.6H8.4c-0.4,0-0.6-0.3-0.6-0.6v-3c-0.7-0.7-0.7-1.9,0-2.6
	c0.3-0.3,0.7-0.5,1.2-0.5h0.4c1,0.1,1.8,1,1.7,2C11,14.8,10.9,15.2,10.5,15.5L10.5,15.5z"/>
<path class="st5" d="M9.4,0.2H9C5.4,0.3,2.5,3.3,2.5,6.9v0.7c0-3.6,2.9-6.6,6.5-6.7h0.4c3.6,0.1,6.5,3.1,6.5,6.7V6.9
	C15.9,3.3,13,0.3,9.4,0.2z"/>
<path class="st6" d="M13.3,6.9c0-2.3-1.9-4.2-4.2-4.2S5,4.6,5,6.9c0,0,0,0,0,0v0.7c0-2.3,1.9-4.2,4.2-4.2s4.2,1.9,4.2,4.2
	c0,0,0,0,0,0V6.9z"/>
<path class="st5" d="M17.4,8.7H1C0.7,8.7,0.4,9,0.4,9.3l0,0V10c0-0.3,0.3-0.6,0.6-0.6c0,0,0,0,0,0h16.4c0.3,0,0.6,0.3,0.6,0.6V9.3
	C18,9,17.7,8.7,17.4,8.7z"/>
<path class="st6" d="M17.4,21.3H1c-0.3,0-0.6-0.3-0.6-0.6v0.7C0.4,21.7,0.7,22,1,22h16.4c0.3,0,0.6-0.3,0.6-0.6v-0.7
	C18,21,17.7,21.3,17.4,21.3z"/>
</svg>
