<?xml version="1.0" encoding="utf-8"?>
<!-- Generator: Adobe Illustrator 21.0.0, SVG Export Plug-In . SVG Version: 6.00 Build 0)  -->
<svg version="1.1" id="katman_1" xmlns="http://www.w3.org/2000/svg" xmlns:xlink="http://www.w3.org/1999/xlink" x="0px" y="0px"
	 viewBox="0 0 32 27.7" style="enable-background:new 0 0 32 27.7;" xml:space="preserve">
<style type="text/css">
	.st0{opacity:0.2;enable-background:new    ;}
	.st1{fill:#793D1A;}
	.st2{fill:url(#SVGID_1_);}
	.st3{fill:url(#SVGID_2_);}
	.st4{fill:url(#SVGID_3_);}
	.st5{opacity:0.1;enable-background:new    ;}
	.st6{opacity:0.1;fill:#FFFFFF;enable-background:new    ;}
	.st7{fill:url(#SVGID_4_);}
	.st8{fill:url(#SVGID_5_);}
	.st9{fill:url(#SVGID_6_);}
	.st10{opacity:0.7;fill:#793D1A;}
</style>
<title>folder-templates_2</title>
<polygon class="st0" points="29.3,27.6 32,23.5 31.4,23.5 29.3,26.7 "/>
<path class="st1" d="M31.8,3c0-0.4-0.3-0.8-0.7-0.8c0,0,0,0,0,0H19.3V0.8c0-0.4-0.3-0.8-0.8-0.8c0,0,0,0,0,0H10
	C9.6,0,9.2,0.3,9.2,0.8c0,0,0,0,0,0v1.4H7.1c-0.4,0-0.8,0.3-0.8,0.8c0,0,0,0,0,0.1v2.6L5.5,5.2C4.8,4.9,3.9,4.6,3.1,4.5
	c-0.6,0-1.7,1-2.1,1.5C0.6,6.4,0.2,7,0,7.6c-0.2,0.6,0.8,2.3,1.1,2.9l0.6,0.8l-1.4,2.4c-0.1,0.1-0.1,0.3-0.1,0.4v5.6
	c0,0.2,0.1,0.4,0.2,0.5l2.9,3l1.6,3.3C5,26.8,5.2,26.9,5.5,27h23.6h0.3l2.2-3.4l0.1-0.2V3z"/>
<linearGradient id="SVGID_1_" gradientUnits="userSpaceOnUse" x1="19.0396" y1="4.45" x2="19.0396" y2="28.99" gradientTransform="matrix(1 0 0 -1 0 27.73)">
	<stop  offset="0" style="stop-color:#793D1A;stop-opacity:0.8"/>
	<stop  offset="1" style="stop-color:#C96E28"/>
</linearGradient>
<path class="st2" d="M19,2.3V0.8c0-0.3-0.2-0.5-0.5-0.5l0,0H10c-0.3,0-0.5,0.2-0.5,0.5v1.5c0,0.1-0.1,0.1-0.1,0.1l0,0H7.1
	c-0.3,0-0.5,0.2-0.5,0.5c0,0,0,0,0,0.1v20.2h24.9V3c0-0.3-0.2-0.5-0.5-0.6c0,0,0,0,0,0H19.2C19.1,2.5,19,2.4,19,2.3
	C19,2.3,19,2.3,19,2.3z"/>
<linearGradient id="SVGID_2_" gradientUnits="userSpaceOnUse" x1="32.8517" y1="0.5018" x2="29.1317" y2="3.9218" gradientTransform="matrix(1 0 0 -1 0 27.73)">
	<stop  offset="0" style="stop-color:#C96E28"/>
	<stop  offset="1" style="stop-color:#793D1A;stop-opacity:0.8"/>
</linearGradient>
<polygon class="st3" points="29.3,26.7 31.5,23.3 28,23.3 "/>
<linearGradient id="SVGID_3_" gradientUnits="userSpaceOnUse" x1="14.745" y1="1.25" x2="14.745" y2="23.09" gradientTransform="matrix(1 0 0 -1 0 27.73)">
	<stop  offset="0" style="stop-color:#DD922E"/>
	<stop  offset="6.000000e-02" style="stop-color:#F9AE42"/>
	<stop  offset="0.42" style="stop-color:#F8DB6E"/>
	<stop  offset="1" style="stop-color:#FDDEB1"/>
</linearGradient>
<path class="st4" d="M28.7,4.3h-19C9.1,4.9,8.5,5.6,8,6.4c-0.1,0-0.2,0.1-0.3,0.1L6.1,5.7L5.5,5.5C4.7,5.1,3.9,4.8,3.1,4.7
	c-0.4,0-1.5,0.9-1.9,1.4c-0.4,0.5-0.7,1-0.9,1.6c0.1,1,0.5,1.9,1.1,2.7l0.6,1l-1.5,2.5C0.4,14,0.4,14,0.4,14.1v5.6
	c0,0.1,0.1,0.3,0.1,0.4l2.9,3v0.1L5,26.4c0.1,0.2,0.3,0.3,0.5,0.3h23.8V4.8C29.2,4.5,29,4.3,28.7,4.3z"/>
<path class="st5" d="M29.6,3.4h-19C10.3,3.7,10,3.9,9.8,4.3h19c0.3,0,0.5,0.2,0.5,0.5v0v21.9l0.8-1.2V4c0-0.3-0.2-0.6-0.5-0.6
	C29.6,3.4,29.6,3.4,29.6,3.4z"/>
<path class="st6" d="M10,1.2h8.5c0.3,0,0.5,0.2,0.5,0.5c0,0,0,0,0,0v-1c0-0.3-0.2-0.5-0.5-0.5l0,0H10c-0.3,0-0.5,0.2-0.5,0.5v1
	C9.5,1.5,9.7,1.2,10,1.2z"/>
<path class="st6" d="M7.1,3.4h2.2c0.1,0,0.1-0.1,0.1-0.1v0v-1c0,0.1-0.1,0.1-0.1,0.1l0,0H7.1c-0.3,0-0.5,0.2-0.5,0.5c0,0,0,0,0,0.1
	v1C6.5,3.7,6.7,3.4,7.1,3.4C7.1,3.4,7.1,3.4,7.1,3.4z"/>
<path class="st6" d="M31,2.4H19.2c-0.1,0-0.1,0-0.2-0.1c0,0,0,0,0-0.1v1c0,0.1,0.1,0.1,0.1,0.1H31c0.3,0,0.5,0.2,0.5,0.5
	c0,0,0,0,0,0V3C31.6,2.7,31.3,2.5,31,2.4C31,2.4,31,2.4,31,2.4z"/>
<path class="st6" d="M28.7,4.3h-19C9.1,4.9,8.5,5.6,8,6.4c-0.1,0-0.2,0.1-0.3,0.1L6.1,5.7L5.5,5.5C4.7,5.1,3.9,4.8,3.1,4.7
	c-0.4,0-1.5,0.9-1.9,1.4c-0.4,0.5-0.7,1-0.9,1.6c0,0.2,0,0.5,0.1,0.7C0.6,7.9,0.9,7.4,1.2,7c0.4-0.5,1.5-1.4,1.9-1.4
	c0.8,0.2,1.6,0.4,2.3,0.8l0.6,0.3l1.6,0.7c0.1,0,0.2,0,0.3-0.1c0.5-0.8,1.1-1.5,1.7-2.1h19c0.3,0,0.5,0.2,0.5,0.5c0,0,0,0,0,0v-1
	C29.2,4.5,29,4.3,28.7,4.3z"/>
<path class="st0" d="M5,26.4l-1.5-3.3v-0.1l-2.9-3c-0.1-0.1-0.2-0.2-0.2-0.4v1c0,0.1,0.1,0.3,0.2,0.4l2.9,3v0.1L5,27.4
	c0.1,0.2,0.3,0.3,0.5,0.3h23.8v-1H5.5C5.3,26.7,5.1,26.6,5,26.4z"/>
<linearGradient id="SVGID_4_" gradientUnits="userSpaceOnUse" x1="15.75" y1="-82.26" x2="15.75" y2="-82.26" gradientTransform="matrix(1 0 0 1 0 95.97)">
	<stop  offset="0" style="stop-color:#CC6D00;stop-opacity:0.8"/>
	<stop  offset="1" style="stop-color:#7A3B00"/>
</linearGradient>
<path class="st7" d="M15.8,13.7"/>
<linearGradient id="SVGID_5_" gradientUnits="userSpaceOnUse" x1="15.65" y1="-82.26" x2="15.65" y2="-82.26" gradientTransform="matrix(1 0 0 1 0 95.97)">
	<stop  offset="0" style="stop-color:#CC6D00;stop-opacity:0.8"/>
	<stop  offset="1" style="stop-color:#7A3B00"/>
</linearGradient>
<path class="st8" d="M15.6,13.7"/>
<linearGradient id="SVGID_6_" gradientUnits="userSpaceOnUse" x1="17.68" y1="-78.97" x2="17.68" y2="-78.97" gradientTransform="matrix(1 0 0 1 0 95.97)">
	<stop  offset="0" style="stop-color:#CC6D00;stop-opacity:0.8"/>
	<stop  offset="1" style="stop-color:#7A3B00"/>
</linearGradient>
<path class="st9" d="M17.7,17"/>
<rect x="8.5" y="9.9" class="st10" width="15.5" height="1.7"/>
<rect x="8.5" y="22.5" class="st10" width="15.5" height="1.7"/>
<rect x="8.5" y="12.3" class="st10" width="9.5" height="9.5"/>
<rect x="18.9" y="12.3" class="st10" width="5.2" height="9.5"/>
</svg>
