<?xml version="1.0" encoding="utf-8"?>
<!-- Generator: Adobe Illustrator 21.0.0, SVG Export Plug-In . SVG Version: 6.00 Build 0)  -->
<svg version="1.1" id="katman_1" xmlns="http://www.w3.org/2000/svg" xmlns:xlink="http://www.w3.org/1999/xlink" x="0px" y="0px"
	 viewBox="0 0 31.9 32" style="enable-background:new 0 0 31.9 32;" xml:space="preserve">
<style type="text/css">
	.st0{opacity:0.7;fill:#2C5879;enable-background:new    ;}
	.st1{fill:url(#SVGID_1_);}
	.st2{fill:#F1F2F2;}
	.st3{opacity:0.1;fill:#FFFFFF;enable-background:new    ;}
	.st4{opacity:0.1;fill:#020202;enable-background:new    ;}
	.st5{fill:url(#SVGID_2_);}
	.st6{fill:url(#SVGID_3_);}
</style>
<title>web-browser_2</title>
<path class="st0" d="M15.1,30.2C6.8,30.2,0,23.4,0,15.1S6.8,0,15.1,0c8.3,0,15.1,6.8,15.1,15.1C30.2,23.4,23.4,30.2,15.1,30.2z
	 M21.3,23c-1,2.2-2.4,4.1-4.1,5.8c3-0.5,5.7-1.9,7.8-4C23.8,24.1,22.6,23.5,21.3,23z M5.3,24.9c2.1,2.1,4.8,3.5,7.8,4
	c-1.7-1.7-3.1-3.7-4.1-5.9C7.6,23.5,6.4,24.1,5.3,24.9L5.3,24.9z M15.7,28.5c1.8-1.7,3.3-3.7,4.4-5.9c-1.4-0.4-2.9-0.6-4.4-0.7V28.5
	z M10.1,22.6c1,2.3,2.5,4.3,4.4,5.9v-6.6C13,22,11.5,22.2,10.1,22.6L10.1,22.6z M21.8,21.9c1.4,0.5,2.8,1.2,4.1,2.1
	c1.9-2.3,3-5.2,3.2-8.2h-6C22.9,17.8,22.5,19.9,21.8,21.9L21.8,21.9z M1.2,15.7c0.1,3,1.3,5.9,3.2,8.2c1.3-0.8,2.6-1.5,4.1-2.1
	c-0.7-2-1.2-4.1-1.2-6.2L1.2,15.7z M8.5,15.7c0.1,2,0.5,3.9,1.1,5.8c1.6-0.5,3.2-0.7,4.9-0.8v-5L8.5,15.7z M15.7,20.7
	c1.6,0.1,3.3,0.3,4.9,0.8c0.7-1.9,1.1-3.8,1.1-5.8h-6L15.7,20.7z M29,14.5c-0.1-3.2-1.4-6.2-3.5-8.6c-1.3,0.8-2.6,1.5-4,1.9
	c0.9,2.1,1.3,4.3,1.4,6.6L29,14.5z M21.8,14.5c-0.1-2.1-0.5-4.3-1.3-6.2c-1.5,0.4-3.1,0.7-4.7,0.8v5.5L21.8,14.5z M14.5,14.5V9
	c-1.6,0-3.2-0.3-4.7-0.7c-0.8,2-1.3,4.1-1.3,6.2L14.5,14.5z M7.3,14.5c0.1-2.3,0.5-4.5,1.4-6.6c-1.4-0.5-2.7-1.1-4-1.9
	c-2.1,2.4-3.3,5.4-3.5,8.6L7.3,14.5z M10.4,7.1c1.4,0.4,2.8,0.6,4.2,0.6V1.7C12.8,3.2,11.4,5,10.4,7.1L10.4,7.1z M15.7,7.8
	c1.4,0,2.8-0.3,4.2-0.6c-1-2.1-2.4-3.9-4.2-5.5V7.8z M5.6,5c1.1,0.7,2.3,1.3,3.6,1.8c1-2,2.3-3.8,3.9-5.4C10.2,1.8,7.6,3.1,5.6,5z
	 M17.2,1.4c1.6,1.6,2.9,3.4,3.9,5.4c1.3-0.4,2.5-1,3.6-1.8C22.6,3.1,20,1.8,17.2,1.4z"/>
<linearGradient id="SVGID_1_" gradientUnits="userSpaceOnUse" x1="15.1" y1="2.33" x2="15.1" y2="30.85" gradientTransform="matrix(1 0 0 -1 0 31.73)">
	<stop  offset="0" style="stop-color:#2D5879"/>
	<stop  offset="1" style="stop-color:#2C6E95"/>
</linearGradient>
<path class="st1" d="M29.6,15.1c0,8-6.5,14.5-14.5,14.5S0.6,23.1,0.6,15.1S7.1,0.6,15.1,0.6C23.1,0.6,29.6,7.1,29.6,15.1L29.6,15.1z
	"/>
<path class="st2" d="M15.1,30C6.9,30,0.3,23.3,0.3,15.1S7,0.3,15.2,0.3C23.4,0.3,30,6.9,30,15.1C30,23.3,23.4,30,15.1,30
	C15.1,30,15.1,30,15.1,30z M4.8,24.8c2.3,2.5,5.5,4,8.9,4.4c-2-1.8-3.6-4-4.7-6.5C7.6,23.2,6.2,23.9,4.8,24.8z M21.1,22.7
	c-1.1,2.5-2.7,4.7-4.7,6.5c3.4-0.3,6.6-1.9,8.9-4.4C24,23.9,22.6,23.2,21.1,22.7z M15.5,29.1c2.2-1.8,3.9-4.1,5-6.6
	c-1.6-0.5-3.3-0.8-5-0.8L15.5,29.1z M9.8,22.5c1.1,2.6,2.8,4.8,5,6.6v-7.4C13.1,21.7,11.4,22,9.8,22.5z M21.4,22
	c1.6,0.6,3.1,1.3,4.4,2.3c2.1-2.5,3.3-5.6,3.4-8.8h-6.5C22.7,17.7,22.2,19.9,21.4,22z M1,15.5c0.1,3.2,1.3,6.4,3.4,8.8
	c1.4-0.9,2.8-1.7,4.4-2.3c-0.8-2.1-1.3-4.3-1.3-6.6L1,15.5z M15.5,21c1.8,0,3.6,0.3,5.3,0.8c0.8-2,1.2-4.2,1.3-6.4h-6.5V21z
	 M8.2,15.5c0,2.2,0.5,4.3,1.3,6.3c1.7-0.5,3.5-0.8,5.3-0.8v-5.5H8.2z M29.2,14.8c-0.1-3.4-1.4-6.7-3.7-9.2c-1.3,0.9-2.8,1.6-4.3,2.1
	c0.9,2.2,1.4,4.6,1.5,7L29.2,14.8z M22,14.8c0-2.3-0.5-4.6-1.5-6.8c-1.6,0.5-3.4,0.8-5.1,0.8v6L22,14.8z M14.7,14.8v-6
	C13,8.7,11.3,8.5,9.7,8c-0.9,2.2-1.4,4.5-1.4,6.8L14.7,14.8z M7.5,14.8c0-2.4,0.6-4.8,1.5-7.1C7.5,7.2,6,6.5,4.7,5.6
	C2.4,8.1,1.1,11.4,1,14.7L7.5,14.8z M10,7.3C11.5,7.7,13.1,8,14.7,8V1.1C12.7,2.8,11.1,4.9,10,7.3z M15.5,8c1.6,0,3.2-0.3,4.8-0.7
	c-1.1-2.4-2.8-4.5-4.8-6.2L15.5,8z M5.2,5.1c1.3,0.8,2.7,1.5,4.1,2c1.1-2.3,2.6-4.3,4.5-6C10.5,1.4,7.5,2.8,5.2,5.1z M16.5,1
	c1.9,1.7,3.4,3.7,4.5,6c1.5-0.5,2.8-1.2,4.1-2C22.7,2.7,19.7,1.3,16.5,1z"/>
<path class="st3" d="M15.1,1.3c8,0,14.6,6.3,14.8,14.3c0-0.2,0-0.3,0-0.5c0-8.2-6.6-14.9-14.9-14.9S0.2,6.9,0.2,15.1
	c0,0.2,0,0.3,0,0.5C0.5,7.6,7.1,1.3,15.1,1.3z"/>
<path class="st4" d="M15.1,30c-8,0-14.6-6.4-14.8-14.4c0,0.2,0,0.3,0,0.5C0.3,24.3,6.9,31,15.1,31S30,24.3,30,16.1
	c0-0.2,0-0.3,0-0.5C29.7,23.6,23.1,30,15.1,30z"/>
<path class="st4" d="M17.7,29.5h-3.5c-0.6,0-1-0.4-1-1v1c0,0.6,0.4,1,1,1h3.5c0.6,0,1-0.4,1-1v-1C18.7,29,18.3,29.5,17.7,29.5z"/>
<path class="st4" d="M30.4,17.8v-1c0,0.6-0.4,1-1,1h-7l1,1h6C29.9,18.8,30.4,18.4,30.4,17.8z"/>
<path class="st4" d="M31.6,28.3l-2.4,2.4c-0.4,0.3-1,0.3-1.4,0l-9.2-9.2v1l9.2,9.2c0.4,0.3,1,0.3,1.4,0l2.4-2.4
	c0.3-0.3,0.4-0.8,0.1-1.2C31.7,28.2,31.6,28.2,31.6,28.3z"/>
<linearGradient id="SVGID_2_" gradientUnits="userSpaceOnUse" x1="14.2153" y1="19.9012" x2="29.9153" y2="0.9712" gradientTransform="matrix(1 0 0 -1 0 31.73)">
	<stop  offset="0" style="stop-color:#2C6E95"/>
	<stop  offset="0.54" style="stop-color:#2D6083"/>
	<stop  offset="1" style="stop-color:#2D5879"/>
</linearGradient>
<path class="st5" d="M28.5,31c-0.3,0-0.5-0.1-0.7-0.3l-9.2-9.2v7c0,0.6-0.4,1-1,1h-3.4c-0.6,0-1-0.4-1-1V13.8c0-0.8,0.6-1.4,1.4-1.4
	h14.7c0.6,0,1,0.4,1,1v3.4c0,0.6-0.4,1-1,1h-7l9.2,9.2c0.3,0.4,0.3,1,0,1.4l-2.4,2.4C28.9,30.9,28.7,31,28.5,31z"/>
<linearGradient id="SVGID_3_" gradientUnits="userSpaceOnUse" x1="16.8441" y1="18.4027" x2="29.8841" y2="-1.4873" gradientTransform="matrix(1 0 0 -1 0 31.73)">
	<stop  offset="0" style="stop-color:#E8E6E5"/>
	<stop  offset="0.25" style="stop-color:#E4E2E1"/>
	<stop  offset="0.48" style="stop-color:#D9D7D6"/>
	<stop  offset="0.72" style="stop-color:#C5C4C4"/>
	<stop  offset="0.95" style="stop-color:#AAAAAA"/>
	<stop  offset="1" style="stop-color:#A3A3A3"/>
</linearGradient>
<path class="st6" d="M18.2,28.5v-8.2l10,10c0.2,0.2,0.5,0.2,0.6,0l2.4-2.4c0.2-0.2,0.2-0.5,0-0.6l-10-10h8.2c0.3,0,0.5-0.2,0.5-0.5
	v-3.4c0-0.3-0.2-0.5-0.5-0.5H14.7c-0.5,0-0.9,0.4-0.9,0.9l0,0v14.7c0,0.3,0.2,0.5,0.5,0.5h3.5C18,29,18.2,28.8,18.2,28.5
	C18.2,28.5,18.2,28.5,18.2,28.5z"/>
<path class="st3" d="M14.7,13.9h14.7c0.3,0,0.5,0.2,0.5,0.5v-1c0-0.3-0.2-0.5-0.5-0.5H14.7c-0.5,0-0.9,0.4-0.9,0.9l0,0v1
	C13.8,14.3,14.2,13.9,14.7,13.9L14.7,13.9z"/>
</svg>
