<?xml version="1.0" encoding="utf-8"?>
<!-- Generator: Adobe Illustrator 21.0.0, SVG Export Plug-In . SVG Version: 6.00 Build 0)  -->
<svg version="1.1" id="katman_1" xmlns="http://www.w3.org/2000/svg" xmlns:xlink="http://www.w3.org/1999/xlink" x="0px" y="0px"
	 viewBox="0 0 31.2 32" style="enable-background:new 0 0 31.2 32;" xml:space="preserve">
<style type="text/css">
	.st0{opacity:0.7;fill:#1A1A1A;enable-background:new    ;}
	.st1{fill:url(#SVGID_1_);}
	.st2{opacity:0.1;fill:#FFFFFF;enable-background:new    ;}
	.st3{fill:url(#SVGID_2_);}
	.st4{fill:url(#SVGID_3_);}
	.st5{opacity:0.2;enable-background:new    ;}
	.st6{opacity:0.7;fill:#603813;enable-background:new    ;}
	.st7{fill:url(#SVGID_4_);}
</style>
<title>ac-adapter_2</title>
<path class="st0" d="M14.8,31.2c-0.7,0-1.3-0.6-1.3-1.4c0,0,0,0,0,0v-1.5c-1-0.2-2-0.5-3-0.9l-0.8,1.3c-0.2,0.4-0.7,0.6-1.1,0.6H8.5
	c-0.2,0-0.4-0.1-0.6-0.2l-0.8-0.5c-0.6-0.4-0.8-1.2-0.4-1.8c0,0,0,0,0,0l0.8-1.3c-0.8-0.7-1.5-1.4-2.2-2.3L4,24
	c-0.6,0.4-1.5,0.1-1.8-0.5c0,0,0,0,0,0l-0.5-0.8c-0.3-0.6-0.1-1.5,0.5-1.8l1.3-0.7c-0.4-1-0.6-2-0.7-3H1.3c-0.7,0-1.3-0.6-1.4-1.3
	c0,0,0,0,0-0.1v-0.9c0-0.7,0.6-1.3,1.3-1.3h1.5c0.2-1,0.5-2,0.9-3L2.5,9.7C1.9,9.4,1.6,8.5,2,7.9c0,0,0,0,0,0l0.5-0.8
	c0.2-0.4,0.7-0.6,1.1-0.6h0.1c0.2,0,0.4,0.1,0.6,0.2l1.3,0.8C6.3,6.6,7,5.9,7.9,5.3L7.2,4C6.8,3.4,7.1,2.5,7.7,2.2c0,0,0,0,0,0
	l0.8-0.5c0.6-0.4,1.5-0.1,1.8,0.5c0,0,0,0,0,0l0.7,1.3c1-0.4,2-0.6,3-0.7V1.3c0-0.7,0.6-1.3,1.3-1.3c0,0,0,0,0.1,0h1
	c0.7,0,1.3,0.6,1.3,1.4v1.5c1,0.2,2,0.5,3,0.9l0.8-1.3c0.2-0.4,0.7-0.6,1.1-0.6h0.1c0.2,0,0.4,0.1,0.6,0.2l0.8,0.5
	c0.6,0.4,0.8,1.2,0.4,1.8c0,0,0,0,0,0l-0.8,1.3C24.7,6.3,25.4,7,26,7.9l1.3-0.7c0.6-0.4,1.5-0.1,1.8,0.5c0,0,0,0,0,0l0.5,0.8
	c0.3,0.6,0.1,1.5-0.5,1.8c0,0,0,0,0,0l-1.3,0.7c0.4,1,0.6,2,0.7,3h1.5c0.7,0,1.3,0.6,1.3,1.4v0.9c0,0.7-0.6,1.3-1.3,1.3h-1.5
	c-0.2,1-0.5,2-0.9,3l1.3,0.8c0.6,0.4,0.8,1.2,0.4,1.8c0,0,0,0,0,0l-0.5,0.8c-0.2,0.4-0.7,0.6-1.1,0.6h-0.1c-0.2,0-0.4-0.1-0.6-0.2
	l-1.3-0.8c-0.7,0.8-1.4,1.6-2.3,2.2l0.7,1.3c0.3,0.6,0.1,1.5-0.5,1.8l-0.8,0.5c-0.6,0.3-1.5,0.1-1.8-0.5c0,0,0,0,0,0l-0.7-1.3
	c-1,0.4-2,0.6-3,0.7v1.5c0,0.7-0.6,1.3-1.3,1.3L14.8,31.2z M15.6,5.7c-5.5,0-9.9,4.4-9.9,9.9s4.4,9.9,9.9,9.9s9.9-4.4,9.9-9.9l0,0
	C25.5,10.1,21.1,5.7,15.6,5.7L15.6,5.7z"/>
<linearGradient id="SVGID_1_" gradientUnits="userSpaceOnUse" x1="15.6049" y1="0.74" x2="15.6049" y2="31.4502" gradientTransform="matrix(1 0 0 -1 0 31.73)">
	<stop  offset="0" style="stop-color:#1A1A1A"/>
	<stop  offset="9.000000e-02" style="stop-color:#292929"/>
	<stop  offset="0.26" style="stop-color:#3E3E3E"/>
	<stop  offset="0.45" style="stop-color:#4D4D4D"/>
	<stop  offset="0.67" style="stop-color:#565656"/>
	<stop  offset="1" style="stop-color:#595959"/>
</linearGradient>
<path class="st1" d="M30.7,14.7c-0.2-0.2-0.5-0.3-0.8-0.3h-1.7c-0.1-1.2-0.4-2.3-0.8-3.4l1.5-0.8c0.5-0.3,0.7-0.9,0.4-1.5l-0.5-0.8
	c-0.3-0.5-0.9-0.7-1.5-0.4l-1.5,0.8c-0.7-1-1.5-1.8-2.4-2.5l0.9-1.4c0.3-0.5,0.2-1.2-0.3-1.5c0,0-0.1,0-0.1-0.1l-0.8-0.5
	C22.7,2,22,2.1,21.7,2.6l-0.9,1.4c-1.1-0.5-2.2-0.8-3.4-1V1.4c0-0.6-0.4-1-1-1.1h-0.9c-0.6,0-1.1,0.5-1.1,1V3
	c-1.2,0.1-2.3,0.4-3.4,0.8l-0.8-1.5C9.9,1.8,9.3,1.6,8.7,1.9L7.9,2.4C7.4,2.7,7.2,3.3,7.5,3.8l0.8,1.5C7.3,6,6.4,6.8,5.7,7.7
	L4.2,6.9C3.7,6.5,3.1,6.7,2.8,7.2L2.3,8C2,8.5,2.1,9.2,2.6,9.5c0,0,0,0,0,0l1.4,0.9c-0.5,1.1-0.8,2.2-1,3.4H1.4l0,0
	c-0.6,0-1.1,0.4-1.1,1v0.9c0,0.6,0.5,1.1,1,1.1H3c0.1,1.2,0.4,2.3,0.8,3.4l-1.5,0.8c-0.5,0.3-0.7,0.9-0.4,1.5l0.5,0.8
	c0.3,0.5,0.9,0.7,1.5,0.4L5.3,23c0.7,1,1.5,1.8,2.4,2.5L6.8,27c-0.3,0.5-0.1,1.2,0.4,1.5L8,29c0.5,0.3,1.2,0.1,1.5-0.4l0.9-1.5
	c1.1,0.5,2.2,0.8,3.4,1v1.7c0,0.6,0.5,1.1,1.1,1.1h0.9l0,0c0.6,0,1.1-0.5,1.1-1v-1.7c1.2-0.1,2.3-0.4,3.4-0.8l0.8,1.5
	c0.3,0.5,0.9,0.7,1.5,0.4l0.8-0.5c0.5-0.3,0.7-0.9,0.4-1.5L23,25.9c1-0.7,1.8-1.5,2.5-2.4l1.5,0.9c0.5,0.3,1.2,0.1,1.5-0.4
	c0,0,0,0,0,0l0.5-0.8c0.3-0.5,0.1-1.2-0.4-1.5l-1.5-0.9c0.5-1.1,0.8-2.2,1-3.4h1.7l0,0c0.6,0,1.1-0.5,1.1-1v-0.9
	C30.9,15.2,30.8,14.9,30.7,14.7z M15.6,25.7c-5.6,0-10.2-4.6-10.1-10.2S10,5.4,15.6,5.4S25.8,10,25.8,15.6c0,0,0,0,0,0
	C25.8,21.2,21.2,25.8,15.6,25.7C15.6,25.8,15.6,25.8,15.6,25.7L15.6,25.7z"/>
<path class="st2" d="M2.8,8.2c0.3-0.5,1-0.7,1.5-0.4l1.4,0.9C6.4,7.8,7.3,7,8.2,6.4L7.8,5.6C7,6.2,6.3,7,5.7,7.7L4.2,6.9
	C3.7,6.5,3.1,6.7,2.8,7.2L2.3,8c-0.2,0.3-0.2,0.7,0,1.1l0,0L2.8,8.2z"/>
<path class="st2" d="M1.4,14.8L1.4,14.8h1.7c0.2-1.2,0.5-2.3,1-3.4l-0.3-0.2c-0.3,0.8-0.5,1.7-0.6,2.6H1.4l0,0
	c-0.6,0-1.1,0.5-1.1,1.1v0.9c0,0.1,0,0.1,0,0.2v-0.1C0.3,15.2,0.8,14.8,1.4,14.8z"/>
<path class="st2" d="M2.3,22.1l1.5-0.8c-0.1-0.3-0.2-0.6-0.3-0.9l-1.2,0.6c-0.5,0.3-0.7,0.9-0.4,1.5C2,22.4,2.2,22.2,2.3,22.1z"/>
<path class="st2" d="M7.7,26.6l-0.4-0.4L6.8,27c-0.2,0.3-0.2,0.7,0,1.1l0,0L7.7,26.6z"/>
<path class="st2" d="M7.8,3.4l0.8-0.5c0.5-0.3,1.2-0.1,1.5,0.4L11,4.9c1.1-0.4,2.2-0.7,3.4-0.9V2.3c0-0.6,0.5-1.1,1.1-1h0.9
	c0.5,0,0.9,0.4,1,0.9V1.3c0-0.5-0.4-1-1-1.1h-0.9c-0.6,0-1.1,0.5-1.1,1V3c-1.2,0.1-2.3,0.4-3.4,0.8l-0.8-1.5
	C9.9,1.8,9.3,1.6,8.7,1.9L7.9,2.4C7.4,2.7,7.2,3.3,7.5,3.8C7.6,3.7,7.7,3.5,7.8,3.4z"/>
<linearGradient id="SVGID_2_" gradientUnits="userSpaceOnUse" x1="13.7472" y1="1.66" x2="13.7472" y2="2.56" gradientTransform="matrix(1 0 0 -1 0 31.73)">
	<stop  offset="0" style="stop-color:#1A1A1A"/>
	<stop  offset="9.000000e-02" style="stop-color:#292929"/>
	<stop  offset="0.26" style="stop-color:#3E3E3E"/>
	<stop  offset="0.45" style="stop-color:#4D4D4D"/>
	<stop  offset="0.67" style="stop-color:#565656"/>
	<stop  offset="1" style="stop-color:#595959"/>
</linearGradient>
<path class="st3" d="M13.8,29.2v0.7c0,0.1,0,0.1,0,0.2V29.2z"/>
<path class="st2" d="M25.9,9.3l1.5-0.8c0.5-0.3,1.2-0.1,1.5,0.4l0.5,0.8l0,0c0-0.1,0.1-0.1,0.1-0.2c0.1-0.3,0-0.6-0.1-0.8l-0.5-0.8
	c-0.3-0.5-0.9-0.7-1.5-0.4l-1.5,0.8c-0.6-0.8-1.2-1.6-2-2.2l-0.4,0.7C24.4,7.4,25.2,8.3,25.9,9.3z"/>
<path class="st2" d="M20.8,5.1l0.9-1.5c0.3-0.5,1-0.7,1.5-0.4L24,3.8c0.2,0.1,0.3,0.2,0.4,0.4c0.3-0.5,0.1-1.1-0.4-1.4l-0.8-0.5
	C22.7,2,22,2.1,21.7,2.6l-0.9,1.4c-1.1-0.5-2.2-0.8-3.4-1v1C18.6,4.3,19.8,4.6,20.8,5.1z"/>
<path class="st2" d="M28.2,15.4h1.7c0.5,0,0.9,0.4,1,0.9v-0.8c0-0.6-0.5-1.1-1-1.1h-1.7c-0.1-0.9-0.3-1.7-0.5-2.5L27.4,12
	C27.8,13.1,28.1,14.2,28.2,15.4z"/>
<path class="st2" d="M23.8,28.4c0.2-0.3,0.2-0.7,0-1l-0.4-0.8L23,27L23.8,28.4z"/>
<path class="st2" d="M15.6,25.8c-5.4,0-9.9-4.2-10.1-9.7c0,0.2,0,0.3,0,0.5c0,5.6,4.6,10.2,10.2,10.2s10.2-4.6,10.2-10.2
	c0-0.2,0-0.3,0-0.5C25.5,21.6,21,25.8,15.6,25.8z"/>
<path class="st2" d="M28.6,22.8c0.2,0.1,0.3,0.2,0.4,0.4c0.3-0.5,0.1-1.1-0.4-1.4L27.5,21c-0.1,0.3-0.2,0.6-0.3,0.8L28.6,22.8z"/>
<linearGradient id="SVGID_3_" gradientUnits="userSpaceOnUse" x1="17.4828" y1="28.64" x2="17.4828" y2="29.54" gradientTransform="matrix(1 0 0 -1 0 31.73)">
	<stop  offset="0" style="stop-color:#1A1A1A"/>
	<stop  offset="9.000000e-02" style="stop-color:#292929"/>
	<stop  offset="0.26" style="stop-color:#3E3E3E"/>
	<stop  offset="0.45" style="stop-color:#4D4D4D"/>
	<stop  offset="0.67" style="stop-color:#565656"/>
	<stop  offset="1" style="stop-color:#595959"/>
</linearGradient>
<path class="st4" d="M17.5,3.1V2.4c0-0.1,0-0.1,0-0.2C17.5,2.2,17.5,3.1,17.5,3.1z"/>
<path class="st5" d="M15.6,5.5C10,5.5,5.4,10,5.4,15.6l0,0c0,0.2,0,0.3,0,0.5c0.3-5.6,5.1-9.9,10.7-9.6c5.2,0.3,9.3,4.4,9.6,9.6
	c0-0.2,0-0.3,0-0.5C25.7,10,21.2,5.5,15.6,5.5z"/>
<path class="st2" d="M23.5,5.7L23.9,6l0.5-0.8c0.2-0.3,0.2-0.7,0-1.1l0,0L23.5,5.7z"/>
<path class="st5" d="M28.9,10.1L27.4,11c0.1,0.3,0.2,0.6,0.3,0.9l1.2-0.6c0.5-0.3,0.7-0.9,0.4-1.5C29.2,9.9,29.1,10.1,28.9,10.1z"/>
<path class="st5" d="M10.4,27.2l-0.9,1.5c-0.3,0.5-1,0.7-1.5,0.4c0,0,0,0,0,0l-0.8-0.5c-0.2-0.1-0.3-0.2-0.4-0.4
	c-0.3,0.5-0.1,1.1,0.4,1.4L8,30c0.5,0.3,1.2,0.1,1.5-0.4l0.9-1.5c1.1,0.5,2.2,0.8,3.4,1v-1C12.6,28,11.4,27.7,10.4,27.2z"/>
<path class="st2" d="M7.4,3.8L7.4,3.8c0,0.1-0.1,0.1-0.1,0.2c-0.1,0.3,0,0.6,0.1,0.8l0.4,0.8l0.4-0.3L7.4,3.8z"/>
<path class="st5" d="M5.3,23l-1.5,0.8c-0.5,0.3-1.2,0.1-1.5-0.4l-0.5-0.8l0,0c-0.2,0.3-0.2,0.7,0,1l0.5,0.8c0.3,0.5,0.9,0.7,1.5,0.4
	L5.3,24c0.6,0.8,1.3,1.5,2,2.2l0.4-0.7C6.8,24.8,6,23.9,5.3,23z"/>
<path class="st5" d="M23.4,28.9l-0.8,0.5c-0.5,0.3-1.2,0.1-1.5-0.4l-0.8-1.5c-1.1,0.4-2.2,0.7-3.4,0.8v1.7c0,0.6-0.5,1.1-1.1,1.1
	c0,0,0,0,0,0l0,0h-0.9c-0.5,0-0.9-0.4-1-0.9v0.8c0,0.6,0.4,1,1,1.1h0.9l0,0c0.6,0,1.1-0.5,1.1-1v-1.7c1.2-0.1,2.3-0.4,3.4-0.8
	l0.8,1.5c0.3,0.5,0.9,0.7,1.5,0.4l0.8-0.5c0.5-0.3,0.7-0.9,0.4-1.5l0,0C23.7,28.6,23.5,28.8,23.4,28.9z"/>
<path class="st5" d="M3,16.9H1.3c-0.5,0-0.9-0.4-1-0.9v0.8c0,0.6,0.5,1.1,1,1.1H3c0.1,0.9,0.3,1.7,0.5,2.5l0.3-0.2
	C3.4,19.2,3.1,18,3,16.9z"/>
<path class="st5" d="M28.5,24c-0.3,0.5-1,0.7-1.5,0.4l-1.5-0.9c-0.7,0.9-1.6,1.7-2.5,2.4l0.4,0.7c0.8-0.6,1.5-1.3,2.1-2.1l1.5,0.9
	c0.5,0.3,1.2,0.1,1.5-0.4c0,0,0,0,0,0l0.5-0.8c0.2-0.3,0.2-0.7,0-1.1l0,0L28.5,24z"/>
<path class="st5" d="M31,16.5c0,0.6-0.5,1.1-1.1,1l0,0h-1.7c-0.2,1.2-0.5,2.3-1,3.4l0.3,0.2c0.3-0.8,0.5-1.7,0.6-2.6h1.7l0,0
	c0.6,0,1.1-0.5,1.1-1L31,16.5c0,0,0-0.1,0-0.1L31,16.5z"/>
<path class="st5" d="M2.6,9.5C2.5,9.4,2.3,9.3,2.2,9.1C2,9.6,2.1,10.2,2.6,10.5l1.1,0.7c0.1-0.3,0.2-0.6,0.3-0.8L2.6,9.5z"/>
<path class="st5" d="M14.4,19.5l-1.2,9.8c0,0.2,0,0.3,0.1,0.5l1.2-10.3L14.4,19.5z"/>
<path class="st2" d="M16.7,12.6l1.1-9.8c0-0.2,0-0.3-0.1-0.5l-1.2,10.3H16.7z"/>
<path class="st6" d="M14.2,30.7c-0.4,0-0.7-0.1-1-0.4c-0.2-0.3-0.4-0.6-0.3-1l1.2-10.5H8.9c-0.7,0-1.3-0.6-1.3-1.3
	c0-0.2,0-0.4,0.1-0.6l8-15.8c0.2-0.4,0.6-0.7,1.1-0.7c0.4,0,0.7,0.1,1,0.4c0.2,0.3,0.3,0.6,0.3,1l-1.3,10.5h5.3
	c0.7,0,1.3,0.6,1.3,1.3c0,0.2,0,0.4-0.1,0.6l-8,15.8C15.1,30.4,14.7,30.7,14.2,30.7L14.2,30.7z"/>
<linearGradient id="SVGID_4_" gradientUnits="userSpaceOnUse" x1="14.1183" y1="31.9098" x2="18.0183" y2="-11.2202" gradientTransform="matrix(1 0 0 -1 0 31.73)">
	<stop  offset="0" style="stop-color:#FDC328"/>
	<stop  offset="0.23" style="stop-color:#E9B527"/>
	<stop  offset="0.29" style="stop-color:#E6B226"/>
	<stop  offset="0.34" style="stop-color:#DBAA25"/>
	<stop  offset="0.38" style="stop-color:#C99D22"/>
	<stop  offset="0.41" style="stop-color:#BB9220"/>
	<stop  offset="0.45" style="stop-color:#BE9520"/>
	<stop  offset="0.49" style="stop-color:#C99C22"/>
	<stop  offset="0.53" style="stop-color:#DBAA24"/>
	<stop  offset="0.56" style="stop-color:#F4BC27"/>
	<stop  offset="0.57" style="stop-color:#FDC328"/>
	<stop  offset="0.75" style="stop-color:#E9B527"/>
	<stop  offset="0.8" style="stop-color:#E6B226"/>
	<stop  offset="0.85" style="stop-color:#DBAA25"/>
	<stop  offset="0.89" style="stop-color:#C99D22"/>
	<stop  offset="0.93" style="stop-color:#B08A1E"/>
	<stop  offset="0.96" style="stop-color:#98781A"/>
</linearGradient>
<path class="st7" d="M22.2,12.6h-5.6l1.3-10.8C18,1.3,17.6,0.7,17,0.7c-0.4-0.1-0.8,0.2-1,0.6L8,17.1c-0.3,0.5-0.1,1.1,0.4,1.3
	c0.1,0.1,0.3,0.1,0.5,0.1h5.6l-1.3,10.8c-0.1,0.5,0.3,1.1,0.9,1.1c0.4,0.1,0.8-0.2,1-0.6l8-15.8c0.2-0.5,0.1-1.1-0.4-1.3
	C22.5,12.7,22.4,12.6,22.2,12.6z"/>
<path class="st2" d="M17.8,2.3l0.1-0.5C18,1.3,17.6,0.7,17,0.7c-0.4-0.1-0.8,0.2-1,0.6L8,17.1c-0.2,0.3-0.2,0.7,0,1l8-15.8
	c0.2-0.5,0.8-0.7,1.3-0.5C17.6,1.9,17.7,2.1,17.8,2.3z"/>
<path class="st2" d="M22.2,13.6c0.4,0,0.7,0.2,0.9,0.5v-0.1c0.3-0.5,0.1-1.1-0.4-1.3c-0.1-0.1-0.3-0.1-0.5-0.1h-5.4l-0.1,1
	L22.2,13.6z"/>
<path class="st5" d="M8.9,18.5c-0.4,0-0.7-0.2-0.9-0.5v0.1c-0.3,0.5-0.1,1.1,0.4,1.3c0.1,0.1,0.3,0.1,0.5,0.1h5.5l0.1-1L8.9,18.5z"
	/>
<path class="st5" d="M15.1,29.9c-0.2,0.5-0.8,0.7-1.3,0.5c-0.2-0.1-0.4-0.3-0.5-0.5l-0.1,0.5c-0.1,0.5,0.3,1.1,0.9,1.1
	c0.4,0.1,0.8-0.2,1-0.6l8-15.8c0.2-0.3,0.2-0.7,0-1L15.1,29.9z"/>
</svg>
