<?xml version="1.0" encoding="utf-8"?>
<!-- Generator: Adobe Illustrator 21.0.0, SVG Export Plug-In . SVG Version: 6.00 Build 0)  -->
<svg version="1.1" id="katman_1" xmlns="http://www.w3.org/2000/svg" xmlns:xlink="http://www.w3.org/1999/xlink" x="0px" y="0px"
	 viewBox="0 0 48 46.2" style="enable-background:new 0 0 48 46.2;" xml:space="preserve">
<style type="text/css">
	.st0{opacity:0.2;enable-background:new    ;}
	.st1{fill:#793D1A;}
	.st2{fill:url(#SVGID_1_);}
	.st3{fill:url(#SVGID_2_);}
	.st4{fill:url(#SVGID_3_);}
	.st5{opacity:0.1;enable-background:new    ;}
	.st6{opacity:0.1;fill:#FFFFFF;enable-background:new    ;}
	.st7{fill:url(#SVGID_4_);}
	.st8{fill:url(#SVGID_5_);}
</style>
<title>user-bookmarks_3</title>
<polygon class="st0" points="43.9,41.5 48,35.2 47,35.2 43.9,40 "/>
<path class="st1" d="M47.6,4.4c0-0.6-0.5-1.2-1.2-1.2H28.9V1.2c0-0.6-0.5-1.2-1.2-1.2c0,0,0,0,0,0H14.9c-0.6,0-1.2,0.5-1.2,1.2v2.1
	h-3.1c-0.6,0-1.2,0.5-1.2,1.2c0,0,0,0,0,0v4L8.3,7.9c-1.2-0.6-2.4-1-3.7-1.2C3.7,6.7,2,8.2,1.5,8.8C0.9,9.6,0.4,10.4,0,11.3
	c-0.3,0.9,1.1,3.5,1.7,4.4L2.6,17l-2.2,3.6c-0.1,0.2-0.2,0.4-0.2,0.6v8.4c0,0.3,0.1,0.6,0.3,0.8l4.3,4.5l2.3,4.9
	c0.2,0.4,0.6,0.6,1,0.7l35.4-0.1H44l3.4-5.2l0.2-0.3L47.6,4.4z"/>
<linearGradient id="SVGID_1_" gradientUnits="userSpaceOnUse" x1="28.56" y1="12.36" x2="28.56" y2="49.19" gradientTransform="matrix(1 0 0 -1 0 47.29)">
	<stop  offset="0" style="stop-color:#793D1A;stop-opacity:0.8"/>
	<stop  offset="1" style="stop-color:#C96E28"/>
</linearGradient>
<path class="st2" d="M28.6,3.4V1.2c0-0.4-0.4-0.8-0.8-0.8l0,0H14.9c-0.4,0-0.8,0.4-0.8,0.8v2.3c0,0.1-0.1,0.2-0.2,0.2h-3.3
	c-0.4,0-0.8,0.4-0.8,0.8l0,0v30.4h37.4V4.4c0-0.4-0.4-0.8-0.8-0.8l0,0H28.8C28.6,3.6,28.6,3.6,28.6,3.4C28.6,3.4,28.6,3.4,28.6,3.4z
	"/>
<linearGradient id="SVGID_2_" gradientUnits="userSpaceOnUse" x1="49.2788" y1="6.4487" x2="43.6988" y2="11.5787" gradientTransform="matrix(1 0 0 -1 0 47.29)">
	<stop  offset="0" style="stop-color:#C96E28"/>
	<stop  offset="1" style="stop-color:#793D1A;stop-opacity:0.8"/>
</linearGradient>
<polygon class="st3" points="43.9,40 47.3,34.9 42,34.9 "/>
<linearGradient id="SVGID_3_" gradientUnits="userSpaceOnUse" x1="22.1379" y1="7.57" x2="22.1379" y2="40.33" gradientTransform="matrix(1 0 0 -1 0 47.29)">
	<stop  offset="0" style="stop-color:#A3A4A4"/>
	<stop  offset="0.12" style="stop-color:#BABABA"/>
	<stop  offset="0.27" style="stop-color:#CECECE"/>
	<stop  offset="0.44" style="stop-color:#DCDBDB"/>
	<stop  offset="0.64" style="stop-color:#E4E4E4"/>
	<stop  offset="0.99" style="stop-color:#E7E6E6"/>
</linearGradient>
<path class="st4" d="M43.1,6.4H14.6c-0.9,1-1.8,2.1-2.6,3.2c-0.2,0.1-0.3,0.1-0.5,0.1L9.1,8.6L8.1,8.2C7,7.6,5.9,7.2,4.6,7
	C4,7,2.3,8.4,1.8,9.1c-0.6,0.7-1,1.5-1.4,2.3c-0.2,0.6,0.9,2.9,1.7,4.1L3,17l-2.3,3.8c-0.1,0.1-0.1,0.3-0.1,0.4v8.4
	c0,0.2,0.1,0.4,0.2,0.5l4.3,4.5c0,0,0.1,0.1,0.1,0.1l2.3,4.9c0.1,0.3,0.4,0.5,0.7,0.5L43.9,40V7.2C43.9,6.7,43.6,6.4,43.1,6.4
	C43.1,6.4,43.1,6.4,43.1,6.4z"/>
<path class="st5" d="M44.3,5.1H15.8c-0.4,0.4-0.8,0.8-1.2,1.2h28.5c0.4,0,0.8,0.4,0.8,0.8c0,0,0,0,0,0V40l1.2-1.9V5.9
	C45.1,5.5,44.8,5.1,44.3,5.1C44.4,5.1,44.4,5.1,44.3,5.1z"/>
<path class="st6" d="M14.9,1.8h12.8c0.4,0,0.8,0.4,0.8,0.8c0,0,0,0,0,0V1.2c0-0.4-0.4-0.8-0.8-0.8l0,0H14.9c-0.4,0-0.8,0.4-0.8,0.8
	v1.5C14.2,2.2,14.5,1.8,14.9,1.8C14.9,1.8,14.9,1.8,14.9,1.8z"/>
<path class="st6" d="M10.6,5.1H14c0.1,0,0.2-0.1,0.2-0.2V3.4c0,0.1-0.1,0.2-0.2,0.2h-3.4c-0.4,0-0.8,0.4-0.8,0.8l0,0v1.5
	C9.9,5.5,10.2,5.1,10.6,5.1z"/>
<path class="st6" d="M46.5,3.6H28.8c-0.1,0-0.2-0.1-0.2-0.2c0,0,0,0,0,0v1.5c0,0.1,0.1,0.2,0.2,0.2l0,0h17.7c0.4,0,0.8,0.4,0.8,0.8
	c0,0,0,0,0,0V4.4C47.3,4,46.9,3.6,46.5,3.6L46.5,3.6z"/>
<path class="st6" d="M43.1,6.4H14.6c-0.9,1-1.8,2.1-2.6,3.2c-0.2,0.1-0.3,0.1-0.5,0.1L9.1,8.6L8.1,8.2C7,7.6,5.9,7.2,4.6,7
	C4,7,2.3,8.4,1.8,9.1c-0.6,0.7-1,1.5-1.4,2.3c0,0.4,0,0.7,0.2,1.1c0.3-0.7,0.7-1.3,1.2-1.9c0.6-0.7,2.2-2.1,2.9-2
	C5.9,8.8,7,9.1,8.1,9.7l0.9,0.4l2.4,1.1c0.2,0,0.3-0.1,0.5-0.1c0.8-1.1,1.7-2.2,2.6-3.2h28.5c0.4,0,0.8,0.4,0.8,0.8v0V7.2
	C43.9,6.7,43.5,6.4,43.1,6.4L43.1,6.4z"/>
<path class="st0" d="M7.6,39.6l-2.4-4.9c0,0,0-0.1-0.1-0.1l-4.3-4.5c-0.1-0.1-0.2-0.3-0.2-0.5V31c0,0.2,0.1,0.4,0.2,0.5l4.3,4.5
	c0,0,0.1,0.1,0.1,0.1l2.3,4.9c0.1,0.3,0.4,0.5,0.7,0.5l35.6-0.1V40L8.3,40.1C8,40.1,7.7,39.9,7.6,39.6z"/>
<linearGradient id="SVGID_4_" gradientUnits="userSpaceOnUse" x1="31.4401" y1="6.32" x2="31.4401" y2="33.38" gradientTransform="matrix(1 0 0 -1 0 47.29)">
	<stop  offset="0" style="stop-color:#793D1A"/>
	<stop  offset="1" style="stop-color:#C96E28;stop-opacity:0.9"/>
</linearGradient>
<path class="st7" d="M40.4,44.8c-0.3,0-0.6-0.1-0.9-0.2l-7.3-3.9c-0.5-0.2-1-0.2-1.5,0l-7.4,3.9c-0.3,0.2-0.6,0.2-0.9,0.2
	c-0.6,0-1.1-0.3-1.5-0.7c-0.4-0.4-0.5-1-0.4-1.6l1.5-8.2c0.1-0.5-0.1-1-0.5-1.3l-5.9-5.8c-0.8-0.8-0.8-2,0-2.8
	c0.3-0.3,0.7-0.5,1.1-0.6l8.2-1.2c0.5-0.1,0.9-0.4,1.1-0.9l3.7-7.5c0.5-1,1.6-1.4,2.6-0.9c0.4,0.2,0.7,0.5,0.9,0.9l3.7,7.5
	c0.2,0.5,0.7,0.8,1.2,0.9l8.2,1.2c1.1,0.2,1.8,1.2,1.6,2.2c-0.1,0.4-0.3,0.8-0.6,1.1L41.4,33c-0.3,0.4-0.5,0.9-0.4,1.3l1.4,8.2
	c0.1,0.6-0.1,1.1-0.4,1.6C41.6,44.6,41,44.8,40.4,44.8z"/>
<linearGradient id="SVGID_5_" gradientUnits="userSpaceOnUse" x1="42.6906" y1="2.4946" x2="15.3006" y2="36.6146" gradientTransform="matrix(1 0 0 -1 0 47.29)">
	<stop  offset="0" style="stop-color:#896307"/>
	<stop  offset="0.12" style="stop-color:#A77D07"/>
	<stop  offset="0.27" style="stop-color:#C69807"/>
	<stop  offset="0.43" style="stop-color:#DFAC07"/>
	<stop  offset="0.6" style="stop-color:#F0BB07"/>
	<stop  offset="0.78" style="stop-color:#FBC407"/>
	<stop  offset="1" style="stop-color:#FEC707"/>
</linearGradient>
<path class="st8" d="M33,14.4l3.7,7.5c0.2,0.5,0.7,0.9,1.3,1l8.3,1.1c1,0.1,1.6,1,1.5,1.9c0,0.4-0.2,0.8-0.5,1.1l-6,5.8
	c-0.4,0.4-0.6,1-0.5,1.5l1.4,8.2c0.2,1-0.5,1.9-1.4,2c-0.4,0.1-0.8,0-1.1-0.2l-7.3-3.9c-0.5-0.3-1.1-0.3-1.6,0l-7.4,3.9
	c-0.9,0.5-1.9,0.1-2.4-0.7c-0.2-0.3-0.2-0.7-0.2-1.1l1.4-8.2c0.1-0.6-0.1-1.1-0.5-1.5l-6-5.8c-0.7-0.7-0.7-1.8-0.1-2.5
	c0.3-0.3,0.7-0.5,1.1-0.5l8.2-1.2c0.6-0.1,1.1-0.5,1.3-1l3.7-7.5c0.4-0.9,1.5-1.2,2.3-0.8C32.6,13.7,32.9,14,33,14.4L33,14.4z"/>
<path class="st6" d="M40.8,35.9l1.3,7.6c0.1-0.3,0.2-0.7,0.1-1L40.9,35C40.8,35.3,40.7,35.6,40.8,35.9z"/>
<path class="st6" d="M16.7,25.6l8.2-1.2c0.6-0.1,1.1-0.5,1.3-1l3.7-7.4c0.4-0.9,1.5-1.2,2.4-0.8c0.3,0.2,0.6,0.4,0.8,0.8l3.7,7.5
	c0.2,0.5,0.7,0.9,1.3,1l8.2,1.2c0.6,0.1,1.1,0.5,1.3,1c0.5-0.8,0.2-1.9-0.6-2.4c-0.2-0.1-0.4-0.2-0.7-0.2L38,22.8
	c-0.6-0.1-1.1-0.5-1.3-1L33,14.4c-0.4-0.9-1.5-1.2-2.3-0.8c-0.4,0.2-0.6,0.5-0.8,0.8l-3.7,7.5c-0.2,0.5-0.7,0.9-1.3,1L16.7,24
	c-1,0.1-1.6,1-1.5,2c0,0.2,0.1,0.4,0.2,0.5C15.6,26,16.1,25.7,16.7,25.6z"/>
<path class="st6" d="M22,35l-1.3,7.6c-0.1,0.3,0,0.7,0.1,1l1.3-7.6C22.2,35.7,22.1,35.3,22,35z"/>
<path class="st5" d="M21.6,32.8L15.7,27c-0.1-0.1-0.3-0.3-0.4-0.5c-0.3,0.7-0.2,1.5,0.4,2l5.9,5.8c0.2,0.2,0.3,0.4,0.4,0.6l0.1-0.6
	C22.2,33.8,22,33.2,21.6,32.8z"/>
<path class="st5" d="M47.2,27l-6,5.8c-0.4,0.4-0.6,1-0.5,1.5l0.1,0.6c0.1-0.2,0.2-0.4,0.4-0.6l6-5.8c0.5-0.5,0.7-1.3,0.3-2
	C47.5,26.7,47.4,26.9,47.2,27z"/>
<path class="st5" d="M39.6,44.4l-7.3-3.9c-0.5-0.3-1.1-0.3-1.6,0l-7.4,3.9c-0.9,0.4-1.9,0.1-2.4-0.7c0,0,0-0.1-0.1-0.1l-0.1,0.6
	c-0.2,0.9,0.4,1.9,1.4,2c0.4,0.1,0.8,0,1.1-0.2l7.4-3.9c0.5-0.3,1.1-0.3,1.6,0l7.3,3.9c0.9,0.5,1.9,0.1,2.4-0.7
	c0.2-0.3,0.2-0.7,0.2-1.1l-0.1-0.6c-0.4,0.9-1.4,1.3-2.3,0.9C39.7,44.5,39.7,44.4,39.6,44.4z"/>
</svg>
