<?xml version="1.0" encoding="utf-8"?>
<!-- Generator: Adobe Illustrator 21.0.0, SVG Export Plug-In . SVG Version: 6.00 Build 0)  -->
<svg version="1.1" id="katman_1" xmlns="http://www.w3.org/2000/svg" xmlns:xlink="http://www.w3.org/1999/xlink" x="0px" y="0px"
	 viewBox="0 0 47 48" style="enable-background:new 0 0 47 48;" xml:space="preserve">
<style type="text/css">
	.st0{opacity:0.7;fill:#414042;enable-background:new    ;}
	.st1{fill:url(#SVGID_1_);}
	.st2{fill:url(#SVGID_2_);}
	.st3{opacity:0.2;fill:#231F20;enable-background:new    ;}
	.st4{fill:url(#SVGID_3_);}
	.st5{fill:url(#SVGID_4_);}
	.st6{opacity:0.1;fill:#FFFFFF;enable-background:new    ;}
	.st7{opacity:0.2;fill:#010101;enable-background:new    ;}
</style>
<title>konsole_1</title>
<path class="st0" d="M1.9,47C0.9,47,0,46.1,0,45.1V1.9C0,0.9,0.9,0,1.9,0c0,0,0,0,0,0h43.2C46.1,0,47,0.9,47,1.9v43.2
	c0,1-0.9,1.9-1.9,1.9H1.9z M43.5,43.5v-40h-40v40H43.5z"/>
<linearGradient id="SVGID_1_" gradientUnits="userSpaceOnUse" x1="23.515" y1="4.6" x2="23.515" y2="46.68" gradientTransform="matrix(1 0 0 -1 0 47.73)">
	<stop  offset="0" style="stop-color:#1A1A1A"/>
	<stop  offset="1" style="stop-color:#404745"/>
</linearGradient>
<rect x="3" y="3" class="st1" width="41" height="41"/>
<linearGradient id="SVGID_2_" gradientUnits="userSpaceOnUse" x1="23.515" y1="2.19" x2="23.515" y2="49.44" gradientTransform="matrix(1 0 0 -1 0 47.73)">
	<stop  offset="0" style="stop-color:#A3A3A3"/>
	<stop  offset="0.13" style="stop-color:#BCBBBB"/>
	<stop  offset="0.27" style="stop-color:#D0CECE"/>
	<stop  offset="0.43" style="stop-color:#DEDCDB"/>
	<stop  offset="0.64" style="stop-color:#E6E4E3"/>
	<stop  offset="1" style="stop-color:#E8E6E5"/>
</linearGradient>
<path class="st2" d="M45.1,0.5H1.9c-0.8,0-1.4,0.6-1.4,1.4c0,0,0,0,0,0v43.2c0,0.8,0.6,1.4,1.4,1.4h43.2c0.8,0,1.4-0.6,1.4-1.4V1.9
	C46.5,1.1,45.9,0.5,45.1,0.5z M43.5,43.5H3.5v-40h40.1V43.5z"/>
<path class="st3" d="M23.5,34.7c-1.4,0-2.6-1.2-2.6-2.6c0-1.4,1.2-2.6,2.6-2.6h14.6c1.4,0,2.6,1.2,2.6,2.6c0,1.4-1.2,2.6-2.6,2.6
	H23.5z"/>
<linearGradient id="SVGID_3_" gradientUnits="userSpaceOnUse" x1="30.8102" y1="40.51" x2="30.8102" y2="8.99" gradientTransform="matrix(1 0 0 -1 0 47.73)">
	<stop  offset="0" style="stop-color:#E8E6E5"/>
	<stop  offset="0.48" style="stop-color:#E6E4E3"/>
	<stop  offset="0.66" style="stop-color:#DFDEDD"/>
	<stop  offset="0.78" style="stop-color:#D4D2D1"/>
	<stop  offset="0.88" style="stop-color:#C3C2C1"/>
	<stop  offset="0.97" style="stop-color:#ADADAD"/>
	<stop  offset="1" style="stop-color:#A3A3A3"/>
</linearGradient>
<path class="st4" d="M38.1,30.1H23.5c-1.1,0-2.1,0.9-2.1,2.1c0,1.1,0.9,2.1,2.1,2.1h14.6c1.1,0,2.1-0.9,2.1-2.1
	C40.2,31,39.2,30.1,38.1,30.1C38.1,30.1,38.1,30.1,38.1,30.1z"/>
<path class="st3" d="M8.9,34.7c-1.4,0-2.6-1.2-2.6-2.6c0-0.7,0.3-1.3,0.7-1.8l8.5-8.5l-8.5-8.5C6,12.3,6,10.7,7,9.7s2.6-1.1,3.7-0.1
	c0,0,0.1,0.1,0.1,0.1L21.1,20c1,1,1,2.7,0,3.7L10.8,34C10.3,34.5,9.6,34.7,8.9,34.7z"/>
<linearGradient id="SVGID_4_" gradientUnits="userSpaceOnUse" x1="14.0757" y1="40.51" x2="14.0757" y2="8.99" gradientTransform="matrix(1 0 0 -1 0 47.73)">
	<stop  offset="0" style="stop-color:#E8E6E5"/>
	<stop  offset="0.48" style="stop-color:#E6E4E3"/>
	<stop  offset="0.66" style="stop-color:#DFDEDD"/>
	<stop  offset="0.78" style="stop-color:#D4D2D1"/>
	<stop  offset="0.88" style="stop-color:#C3C2C1"/>
	<stop  offset="0.97" style="stop-color:#ADADAD"/>
	<stop  offset="1" style="stop-color:#A3A3A3"/>
</linearGradient>
<path class="st5" d="M21.3,21.8c0-0.6-0.2-1.1-0.6-1.5L10.4,10c-0.8-0.8-2.2-0.8-3,0c-0.8,0.8-0.8,2.2,0,3l8.9,8.9l-8.9,8.8
	c-0.8,0.8-0.8,2.1,0,2.9c0.8,0.8,2.1,0.8,2.9,0l0,0l10.3-10.3C21.1,22.9,21.3,22.4,21.3,21.8z"/>
<rect x="3.5" y="43.5" class="st6" width="40.1" height="1.5"/>
<path class="st6" d="M45.1,0.5H1.9c-0.8,0-1.4,0.6-1.4,1.4c0,0,0,0,0,0v1.5C0.5,2.6,1.2,2,1.9,2h43.2c0.8,0,1.4,0.6,1.4,1.4V1.9
	C46.5,1.1,45.9,0.5,45.1,0.5z"/>
<rect x="3.5" y="3.5" class="st7" width="40.1" height="1.5"/>
<path class="st7" d="M45.1,46.5H1.9c-0.8,0-1.4-0.6-1.4-1.4v1.5c0,0.8,0.6,1.4,1.4,1.4h43.2c0.8,0,1.4-0.6,1.4-1.4v-1.5
	C46.5,45.9,45.9,46.5,45.1,46.5z"/>
<path class="st6" d="M23.5,31.5h14.6c0.8,0,1.6,0.5,1.9,1.3c0.4-1.1-0.1-2.3-1.2-2.7c-0.2-0.1-0.5-0.1-0.8-0.1H23.5
	c-1.1,0-2.1,0.9-2.1,2.1c0,0.3,0,0.5,0.1,0.8C21.9,32.1,22.7,31.5,23.5,31.5z"/>
<path class="st7" d="M38.1,34.2H23.5c-0.9,0-1.6-0.5-1.9-1.3c-0.4,1.1,0.1,2.3,1.2,2.7c0.2,0.1,0.5,0.1,0.8,0.1h14.6
	c1.1,0,2.1-1,2-2.1c0-0.2-0.1-0.5-0.1-0.7C39.7,33.7,38.9,34.2,38.1,34.2z"/>
<path class="st6" d="M16.3,23.3l-0.7-0.7l-8.1,8.1c-0.6,0.6-0.8,1.4-0.5,2.2c0.1-0.3,0.3-0.5,0.5-0.7L16.3,23.3z"/>
<path class="st6" d="M10.4,11.5l10.3,10.3c0.2,0.2,0.4,0.5,0.5,0.8c0.1-0.2,0.1-0.5,0.1-0.7c0-0.6-0.2-1.1-0.6-1.5L10.4,10
	c-0.8-0.8-2.1-0.8-2.9,0c-0.6,0.6-0.8,1.4-0.5,2.2c0.4-1.1,1.6-1.6,2.7-1.2C9.9,11.1,10.2,11.3,10.4,11.5L10.4,11.5z"/>
<path class="st7" d="M7.5,13c-0.2-0.2-0.4-0.5-0.5-0.8c-0.3,0.8-0.1,1.6,0.5,2.2l8.1,8.1l0.7-0.7L7.5,13z"/>
<path class="st7" d="M20.7,23.3L10.4,33.6c-0.8,0.8-2.1,0.8-2.9,0c-0.2-0.2-0.4-0.5-0.5-0.8c-0.4,1.1,0.1,2.3,1.2,2.7
	c0.8,0.3,1.6,0.1,2.2-0.5l10.3-10.3c0.6-0.6,0.8-1.4,0.5-2.2C21.1,22.8,20.9,23.1,20.7,23.3z"/>
</svg>
