<?xml version="1.0" encoding="utf-8"?>
<!-- Generator: Adobe Illustrator 21.0.0, SVG Export Plug-In . SVG Version: 6.00 Build 0)  -->
<svg version="1.1" id="katman_1" xmlns="http://www.w3.org/2000/svg" xmlns:xlink="http://www.w3.org/1999/xlink" x="0px" y="0px"
	 viewBox="0 0 64 47.9" style="enable-background:new 0 0 64 47.9;" xml:space="preserve">
<style type="text/css">
	.st0{opacity:0.7;fill:#09172D;enable-background:new    ;}
	.st1{fill:url(#SVGID_1_);}
	.st2{opacity:0.8;fill:#0E141E;enable-background:new    ;}
	.st3{fill:url(#SVGID_2_);}
	.st4{opacity:0.1;fill:#FFFFFF;enable-background:new    ;}
	.st5{opacity:0.1;enable-background:new    ;}
</style>
<title>Varlık 1</title>
<rect x="0.2" y="0" class="st0" width="63.6" height="42.5"/>
<linearGradient id="SVGID_1_" gradientUnits="userSpaceOnUse" x1="32.005" y1="-54.06" x2="32.005" y2="-13.28" gradientTransform="matrix(1 0 0 1 0 55.32)">
	<stop  offset="0" style="stop-color:#2A6D94"/>
	<stop  offset="1" style="stop-color:#2D5778"/>
</linearGradient>
<rect x="0.7" y="0.5" class="st1" width="62.7" height="41.5"/>
<path class="st2" d="M1.5,46.4c-0.9,0-1.5-0.7-1.5-1.5c0,0,0,0,0,0v-5.3h64v5.3c0,0.9-0.7,1.5-1.5,1.5l0,0H1.5z"/>
<linearGradient id="SVGID_2_" gradientUnits="userSpaceOnUse" x1="32" y1="-74.02" x2="32" y2="-9.89" gradientTransform="matrix(1 0 0 1 0 55.31)">
	<stop  offset="0" style="stop-color:#A3A4A4"/>
	<stop  offset="0.12" style="stop-color:#BBBBBB"/>
	<stop  offset="0.27" style="stop-color:#CFCECE"/>
	<stop  offset="0.43" style="stop-color:#DDDCDC"/>
	<stop  offset="0.64" style="stop-color:#E5E4E4"/>
	<stop  offset="1" style="stop-color:#E7E6E6"/>
</linearGradient>
<path class="st3" d="M63.5,40.1v4.8c0,0.6-0.5,1-1,1H1.5c-0.6,0-1.1-0.5-1.1-1c0,0,0,0,0,0v-4.8H63.5z"/>
<rect x="0.7" y="0.5" class="st4" width="62.7" height="2"/>
<path class="st5" d="M62.5,45.9H1.5c-0.6,0-1-0.5-1-1v2c0,0.6,0.5,1,1,1h60.9c0.6,0,1-0.5,1-1v-2C63.5,45.4,63,45.9,62.5,45.9z"/>
<rect x="0.5" y="40.1" class="st4" width="63" height="2"/>
</svg>
