<?xml version="1.0" encoding="utf-8"?>
<!-- Generator: Adobe Illustrator 21.0.0, SVG Export Plug-In . SVG Version: 6.00 Build 0)  -->
<svg version="1.1" id="katman_1" xmlns="http://www.w3.org/2000/svg" xmlns:xlink="http://www.w3.org/1999/xlink" x="0px" y="0px"
	 viewBox="0 0 48 35.9" style="enable-background:new 0 0 48 35.9;" xml:space="preserve">
<style type="text/css">
	.st0{opacity:0.7;fill:#09172D;enable-background:new    ;}
	.st1{fill:url(#SVGID_1_);}
	.st2{opacity:0.8;fill:#0E141E;enable-background:new    ;}
	.st3{fill:url(#SVGID_2_);}
	.st4{opacity:0.1;fill:#FFFFFF;enable-background:new    ;}
	.st5{opacity:0.1;enable-background:new    ;}
</style>
<title>Varlık 2</title>
<rect x="0.1" y="0" class="st0" width="47.7" height="31.9"/>
<linearGradient id="SVGID_1_" gradientUnits="userSpaceOnUse" x1="24.005" y1="-42.4" x2="24.005" y2="-11.81" gradientTransform="matrix(1 0 0 1 0 43.34)">
	<stop  offset="0" style="stop-color:#2A6D94"/>
	<stop  offset="1" style="stop-color:#2D5778"/>
</linearGradient>
<rect x="0.5" y="0.4" class="st1" width="47" height="31.1"/>
<path class="st2" d="M1.2,34.8c-0.6,0-1.2-0.5-1.2-1.2v-4h48v4c0,0.6-0.5,1.2-1.2,1.2H1.2z"/>
<linearGradient id="SVGID_2_" gradientUnits="userSpaceOnUse" x1="24" y1="-57.37" x2="24" y2="-9.27" gradientTransform="matrix(1 0 0 1 0 43.34)">
	<stop  offset="0" style="stop-color:#A3A4A4"/>
	<stop  offset="0.12" style="stop-color:#BBBBBB"/>
	<stop  offset="0.27" style="stop-color:#CFCECE"/>
	<stop  offset="0.43" style="stop-color:#DDDCDC"/>
	<stop  offset="0.64" style="stop-color:#E5E4E4"/>
	<stop  offset="1" style="stop-color:#E7E6E6"/>
</linearGradient>
<path class="st3" d="M47.6,30.1v3.6c0,0.4-0.4,0.8-0.8,0.8l0,0H1.2c-0.4,0-0.8-0.4-0.8-0.8l0,0v-3.6H47.6z"/>
<rect x="0.5" y="0.4" class="st4" width="47" height="1.5"/>
<path class="st5" d="M46.8,34.4H1.2c-0.4,0-0.8-0.4-0.8-0.8l0,0v1.5c0,0.4,0.4,0.8,0.8,0.8c0,0,0,0,0,0h45.7c0.4,0,0.8-0.4,0.8-0.8
	l0,0v-1.5C47.6,34.1,47.3,34.4,46.8,34.4z"/>
<rect x="0.4" y="30.1" class="st4" width="47.3" height="1.5"/>
</svg>
