<?xml version="1.0" encoding="utf-8"?>
<!-- Generator: Adobe Illustrator 21.0.0, SVG Export Plug-In . SVG Version: 6.00 Build 0)  -->
<svg version="1.1" id="katman_1" xmlns="http://www.w3.org/2000/svg" xmlns:xlink="http://www.w3.org/1999/xlink" x="0px" y="0px"
	 viewBox="0 0 23.5 24" style="enable-background:new 0 0 23.5 24;" xml:space="preserve">
<style type="text/css">
	.st0{fill:#2E3033;}
</style>
<title>edit-cut_3</title>
<path class="st0" d="M23.2,10.8c-0.9-2.1-3.3-3.1-5.4-2.2c-1.6,0.7-2.7,2.3-2.5,4.1l-2.1-0.8l-2.5-9.2c-0.2-0.6-0.6-1.1-1-1.6
	C9.2,0.6,8.6,0.2,8,0H7.8L7.7,0.2L7.6,0.3l2.9,10.5l-10-4H0.1L0,7c-0.1,0.4,0.5,1.5,0.9,1.9c0.4,0.5,0.9,0.9,1.5,1.1l8.9,3.5
	l0.6,2.1c-0.2,0-0.5-0.1-0.7-0.1c-2.3,0-4.2,1.8-4.2,4.2c0,2.3,1.8,4.2,4.2,4.2s4.2-1.8,4.2-4.2c0-0.6-0.1-1.1-0.3-1.6l-1-3.6
	l3.4,1.4c0.6,0.3,1.3,0.5,2,0.5l0,0c2.3,0,4.1-1.9,4.1-4.2C23.5,11.9,23.4,11.4,23.2,10.8L23.2,10.8z M12.6,20.7
	c-0.5,0.8-1.5,1.1-2.4,0.6c-0.8-0.5-1.1-1.5-0.6-2.4c0.5-0.8,1.5-1.1,2.4-0.6c0.4,0.2,0.7,0.6,0.8,1.1
	C12.9,19.8,12.8,20.3,12.6,20.7z M21,13.1c-0.4,0.9-1.4,1.3-2.3,1s-1.3-1.4-1-2.3c0.3-0.9,1.3-1.3,2.2-1
	C20.9,11.2,21.3,12.2,21,13.1C21,13.1,21,13.1,21,13.1z"/>
</svg>
