<?xml version="1.0" encoding="utf-8"?>
<!-- Generator: Adobe Illustrator 21.0.0, SVG Export Plug-In . SVG Version: 6.00 Build 0)  -->
<svg version="1.1" id="katman_1" xmlns="http://www.w3.org/2000/svg" xmlns:xlink="http://www.w3.org/1999/xlink" x="0px" y="0px"
	 viewBox="0 0 48 37.4" style="enable-background:new 0 0 48 37.4;" xml:space="preserve">
<style type="text/css">
	.st0{fill:#4D4D4D;}
	.st1{fill:url(#SVGID_1_);}
	.st2{fill:#FFFFFF;}
	.st3{opacity:0.7;fill:#FFFFFF;enable-background:new    ;}
	.st4{opacity:0.2;enable-background:new    ;}
	.st5{fill:url(#SVGID_2_);}
	.st6{opacity:0.3;fill:url(#SVGID_3_);enable-background:new    ;}
	.st7{opacity:0.2;fill:#FFFFFF;enable-background:new    ;}
	.st8{fill:url(#SVGID_4_);}
	.st9{fill:url(#SVGID_5_);}
	.st10{fill:url(#SVGID_6_);}
	.st11{fill:url(#SVGID_7_);}
	.st12{fill:url(#SVGID_8_);}
	.st13{fill:url(#SVGID_9_);}
	.st14{fill:url(#SVGID_10_);}
	.st15{fill:url(#SVGID_11_);}
	.st16{fill:url(#SVGID_12_);}
	.st17{fill:url(#SVGID_13_);}
	.st18{fill:url(#SVGID_14_);}
	.st19{fill:url(#SVGID_15_);}
	.st20{fill:url(#SVGID_16_);}
	.st21{fill:url(#SVGID_17_);}
	.st22{fill:url(#SVGID_18_);}
	.st23{fill:url(#SVGID_19_);}
	.st24{fill:url(#SVGID_20_);}
	.st25{fill:url(#SVGID_21_);}
	.st26{fill:url(#SVGID_22_);}
	.st27{fill:url(#SVGID_23_);}
	.st28{fill:url(#SVGID_24_);}
	.st29{fill:url(#SVGID_25_);}
	.st30{fill:url(#SVGID_26_);}
	.st31{fill:url(#SVGID_27_);}
	.st32{fill:url(#SVGID_28_);}
	.st33{fill:url(#SVGID_29_);}
	.st34{fill:url(#SVGID_30_);}
	.st35{fill:url(#SVGID_31_);}
	.st36{fill:url(#SVGID_32_);}
	.st37{fill:url(#SVGID_33_);}
	.st38{fill:url(#SVGID_34_);}
	.st39{fill:url(#SVGID_35_);}
	.st40{fill:url(#SVGID_36_);}
	.st41{fill:url(#SVGID_37_);}
	.st42{fill:url(#SVGID_38_);}
	.st43{fill:url(#SVGID_39_);}
	.st44{fill:url(#SVGID_40_);}
	.st45{fill:url(#SVGID_41_);}
	.st46{fill:url(#SVGID_42_);}
	.st47{fill:url(#SVGID_43_);}
	.st48{fill:url(#SVGID_44_);}
	.st49{fill:url(#SVGID_45_);}
	.st50{fill:url(#SVGID_46_);}
	.st51{fill:url(#SVGID_47_);}
	.st52{fill:url(#SVGID_48_);}
	.st53{fill:url(#SVGID_49_);}
	.st54{fill:url(#SVGID_50_);}
	.st55{fill:url(#SVGID_51_);}
	.st56{fill:url(#SVGID_52_);}
	.st57{fill:url(#SVGID_53_);}
	.st58{fill:url(#SVGID_54_);}
	.st59{fill:url(#SVGID_55_);}
	.st60{fill:url(#SVGID_56_);}
	.st61{fill:url(#SVGID_57_);}
	.st62{fill:url(#SVGID_58_);}
	.st63{fill:url(#SVGID_59_);}
	.st64{fill:url(#SVGID_60_);}
	.st65{fill:url(#SVGID_61_);}
	.st66{fill:url(#SVGID_62_);}
	.st67{fill:url(#SVGID_63_);}
	.st68{fill:url(#SVGID_64_);}
	.st69{fill:url(#SVGID_65_);}
	.st70{fill:url(#SVGID_66_);}
	.st71{fill:url(#SVGID_67_);}
	.st72{fill:url(#SVGID_68_);}
	.st73{fill:url(#SVGID_69_);}
	.st74{fill:url(#SVGID_70_);}
	.st75{fill:url(#SVGID_71_);}
	.st76{fill:url(#SVGID_72_);}
	.st77{fill:url(#SVGID_73_);}
	.st78{fill:url(#SVGID_74_);}
	.st79{fill:url(#SVGID_75_);}
	.st80{fill:url(#SVGID_76_);}
	.st81{fill:url(#SVGID_77_);}
	.st82{fill:url(#SVGID_78_);}
	.st83{fill:url(#SVGID_79_);}
	.st84{fill:url(#SVGID_80_);}
	.st85{fill:url(#SVGID_81_);}
	.st86{fill:url(#SVGID_82_);}
	.st87{fill:url(#SVGID_83_);}
	.st88{fill:url(#SVGID_84_);}
	.st89{fill:url(#SVGID_85_);}
	.st90{fill:url(#SVGID_86_);}
	.st91{fill:url(#SVGID_87_);}
	.st92{fill:url(#SVGID_88_);}
	.st93{fill:url(#SVGID_89_);}
	.st94{fill:url(#SVGID_90_);}
	.st95{fill:url(#SVGID_91_);}
	.st96{fill:url(#SVGID_92_);}
	.st97{fill:url(#SVGID_93_);}
	.st98{fill:url(#SVGID_94_);}
	.st99{fill:url(#SVGID_95_);}
	.st100{fill:url(#SVGID_96_);}
	.st101{fill:url(#SVGID_97_);}
	.st102{fill:url(#SVGID_98_);}
	.st103{fill:url(#SVGID_99_);}
	.st104{fill:url(#SVGID_100_);}
	.st105{fill:url(#SVGID_101_);}
	.st106{fill:url(#SVGID_102_);}
	.st107{fill:url(#SVGID_103_);}
	.st108{fill:url(#SVGID_104_);}
	.st109{fill:url(#SVGID_105_);}
	.st110{fill:url(#SVGID_106_);}
	.st111{fill:url(#SVGID_107_);}
	.st112{fill:url(#SVGID_108_);}
	.st113{fill:url(#SVGID_109_);}
	.st114{fill:url(#SVGID_110_);}
	.st115{fill:url(#SVGID_111_);}
	.st116{fill:url(#SVGID_112_);}
	.st117{fill:url(#SVGID_113_);}
	.st118{fill:url(#SVGID_114_);}
	.st119{fill:url(#SVGID_115_);}
	.st120{fill:url(#SVGID_116_);}
	.st121{fill:url(#SVGID_117_);}
	.st122{fill:url(#SVGID_118_);}
	.st123{fill:url(#SVGID_119_);}
	.st124{fill:url(#SVGID_120_);}
	.st125{fill:url(#SVGID_121_);}
	.st126{fill:url(#SVGID_122_);}
	.st127{fill:url(#SVGID_123_);}
	.st128{fill:url(#SVGID_124_);}
	.st129{fill:url(#SVGID_125_);}
	.st130{fill:url(#SVGID_126_);}
	.st131{fill:url(#SVGID_127_);}
	.st132{fill:url(#SVGID_128_);}
	.st133{fill:url(#SVGID_129_);}
	.st134{fill:url(#SVGID_130_);}
	.st135{fill:url(#SVGID_131_);}
	.st136{fill:url(#SVGID_132_);}
	.st137{fill:url(#SVGID_133_);}
	.st138{fill:url(#SVGID_134_);}
	.st139{fill:url(#SVGID_135_);}
	.st140{fill:url(#SVGID_136_);}
	.st141{fill:url(#SVGID_137_);}
	.st142{fill:url(#SVGID_138_);}
	.st143{fill:url(#SVGID_139_);}
	.st144{fill:url(#SVGID_140_);}
	.st145{fill:url(#SVGID_141_);}
	.st146{fill:url(#SVGID_142_);}
	.st147{fill:url(#SVGID_143_);}
	.st148{fill:url(#SVGID_144_);}
	.st149{fill:url(#SVGID_145_);}
</style>
<title>input-keyboard_1</title>
<path class="st0" d="M1.8,12.5h44.4c1,0,1.8,0.8,1.8,1.8v20.2c0,1-0.8,1.8-1.8,1.8H1.8c-1,0-1.8-0.8-1.8-1.8V14.3
	C0,13.3,0.8,12.5,1.8,12.5z"/>
<path class="st0" d="M23.9,14c-1.2-1.4-2.7-4.6,0-7.3c0.4-0.4,0.8-0.8,1.2-1.1c2-1.9,2.4-2.2,1.1-4.4L26,0.8L27.6,0l0.2,0.3
	c2,3.4,0.7,4.6-1.4,6.5c-0.4,0.3-0.8,0.7-1.2,1.1c-2.3,2.2,0,4.8,0,5l0.3,0.3l-1.3,1.1L23.9,14z"/>
<linearGradient id="SVGID_1_" gradientUnits="userSpaceOnUse" x1="25.5893" y1="23.99" x2="25.5893" y2="37.23" gradientTransform="matrix(1 0 0 -1 0 37.73)">
	<stop  offset="0" style="stop-color:#CCCCCC"/>
	<stop  offset="1" style="stop-color:#F7F7F7"/>
</linearGradient>
<path class="st1" d="M24.2,13.7c-1.1-1.2-2.5-4.3,0-6.7c0.4-0.4,0.8-0.8,1.2-1.1C27.5,4,28.1,3.5,26.6,1l0.9-0.5
	c1.9,3.1,0.8,4.1-1.4,6.1c-0.4,0.3-0.8,0.7-1.2,1.1c-2.6,2.5-0.1,5.4,0,5.5L24.2,13.7z"/>
<path class="st2" d="M27.4,1.3c0.5,0.7,0.8,1.5,0.9,2.3c0-1.1-0.3-2.1-0.9-3L26.6,1c0.1,0.2,0.2,0.4,0.3,0.6L27.4,1.3z"/>
<path class="st3" d="M24.2,7.7c0.4-0.4,0.8-0.8,1.2-1.1c1.5-1.3,2.2-2,2-3.1c-0.2,0.7-0.8,1.4-2,2.4c-0.4,0.3-0.8,0.7-1.2,1.1
	c-1,0.9-1.5,2.2-1.4,3.6C22.9,9.5,23.4,8.5,24.2,7.7z"/>
<path class="st4" d="M24.6,13.4l0.4-0.3c-0.6-0.7-1-1.6-1.2-2.6C23.7,11.6,24,12.6,24.6,13.4z"/>
<linearGradient id="SVGID_2_" gradientUnits="userSpaceOnUse" x1="23.995" y1="1.82" x2="23.995" y2="24.91" gradientTransform="matrix(1 0 0 -1 0 37.73)">
	<stop  offset="0" style="stop-color:#CCCCCC"/>
	<stop  offset="1" style="stop-color:#F7F7F7"/>
</linearGradient>
<path class="st5" d="M1.8,12.8h44.4c0.8,0,1.4,0.6,1.4,1.4v20.2c0,0.8-0.6,1.4-1.4,1.4H1.8c-0.8,0-1.4-0.6-1.4-1.4V14.3
	C0.4,13.5,1,12.8,1.8,12.8z"/>
<linearGradient id="SVGID_3_" gradientUnits="userSpaceOnUse" x1="23.995" y1="1.82" x2="23.995" y2="24.91" gradientTransform="matrix(1 0 0 -1 0 37.73)">
	<stop  offset="0" style="stop-color:#666666"/>
	<stop  offset="6.000000e-02" style="stop-color:#E6E6E6"/>
	<stop  offset="0.17" style="stop-color:#B3B3B3"/>
	<stop  offset="1" style="stop-color:#CCCCCC"/>
</linearGradient>
<path class="st6" d="M1.8,12.8h44.4c0.8,0,1.4,0.6,1.4,1.4v20.2c0,0.8-0.6,1.4-1.4,1.4H1.8c-0.8,0-1.4-0.6-1.4-1.4V14.3
	C0.4,13.5,1,12.8,1.8,12.8z"/>
<path class="st7" d="M46.2,12.8H1.8c-0.8,0-1.4,0.6-1.4,1.4c0,0,0,0,0,0v1.5c0-0.8,0.6-1.4,1.4-1.4c0,0,0,0,0,0h44.4
	c0.8,0,1.4,0.6,1.4,1.4l0,0v-1.5C47.6,13.5,47,12.8,46.2,12.8C46.2,12.8,46.2,12.8,46.2,12.8z"/>
<path class="st4" d="M46.2,35.9H1.8c-0.8,0-1.4-0.6-1.4-1.4c0,0,0,0,0,0V36c0,0.8,0.6,1.4,1.4,1.4c0,0,0,0,0,0h44.4
	c0.8,0,1.4-0.6,1.4-1.4c0,0,0,0,0,0v-1.5C47.6,35.3,47,35.9,46.2,35.9z"/>
<linearGradient id="SVGID_4_" gradientUnits="userSpaceOnUse" x1="17.785" y1="21.24" x2="17.785" y2="23.03" gradientTransform="matrix(1 0 0 -1 0 37.73)">
	<stop  offset="0" style="stop-color:#1A1A1A"/>
	<stop  offset="1" style="stop-color:#595959"/>
</linearGradient>
<path class="st8" d="M16.7,16.5c-0.1,0-0.3-0.1-0.3-0.3c0,0,0,0,0,0V15c0-0.1,0.1-0.3,0.2-0.3c0,0,0,0,0,0h2.2
	c0.1,0,0.3,0.1,0.3,0.3c0,0,0,0,0,0v1.2c0,0.1-0.1,0.3-0.2,0.3c0,0,0,0,0,0H16.7z"/>
<linearGradient id="SVGID_5_" gradientUnits="userSpaceOnUse" x1="14.955" y1="21.24" x2="14.955" y2="23.03" gradientTransform="matrix(1 0 0 -1 0 37.73)">
	<stop  offset="0" style="stop-color:#1A1A1A"/>
	<stop  offset="1" style="stop-color:#595959"/>
</linearGradient>
<path class="st9" d="M13.8,16.5c-0.1,0-0.3-0.1-0.3-0.3c0,0,0,0,0,0V15c0-0.1,0.1-0.3,0.2-0.3c0,0,0,0,0,0h2.2
	c0.1,0,0.3,0.1,0.3,0.3c0,0,0,0,0,0v1.2c0,0.1-0.1,0.3-0.2,0.3c0,0,0,0,0,0H13.8z"/>
<linearGradient id="SVGID_6_" gradientUnits="userSpaceOnUse" x1="12.11" y1="21.24" x2="12.11" y2="23.03" gradientTransform="matrix(1 0 0 -1 0 37.73)">
	<stop  offset="0" style="stop-color:#1A1A1A"/>
	<stop  offset="1" style="stop-color:#595959"/>
</linearGradient>
<path class="st10" d="M11,16.5c-0.2,0-0.3-0.1-0.2-0.3V15c0-0.2,0.1-0.3,0.2-0.3h2.2c0.2,0,0.3,0.1,0.2,0.3v1.2
	c0,0.2-0.1,0.3-0.2,0.3H11z"/>
<linearGradient id="SVGID_7_" gradientUnits="userSpaceOnUse" x1="9.27" y1="21.24" x2="9.27" y2="23.03" gradientTransform="matrix(1 0 0 -1 0 37.73)">
	<stop  offset="0" style="stop-color:#1A1A1A"/>
	<stop  offset="1" style="stop-color:#595959"/>
</linearGradient>
<path class="st11" d="M8.2,16.5c-0.2,0-0.3-0.1-0.2-0.3V15c0-0.2,0.1-0.3,0.2-0.3h2.2c0.2,0,0.3,0.1,0.2,0.3v1.2
	c0,0.2-0.1,0.3-0.2,0.3H8.2z"/>
<linearGradient id="SVGID_8_" gradientUnits="userSpaceOnUse" x1="30.705" y1="21.24" x2="30.705" y2="23.03" gradientTransform="matrix(1 0 0 -1 0 37.73)">
	<stop  offset="0" style="stop-color:#1A1A1A"/>
	<stop  offset="1" style="stop-color:#595959"/>
</linearGradient>
<path class="st12" d="M29.6,16.5c-0.1,0-0.3-0.1-0.3-0.3c0,0,0,0,0,0V15c0-0.1,0.1-0.3,0.2-0.3c0,0,0,0,0,0h2.2
	c0.1,0,0.3,0.1,0.3,0.3c0,0,0,0,0,0v1.2c0,0.1-0.1,0.3-0.2,0.3c0,0,0,0,0,0H29.6z"/>
<linearGradient id="SVGID_9_" gradientUnits="userSpaceOnUse" x1="27.875" y1="21.24" x2="27.875" y2="23.03" gradientTransform="matrix(1 0 0 -1 0 37.73)">
	<stop  offset="0" style="stop-color:#1A1A1A"/>
	<stop  offset="1" style="stop-color:#595959"/>
</linearGradient>
<path class="st13" d="M26.8,16.5c-0.1,0-0.3-0.1-0.3-0.3c0,0,0,0,0,0V15c0-0.1,0.1-0.3,0.2-0.3c0,0,0,0,0,0H29
	c0.1,0,0.3,0.1,0.3,0.3c0,0,0,0,0,0v1.2c0,0.1-0.1,0.3-0.2,0.3c0,0,0,0,0,0H26.8z"/>
<linearGradient id="SVGID_10_" gradientUnits="userSpaceOnUse" x1="25.02" y1="21.24" x2="25.02" y2="23.03" gradientTransform="matrix(1 0 0 -1 0 37.73)">
	<stop  offset="0" style="stop-color:#1A1A1A"/>
	<stop  offset="1" style="stop-color:#595959"/>
</linearGradient>
<path class="st14" d="M23.9,16.5c-0.2,0-0.3-0.1-0.2-0.3V15c0-0.2,0.1-0.3,0.2-0.3h2.2c0.2,0,0.3,0.1,0.2,0.3v1.2
	c0,0.2-0.1,0.3-0.2,0.3H23.9z"/>
<linearGradient id="SVGID_11_" gradientUnits="userSpaceOnUse" x1="22.185" y1="21.24" x2="22.185" y2="23.03" gradientTransform="matrix(1 0 0 -1 0 37.73)">
	<stop  offset="0" style="stop-color:#1A1A1A"/>
	<stop  offset="1" style="stop-color:#595959"/>
</linearGradient>
<path class="st15" d="M21.1,16.5c-0.2,0-0.3-0.1-0.2-0.3V15c0-0.2,0.1-0.3,0.2-0.3h2.2c0.2,0,0.3,0.1,0.2,0.3v1.2
	c0,0.2-0.1,0.3-0.2,0.3H21.1z"/>
<linearGradient id="SVGID_12_" gradientUnits="userSpaceOnUse" x1="43.625" y1="21.24" x2="43.625" y2="23.03" gradientTransform="matrix(1 0 0 -1 0 37.73)">
	<stop  offset="0" style="stop-color:#1A1A1A"/>
	<stop  offset="1" style="stop-color:#595959"/>
</linearGradient>
<path class="st16" d="M42.5,16.5c-0.1,0-0.3-0.1-0.3-0.3c0,0,0,0,0,0V15c0-0.1,0.1-0.3,0.2-0.3c0,0,0,0,0,0h2.2
	c0.1,0,0.3,0.1,0.3,0.3c0,0,0,0,0,0v1.2c0,0.1-0.1,0.3-0.2,0.3c0,0,0,0,0,0H42.5z"/>
<linearGradient id="SVGID_13_" gradientUnits="userSpaceOnUse" x1="40.775" y1="21.24" x2="40.775" y2="23.03" gradientTransform="matrix(1 0 0 -1 0 37.73)">
	<stop  offset="0" style="stop-color:#1A1A1A"/>
	<stop  offset="1" style="stop-color:#595959"/>
</linearGradient>
<path class="st17" d="M39.7,16.5c-0.1,0-0.3-0.1-0.3-0.3c0,0,0,0,0,0V15c0-0.1,0.1-0.3,0.2-0.3c0,0,0,0,0,0h2.2
	c0.1,0,0.3,0.1,0.3,0.3c0,0,0,0,0,0v1.2c0,0.1-0.1,0.3-0.2,0.3c0,0,0,0,0,0H39.7z"/>
<linearGradient id="SVGID_14_" gradientUnits="userSpaceOnUse" x1="37.91" y1="21.24" x2="37.91" y2="23.03" gradientTransform="matrix(1 0 0 -1 0 37.73)">
	<stop  offset="0" style="stop-color:#1A1A1A"/>
	<stop  offset="1" style="stop-color:#595959"/>
</linearGradient>
<path class="st18" d="M36.8,16.5c-0.2,0-0.3-0.1-0.2-0.3V15c0-0.2,0.1-0.3,0.2-0.3H39c0.2,0,0.3,0.1,0.2,0.3v1.2
	c0,0.2-0.1,0.3-0.2,0.3H36.8z"/>
<linearGradient id="SVGID_15_" gradientUnits="userSpaceOnUse" x1="35.11" y1="21.24" x2="35.11" y2="23.03" gradientTransform="matrix(1 0 0 -1 0 37.73)">
	<stop  offset="0" style="stop-color:#1A1A1A"/>
	<stop  offset="1" style="stop-color:#595959"/>
</linearGradient>
<path class="st19" d="M34,16.5c-0.2,0-0.3-0.1-0.2-0.3V15c0-0.2,0.1-0.3,0.2-0.3h2.2c0.2,0,0.3,0.1,0.2,0.3v1.2
	c0,0.2-0.1,0.3-0.2,0.3H34z"/>
<linearGradient id="SVGID_16_" gradientUnits="userSpaceOnUse" x1="4.39" y1="21.24" x2="4.39" y2="23.03" gradientTransform="matrix(1 0 0 -1 0 37.73)">
	<stop  offset="0" style="stop-color:#1A1A1A"/>
	<stop  offset="1" style="stop-color:#595959"/>
</linearGradient>
<path class="st20" d="M3.3,16.5c-0.2,0-0.3-0.1-0.2-0.3V15c0-0.2,0.1-0.3,0.2-0.3h2.2c0.2,0,0.3,0.1,0.2,0.3v1.2
	c0,0.2-0.1,0.3-0.2,0.3H3.3z"/>
<linearGradient id="SVGID_17_" gradientUnits="userSpaceOnUse" x1="17.785" y1="21.42" x2="17.785" y2="22.85" gradientTransform="matrix(1 0 0 -1 0 37.73)">
	<stop  offset="0" style="stop-color:#CCCCCC"/>
	<stop  offset="1" style="stop-color:#F7F7F7"/>
</linearGradient>
<path class="st21" d="M16.7,14.9h2.2c0,0,0.1,0.1,0.1,0.1v1.2c0,0.1,0,0.1-0.1,0.1h-2.2c0,0-0.1-0.1-0.1-0.1V15
	C16.6,14.9,16.6,14.9,16.7,14.9z"/>
<linearGradient id="SVGID_18_" gradientUnits="userSpaceOnUse" x1="14.955" y1="21.42" x2="14.955" y2="22.85" gradientTransform="matrix(1 0 0 -1 0 37.73)">
	<stop  offset="0" style="stop-color:#CCCCCC"/>
	<stop  offset="1" style="stop-color:#F7F7F7"/>
</linearGradient>
<path class="st22" d="M13.8,14.9h2.2c0,0,0.1,0.1,0.1,0.1v1.2c0,0.1,0,0.1-0.1,0.1h-2.2c0,0-0.1-0.1-0.1-0.1V15
	C13.8,14.9,13.8,14.9,13.8,14.9z"/>
<linearGradient id="SVGID_19_" gradientUnits="userSpaceOnUse" x1="12.11" y1="21.42" x2="12.11" y2="22.85" gradientTransform="matrix(1 0 0 -1 0 37.73)">
	<stop  offset="0" style="stop-color:#CCCCCC"/>
	<stop  offset="1" style="stop-color:#F7F7F7"/>
</linearGradient>
<path class="st23" d="M11,14.9h2.2c0,0,0.1,0.1,0.1,0.1v1.2c0,0.1,0,0.1-0.1,0.1H11c0,0-0.1-0.1-0.1-0.1V15
	C10.9,14.9,11,14.9,11,14.9z"/>
<linearGradient id="SVGID_20_" gradientUnits="userSpaceOnUse" x1="9.27" y1="21.42" x2="9.27" y2="22.85" gradientTransform="matrix(1 0 0 -1 0 37.73)">
	<stop  offset="0" style="stop-color:#CCCCCC"/>
	<stop  offset="1" style="stop-color:#F7F7F7"/>
</linearGradient>
<path class="st24" d="M8.2,14.9h2.2c0,0,0.1,0.1,0.1,0.1v1.2c0,0.1,0,0.1-0.1,0.1H8.2c0,0-0.1-0.1-0.1-0.1V15
	C8.1,14.9,8.1,14.9,8.2,14.9z"/>
<linearGradient id="SVGID_21_" gradientUnits="userSpaceOnUse" x1="30.705" y1="21.42" x2="30.705" y2="22.85" gradientTransform="matrix(1 0 0 -1 0 37.73)">
	<stop  offset="0" style="stop-color:#CCCCCC"/>
	<stop  offset="1" style="stop-color:#F7F7F7"/>
</linearGradient>
<path class="st25" d="M29.6,14.9h2.2c0,0,0.1,0.1,0.1,0.1v1.2c0,0.1,0,0.1-0.1,0.1h-2.2c0,0-0.1-0.1-0.1-0.1V15
	C29.5,14.9,29.5,14.9,29.6,14.9z"/>
<linearGradient id="SVGID_22_" gradientUnits="userSpaceOnUse" x1="27.875" y1="21.42" x2="27.875" y2="22.85" gradientTransform="matrix(1 0 0 -1 0 37.73)">
	<stop  offset="0" style="stop-color:#CCCCCC"/>
	<stop  offset="1" style="stop-color:#F7F7F7"/>
</linearGradient>
<path class="st26" d="M26.8,14.9H29c0,0,0.1,0.1,0.1,0.1v1.2c0,0.1,0,0.1-0.1,0.1h-2.2c0,0-0.1-0.1-0.1-0.1V15
	C26.7,14.9,26.7,14.9,26.8,14.9z"/>
<linearGradient id="SVGID_23_" gradientUnits="userSpaceOnUse" x1="25.02" y1="21.42" x2="25.02" y2="22.85" gradientTransform="matrix(1 0 0 -1 0 37.73)">
	<stop  offset="0" style="stop-color:#CCCCCC"/>
	<stop  offset="1" style="stop-color:#F7F7F7"/>
</linearGradient>
<path class="st27" d="M23.9,14.9h2.2c0,0,0.1,0.1,0.1,0.1v1.2c0,0.1,0,0.1-0.1,0.1h-2.2c0,0-0.1-0.1-0.1-0.1V15
	C23.8,14.9,23.9,14.9,23.9,14.9z"/>
<linearGradient id="SVGID_24_" gradientUnits="userSpaceOnUse" x1="22.185" y1="21.42" x2="22.185" y2="22.85" gradientTransform="matrix(1 0 0 -1 0 37.73)">
	<stop  offset="0" style="stop-color:#CCCCCC"/>
	<stop  offset="1" style="stop-color:#F7F7F7"/>
</linearGradient>
<path class="st28" d="M21.1,14.9h2.2c0,0,0.1,0.1,0.1,0.1v1.2c0,0.1,0,0.1-0.1,0.1h-2.2c0,0-0.1-0.1-0.1-0.1V15
	C21,14.9,21,14.9,21.1,14.9z"/>
<linearGradient id="SVGID_25_" gradientUnits="userSpaceOnUse" x1="43.615" y1="21.42" x2="43.615" y2="22.85" gradientTransform="matrix(1 0 0 -1 0 37.73)">
	<stop  offset="0" style="stop-color:#CCCCCC"/>
	<stop  offset="1" style="stop-color:#F7F7F7"/>
</linearGradient>
<path class="st29" d="M42.5,14.9h2.2c0,0,0.1,0.1,0.1,0.1v1.2c0,0.1,0,0.1-0.1,0.1h-2.2c0,0-0.1-0.1-0.1-0.1V15
	C42.4,14.9,42.5,14.9,42.5,14.9z"/>
<linearGradient id="SVGID_26_" gradientUnits="userSpaceOnUse" x1="40.775" y1="21.42" x2="40.775" y2="22.85" gradientTransform="matrix(1 0 0 -1 0 37.73)">
	<stop  offset="0" style="stop-color:#CCCCCC"/>
	<stop  offset="1" style="stop-color:#F7F7F7"/>
</linearGradient>
<path class="st30" d="M39.7,14.9h2.2c0,0,0.1,0.1,0.1,0.1v1.2c0,0.1,0,0.1-0.1,0.1h-2.2c0,0-0.1-0.1-0.1-0.1V15
	C39.6,14.9,39.6,14.9,39.7,14.9z"/>
<linearGradient id="SVGID_27_" gradientUnits="userSpaceOnUse" x1="37.91" y1="21.42" x2="37.91" y2="22.85" gradientTransform="matrix(1 0 0 -1 0 37.73)">
	<stop  offset="0" style="stop-color:#CCCCCC"/>
	<stop  offset="1" style="stop-color:#F7F7F7"/>
</linearGradient>
<path class="st31" d="M36.8,14.9H39c0,0,0.1,0.1,0.1,0.1v1.2c0,0.1,0,0.1-0.1,0.1h-2.2c0,0-0.1-0.1-0.1-0.1V15
	C36.8,14.9,36.8,14.9,36.8,14.9z"/>
<linearGradient id="SVGID_28_" gradientUnits="userSpaceOnUse" x1="35.1074" y1="21.42" x2="35.1074" y2="22.85" gradientTransform="matrix(1 0 0 -1 0 37.73)">
	<stop  offset="0" style="stop-color:#CCCCCC"/>
	<stop  offset="1" style="stop-color:#F7F7F7"/>
</linearGradient>
<path class="st32" d="M34,14.9h2.2c0,0,0.1,0.1,0.1,0.1v1.2c0,0.1,0,0.1-0.1,0.1H34c0,0-0.1-0.1-0.1-0.1V15
	C33.9,14.9,34,14.9,34,14.9z"/>
<linearGradient id="SVGID_29_" gradientUnits="userSpaceOnUse" x1="4.39" y1="21.42" x2="4.39" y2="22.85" gradientTransform="matrix(1 0 0 -1 0 37.73)">
	<stop  offset="0" style="stop-color:#CCCCCC"/>
	<stop  offset="1" style="stop-color:#F7F7F7"/>
</linearGradient>
<path class="st33" d="M3.3,14.9h2.2c0,0,0.1,0.1,0.1,0.1v1.2c0,0.1,0,0.1-0.1,0.1H3.3c0,0-0.1-0.1-0.1-0.1V15
	C3.2,14.9,3.2,14.9,3.3,14.9z"/>
<path class="st2" d="M16.7,15.6h2.2c0,0,0.1,0.1,0.1,0.1V15c0-0.1,0-0.1-0.1-0.1h-2.2c0,0-0.1,0.1-0.1,0.1v0.8
	C16.6,15.7,16.6,15.6,16.7,15.6z"/>
<path class="st2" d="M13.8,15.6h2.2c0,0,0.1,0.1,0.1,0.1V15c0-0.1,0-0.1-0.1-0.1h-2.2c0,0-0.1,0.1-0.1,0.1v0.8
	C13.8,15.7,13.8,15.6,13.8,15.6z"/>
<path class="st2" d="M11,15.6h2.2c0,0,0.1,0.1,0.1,0.1V15c0-0.1,0-0.1-0.1-0.1H11c0,0-0.1,0.1-0.1,0.1v0.8
	C10.9,15.7,11,15.6,11,15.6z"/>
<path class="st2" d="M8.2,15.6h2.2c0,0,0.1,0.1,0.1,0.1V15c0-0.1,0-0.1-0.1-0.1H8.2c0,0-0.1,0.1-0.1,0.1v0.8
	C8.1,15.7,8.1,15.6,8.2,15.6z"/>
<path class="st2" d="M29.6,15.6h2.2c0,0,0.1,0.1,0.1,0.1V15c0-0.1,0-0.1-0.1-0.1h-2.2c0,0-0.1,0.1-0.1,0.1v0.8
	C29.5,15.7,29.5,15.6,29.6,15.6z"/>
<path class="st2" d="M26.8,15.6H29c0,0,0.1,0.1,0.1,0.1V15c0-0.1,0-0.1-0.1-0.1h-2.2c0,0-0.1,0.1-0.1,0.1v0.8
	C26.7,15.7,26.7,15.6,26.8,15.6z"/>
<path class="st2" d="M23.9,15.6h2.2c0,0,0.1,0.1,0.1,0.1V15c0-0.1,0-0.1-0.1-0.1h-2.2c0,0-0.1,0.1-0.1,0.1v0.8
	C23.8,15.7,23.9,15.6,23.9,15.6z"/>
<path class="st2" d="M21.1,15.6h2.2c0,0,0.1,0.1,0.1,0.1V15c0-0.1,0-0.1-0.1-0.1h-2.2c0,0-0.1,0.1-0.1,0.1v0.8
	C21,15.7,21,15.6,21.1,15.6z"/>
<path class="st2" d="M42.5,15.6h2.2c0,0,0.1,0.1,0.1,0.1V15c0-0.1,0-0.1-0.1-0.1h-2.2c0,0-0.1,0.1-0.1,0.1v0.8
	C42.4,15.7,42.5,15.6,42.5,15.6z"/>
<path class="st2" d="M39.7,15.6h2.2c0,0,0.1,0.1,0.1,0.1V15c0-0.1,0-0.1-0.1-0.1h-2.2c0,0-0.1,0.1-0.1,0.1v0.8
	C39.6,15.7,39.6,15.6,39.7,15.6z"/>
<path class="st2" d="M36.8,15.6H39c0,0,0.1,0.1,0.1,0.1V15c0-0.1,0-0.1-0.1-0.1h-2.2c0,0-0.1,0.1-0.1,0.1v0.8
	C36.8,15.7,36.8,15.6,36.8,15.6z"/>
<path class="st2" d="M34,15.6h2.2c0,0,0.1,0.1,0.1,0.1V15c0-0.1,0-0.1-0.1-0.1H34c0,0-0.1,0.1-0.1,0.1v0.8
	C33.9,15.7,34,15.6,34,15.6z"/>
<path class="st2" d="M3.3,15.6h2.2c0,0,0.1,0.1,0.1,0.1V15c0-0.1,0-0.1-0.1-0.1H3.3c0,0-0.1,0.1-0.1,0.1v0.8
	C3.2,15.7,3.2,15.6,3.3,15.6z"/>
<path class="st4" d="M14.6,33.1h-2.2c-0.1,0-0.1-0.1-0.1-0.1v0.8c0,0.1,0.1,0.1,0.1,0.1h2.2c0.1,0,0.1-0.1,0.1-0.1V33
	C14.7,33.1,14.6,33.1,14.6,33.1z"/>
<path class="st4" d="M11.6,33.1H9.4c-0.1,0-0.1-0.1-0.1-0.1v0.8c0,0.1,0.1,0.1,0.1,0.1h2.2c0.1,0,0.1-0.1,0.1-0.1V33
	C11.7,33.1,11.6,33.1,11.6,33.1C11.6,33.1,11.6,33.1,11.6,33.1z"/>
<path class="st4" d="M8.5,33.1H6.4c-0.1,0-0.1-0.1-0.1-0.1c0,0,0,0,0,0v0.8c0,0.1,0.1,0.1,0.1,0.1h2.2c0.1,0,0.1-0.1,0.1-0.1V33
	C8.7,33.1,8.6,33.1,8.5,33.1z"/>
<path class="st4" d="M5.5,33.1H3.3c-0.1,0-0.1-0.1-0.1-0.1v0.8c0,0.1,0.1,0.1,0.1,0.1h2.2c0.1,0,0.1-0.1,0.1-0.1V33
	C5.7,33.1,5.6,33.1,5.5,33.1z"/>
<path class="st4" d="M44.7,33.1h-2.2c-0.1,0-0.1-0.1-0.1-0.1v0.8c0,0.1,0.1,0.1,0.1,0.1h2.2c0.1,0,0.1-0.1,0.1-0.1V33
	C44.8,33.1,44.7,33.1,44.7,33.1z"/>
<path class="st4" d="M41.7,33.1h-2.2c-0.1,0-0.1-0.1-0.1-0.1v0.8c0,0.1,0.1,0.1,0.1,0.1h2.2c0.1,0,0.1-0.1,0.1-0.1V33
	C41.8,33.1,41.7,33.1,41.7,33.1z"/>
<path class="st4" d="M38.6,33.1h-2.2c-0.1,0-0.1-0.1-0.1-0.1v0.8c0,0.1,0.1,0.1,0.1,0.1h2.2c0.1,0,0.1-0.1,0.1-0.1V33
	C38.8,33.1,38.7,33.1,38.6,33.1z"/>
<path class="st4" d="M35.6,33.1h-2.2c-0.1,0-0.1-0.1-0.1-0.1v0.8c0,0.1,0.1,0.1,0.1,0.1h2.2c0.1,0,0.1-0.1,0.1-0.1V33
	C35.8,33.1,35.7,33.1,35.6,33.1z"/>
<path class="st4" d="M7.1,24.2C7.1,24.2,7.1,24.1,7.1,24.2v-0.8c0,0.1-0.1,0.1-0.1,0.1c0,0,0,0,0,0H3.3c-0.1,0-0.1-0.1-0.1-0.1l0,0
	v0.8c0,0,0,0.1,0,0.1L7.1,24.2L7.1,24.2z"/>
<path class="st4" d="M8.6,27.4L8.6,27.4v-0.8c0,0,0,0.1-0.1,0.1H3.3c0,0-0.1,0-0.1-0.1v0.8c0,0,0,0.1,0.1,0.1h0.1L8.6,27.4z"/>
<path class="st4" d="M9.9,30.7c0.1,0,0.1-0.1,0.1-0.1l0,0v-0.8c0,0.1-0.1,0.1-0.1,0.1h0H3.3c-0.1,0-0.1-0.1-0.1-0.1l0,0v0.8
	c0,0.1,0.1,0.1,0.1,0.1c0,0,0,0,0,0H9.9z"/>
<path class="st4" d="M44.7,30.7L44.7,30.7c0.1,0,0.1-0.1,0.1-0.1v-0.8c0,0.1-0.1,0.1-0.1,0.1h-6.5c-0.1,0-0.1-0.1-0.1-0.1v0.8
	c0,0.1,0.1,0.1,0.1,0.1l0,0L44.7,30.7L44.7,30.7z"/>
<path class="st4" d="M44.7,27.4c0.1,0,0.1-0.1,0.1-0.1v-0.8c0,0.1-0.1,0.2-0.2,0.2l0,0h-5c-0.1,0-0.2-0.1-0.2-0.2l0,0v0.8
	c0,0.1,0,0.1,0.1,0.1H44.7L44.7,27.4z"/>
<path class="st4" d="M16.7,17.1h2.2c0,0,0.1-0.1,0.1-0.1v-0.8c0,0.1,0,0.1-0.1,0.1h-2.3c0,0-0.1-0.1-0.1-0.1v0.8
	C16.6,17,16.6,17.1,16.7,17.1z"/>
<path class="st4" d="M13.8,17.1h2.2c0,0,0.1-0.1,0.1-0.1v-0.8c0,0.1,0,0.1-0.1,0.1h-2.2c0,0-0.1-0.1-0.1-0.1v0.8
	C13.8,17,13.8,17.1,13.8,17.1z"/>
<path class="st4" d="M11,17.1h2.2c0,0,0.1-0.1,0.1-0.1v-0.8c0,0.1,0,0.1-0.1,0.1H11c0,0-0.1-0.1-0.1-0.1v0.8
	C10.9,17,11,17.1,11,17.1z"/>
<path class="st4" d="M8.2,17.1h2.2c0,0,0.1-0.1,0.1-0.1v-0.8c0,0.1,0,0.1-0.1,0.1H8.2c0,0-0.1-0.1-0.1-0.1v0.8
	C8.1,17,8.1,17.1,8.2,17.1z"/>
<path class="st4" d="M29.6,17.1h2.2c0,0,0.1-0.1,0.1-0.1v-0.8c0,0.1,0,0.1-0.1,0.1h-2.2c0,0-0.1-0.1-0.1-0.1v0.8
	C29.5,17,29.5,17.1,29.6,17.1z"/>
<path class="st4" d="M26.8,17.1H29c0,0,0-0.1,0-0.1v-0.8c0,0.1,0,0.1-0.1,0.1h-2.2c0,0-0.1-0.1-0.1-0.1v0.8
	C26.7,17,26.7,17.1,26.8,17.1z"/>
<path class="st4" d="M23.9,17.1h2.2c0,0,0.1-0.1,0.1-0.1v-0.8c0,0.1,0,0.1-0.1,0.1h-2.2c0,0-0.1-0.1-0.1-0.1v0.8
	C23.8,17,23.9,17.1,23.9,17.1z"/>
<path class="st4" d="M21.1,17.1h2.2c0,0,0.1-0.1,0.1-0.1v-0.8c0,0.1,0,0.1-0.1,0.1h-2.2c0,0-0.1-0.1-0.1-0.1v0.8
	C21,17,21,17.1,21.1,17.1z"/>
<path class="st4" d="M42.5,17.1h2.2c0,0,0.1-0.1,0.1-0.1v-0.8c0,0.1,0,0.1-0.1,0.1h-2.2c0,0-0.1-0.1-0.1-0.1v0.8
	C42.4,17,42.5,17.1,42.5,17.1z"/>
<path class="st4" d="M39.7,17.1h2.2c0,0,0.1-0.1,0.1-0.1v-0.8c0,0.1,0,0.1-0.1,0.1h-2.3c0,0-0.1-0.1-0.1-0.1v0.8
	C39.6,17,39.6,17.1,39.7,17.1z"/>
<path class="st4" d="M36.8,17.1H39c0,0,0.1-0.1,0.1-0.1v-0.8c0,0.1,0,0.1-0.1,0.1h-2.2c0,0-0.1-0.1-0.1-0.1v0.8
	C36.8,17,36.8,17.1,36.8,17.1z"/>
<path class="st4" d="M34,17.1h2.2c0,0,0.1-0.1,0.1-0.1v-0.8c0,0.1,0,0.1-0.1,0.1H34c0,0-0.1-0.1-0.1-0.1v0.8
	C33.9,17,34,17.1,34,17.1z"/>
<path class="st4" d="M3.3,17.1h2.2c0,0,0.1-0.1,0.1-0.1v-0.8c0,0.1,0,0.1-0.1,0.1H3.3c0,0-0.1-0.1-0.1-0.1v0.8
	C3.2,17,3.2,17.1,3.3,17.1z"/>
<path class="st4" d="M44.7,21c0.1,0,0.1-0.1,0.1-0.1v-0.8c0,0.1-0.1,0.1-0.1,0.1h-2.2c-0.1,0-0.1-0.1-0.1-0.1v0.8c0,0,0,0.1,0.1,0.1
	L44.7,21L44.7,21z"/>
<path class="st4" d="M40.1,21h1.2c0,0,0.1,0,0.1,0h0.3c0,0,0.1-0.1,0.1-0.1v-0.8c0,0.1-0.1,0.1-0.1,0.1h-2.2c-0.1,0-0.1-0.1-0.1-0.1
	v0.8c0,0.1,0,0.1,0.1,0.1L40.1,21L40.1,21z"/>
<path class="st4" d="M37.1,21h1.5c0.1,0,0.1-0.1,0.1-0.1v-0.8c0,0.1-0.1,0.1-0.1,0.1h-2.2c-0.1,0-0.1-0.1-0.1-0.1v0.8
	c0,0.1,0,0.1,0.1,0.1H37.1L37.1,21z"/>
<path class="st4" d="M34.1,21h1.5c0.1,0,0.1-0.1,0.1-0.1v-0.8c0,0.1-0.1,0.1-0.1,0.1h-2.2c-0.1,0-0.1-0.1-0.1-0.1v0.8
	c0,0.1,0,0.1,0.1,0.1H34.1z"/>
<path class="st4" d="M31.1,21h1.5c0.1,0,0.1-0.1,0.1-0.1v-0.8c0,0.1-0.1,0.1-0.1,0.1h-2.2c-0.1,0-0.1-0.1-0.1-0.1v0.8
	c0,0.1,0,0.1,0.1,0.1C30.4,21,31.1,21,31.1,21z"/>
<path class="st4" d="M28.1,21h1.5c0.1,0,0.1-0.1,0.1-0.1v-0.8c0,0.1-0.1,0.1-0.1,0.1h-2.2c-0.1,0-0.1-0.1-0.1-0.1v0.8
	c0,0.1,0,0.1,0.1,0.1H28.1L28.1,21z"/>
<path class="st4" d="M25.1,21h1.5c0.1,0,0.1-0.1,0.1-0.1v-0.8c0,0.1-0.1,0.1-0.1,0.1h-2.2c-0.1,0-0.1-0.1-0.1-0.1v0.8
	c0,0.1,0,0.1,0.1,0.1H25.1z"/>
<path class="st4" d="M22.1,21h1.5c0.1,0,0.1-0.1,0.1-0.1v-0.8c0,0.1-0.1,0.1-0.1,0.1h-2.2c-0.1,0-0.1-0.1-0.1-0.1v0.8
	c0,0.1,0,0.1,0.1,0.1H22.1L22.1,21z"/>
<path class="st4" d="M19.1,21h1.5c0.1,0,0.1-0.1,0.1-0.1v-0.8c0,0.1-0.1,0.1-0.1,0.1h-2.2c-0.1,0-0.1-0.1-0.1-0.1v0.8
	c0,0.1,0,0.1,0.1,0.1H19.1z"/>
<path class="st4" d="M16.1,21h1.5c0.1,0,0.1-0.1,0.1-0.1v-0.8c0,0.1-0.1,0.1-0.1,0.1h-2.2c-0.1,0-0.1-0.1-0.1-0.1v0.8
	c0,0.1,0,0.1,0.1,0.1C15.4,21,16.1,21,16.1,21z"/>
<path class="st4" d="M13.1,21h1.5c0.1,0,0.1-0.1,0.1-0.1v-0.8c0,0.1-0.1,0.1-0.1,0.1h-2.2c-0.1,0-0.1-0.1-0.1-0.1v0.8
	c0,0.1,0,0.1,0.1,0.1H13.1L13.1,21z"/>
<path class="st4" d="M10.1,21h1.5c0.1,0,0.1-0.1,0.1-0.1v-0.8c0,0.1-0.1,0.1-0.1,0.1H9.4c-0.1,0-0.1-0.1-0.1-0.1v0.8
	c0,0.1,0,0.1,0.1,0.1C9.4,21,10.1,21,10.1,21z"/>
<path class="st4" d="M7.1,21h1.5c0.1,0,0.1-0.1,0.1-0.1v-0.8c0,0.1-0.1,0.1-0.1,0.1H6.4c-0.1,0-0.1-0.1-0.1-0.1v0.8
	c0,0.1,0,0.1,0.1,0.1L7.1,21C7,21,7.1,21,7.1,21z"/>
<path class="st4" d="M5.6,21c0,0,0.1-0.1,0.1-0.1v-0.8c0,0.1-0.1,0.1-0.1,0.1H3.4c-0.1,0-0.1-0.1-0.1-0.1v0.8c0,0.1,0,0.1,0.1,0.1
	H5.6z"/>
<path class="st4" d="M40.2,24.2c0.1,0,0.1-0.1,0.1-0.1v-0.8c0,0.1-0.1,0.1-0.1,0.1h-2.2c-0.1,0-0.1-0.1-0.1-0.1v0.8
	c0,0.1,0.1,0.1,0.1,0.1h1.6h0L40.2,24.2z"/>
<path class="st4" d="M37.2,24.1v-0.8c0,0.1-0.1,0.1-0.1,0.1h-2.2c-0.1,0-0.1-0.1-0.1-0.1v0.8c0,0.1,0.1,0.1,0.1,0.1h2.2
	C37.2,24.2,37.2,24.1,37.2,24.1L37.2,24.1z"/>
<path class="st4" d="M34.2,24.1v-0.8c0,0.1-0.1,0.1-0.1,0.1h-2.2c-0.1,0-0.1-0.1-0.1-0.1v0.8c0,0.1,0.1,0.1,0.1,0.1h2.2
	C34.2,24.2,34.2,24.1,34.2,24.1z"/>
<path class="st4" d="M31.2,24.1v-0.8c0,0.1-0.1,0.1-0.1,0.1h-2.2c-0.1,0-0.1-0.1-0.1-0.1v0.8c0,0.1,0.1,0.1,0.1,0.1h2.2
	C31.2,24.2,31.2,24.1,31.2,24.1z"/>
<path class="st4" d="M28.2,24.1v-0.8c0,0.1-0.1,0.1-0.1,0.1h-2.2c-0.1,0-0.1-0.1-0.1-0.1v0.8c0,0.1,0.1,0.1,0.1,0.1h2.2
	C28.2,24.2,28.2,24.1,28.2,24.1z"/>
<path class="st4" d="M25.2,24.1v-0.8c0,0.1-0.1,0.1-0.1,0.1h-2.2c-0.1,0-0.1-0.1-0.1-0.1v0.8c0,0.1,0.1,0.1,0.1,0.1h2.2
	C25.2,24.2,25.2,24.1,25.2,24.1z"/>
<path class="st4" d="M22.2,24.1v-0.8c0,0.1-0.1,0.1-0.1,0.1h-2.2c-0.1,0-0.1-0.1-0.1-0.1v0.8c0,0.1,0.1,0.1,0.1,0.1h2.2
	C22.2,24.2,22.2,24.1,22.2,24.1z"/>
<path class="st4" d="M19.2,24.1v-0.8c0,0.1-0.1,0.1-0.1,0.1h-2.2c-0.1,0-0.1-0.1-0.1-0.1v0.8c0,0.1,0.1,0.1,0.1,0.1h2.2
	C19.2,24.2,19.2,24.1,19.2,24.1z"/>
<path class="st4" d="M16.2,24.1v-0.8c0,0.1-0.1,0.1-0.1,0.1h-2.2c-0.1,0-0.1-0.1-0.1-0.1v0.8c0,0.1,0.1,0.1,0.1,0.1h2.2
	C16.2,24.2,16.2,24.2,16.2,24.1C16.2,24.1,16.2,24.1,16.2,24.1z"/>
<path class="st4" d="M13.2,24.1v-0.8c0,0.1-0.1,0.1-0.1,0.1h-2.2c-0.1,0-0.1-0.1-0.1-0.1v0.8c0,0.1,0.1,0.1,0.1,0.1h2.2
	C13.2,24.2,13.2,24.1,13.2,24.1z"/>
<path class="st4" d="M8.6,24.2h1.5c0.1,0,0.1-0.1,0.1-0.1v-0.8c0,0.1-0.1,0.1-0.1,0.1H7.9c-0.1,0-0.1-0.1-0.1-0.1v0.8
	c0,0.1,0,0.1,0.1,0.1L8.6,24.2L8.6,24.2z"/>
<path class="st4" d="M37.1,27.5H38c0,0,0.1,0,0.1,0h0.6c0,0,0.1-0.1,0.1-0.1v-0.8c0,0.1-0.1,0.1-0.1,0.1h-2.2
	c-0.1,0-0.1-0.1-0.1-0.1v0.8c0,0.1,0.1,0.1,0.1,0.1L37.1,27.5L37.1,27.5z"/>
<path class="st4" d="M34.1,27.5h1.5c0.1,0,0.1-0.1,0.1-0.1v-0.8c0,0.1-0.1,0.1-0.1,0.1h-2.2c-0.1,0-0.1-0.1-0.1-0.1v0.8
	c0,0.1,0.1,0.1,0.1,0.1C33.4,27.5,34.1,27.5,34.1,27.5z"/>
<path class="st4" d="M31.1,27.5h1.5c0.1,0,0.1-0.1,0.1-0.1v-0.8c0,0.1-0.1,0.1-0.1,0.1h-2.2c-0.1,0-0.1-0.1-0.1-0.1v0.8
	c0,0.1,0.1,0.1,0.1,0.1H31.1L31.1,27.5z"/>
<path class="st4" d="M28.1,27.5h1.5c0.1,0,0.1-0.1,0.1-0.1v-0.8c0,0.1-0.1,0.1-0.1,0.1h-2.2c-0.1,0-0.1-0.1-0.1-0.1v0.8
	c0,0.1,0.1,0.1,0.1,0.1H28.1z"/>
<path class="st4" d="M25.1,27.5h1.5c0.1,0,0.1-0.1,0.1-0.1v-0.8c0,0.1-0.1,0.1-0.1,0.1h-2.2c-0.1,0-0.1-0.1-0.1-0.1v0.8
	c0,0.1,0.1,0.1,0.1,0.1H25.1z"/>
<path class="st4" d="M22.1,27.5h1.5c0.1,0,0.1-0.1,0.1-0.1v-0.8c0,0.1-0.1,0.1-0.1,0.1h-2.2c-0.1,0-0.1-0.1-0.1-0.1v0.8
	c0,0.1,0.1,0.1,0.1,0.1H22.1z"/>
<path class="st4" d="M19.1,27.5h1.5c0.1,0,0.1-0.1,0.1-0.1v-0.8c0,0.1-0.1,0.1-0.1,0.1h-2.2c-0.1,0-0.1-0.1-0.1-0.1v0.8
	c0,0.1,0.1,0.1,0.1,0.1H19.1z"/>
<path class="st4" d="M16.1,27.5h1.5c0.1,0,0.1-0.1,0.1-0.1v-0.8c0,0.1-0.1,0.1-0.1,0.1h-2.2c-0.1,0-0.1-0.1-0.1-0.1v0.8
	c0,0.1,0.1,0.1,0.1,0.1H16.1z"/>
<path class="st4" d="M13.1,27.5h1.5c0.1,0,0.1-0.1,0.1-0.1v-0.8c0,0.1-0.1,0.1-0.1,0.1h-2.2c-0.1,0-0.1-0.1-0.1-0.1v0.8
	c0,0.1,0.1,0.1,0.1,0.1H13.1z"/>
<path class="st4" d="M10,27.5h1.6c0.1,0,0.1-0.1,0.1-0.1v-0.8c0,0.1-0.1,0.1-0.1,0.1H9.4c-0.1,0-0.1-0.1-0.1-0.1v0.8
	c0,0,0,0.1,0.1,0.1h0.6C9.9,27.4,10,27.4,10,27.5z"/>
<path class="st4" d="M37.1,30.7c0.1,0,0.1-0.1,0.1-0.1v-0.8c0,0.1-0.1,0.1-0.1,0.1h-2.2c-0.1,0-0.1-0.1-0.1-0.1v0.8
	c0,0.1,0.1,0.1,0.1,0.1C34.9,30.7,37.1,30.7,37.1,30.7z"/>
<path class="st4" d="M34.1,30.7c0.1,0,0.1-0.1,0.1-0.1v-0.8c0,0.1-0.1,0.1-0.1,0.1h-2.2c-0.1,0-0.1-0.1-0.1-0.1v0.8
	c0,0,0,0.1,0.1,0.1h0.6c0,0,0.1,0,0.1,0L34.1,30.7L34.1,30.7z"/>
<path class="st4" d="M31.2,30.5v-0.8c0,0.1-0.1,0.1-0.1,0.1h-2.2c-0.1,0-0.1-0.1-0.1-0.1v0.8c0,0,0,0.1,0.1,0.1h2.4
	C31.2,30.6,31.2,30.6,31.2,30.5z"/>
<path class="st4" d="M28.2,30.5v-0.8c0,0.1-0.1,0.1-0.1,0.1h-2.2c-0.1,0-0.1-0.1-0.1-0.1v0.8c0,0,0,0.1,0.1,0.1h2.4
	C28.2,30.6,28.2,30.6,28.2,30.5z"/>
<path class="st4" d="M25.2,30.5v-0.8c0,0.1-0.1,0.1-0.1,0.1h-2.2c-0.1,0-0.1-0.1-0.1-0.1v0.8c0,0,0,0.1,0.1,0.1h2.4
	C25.2,30.6,25.2,30.6,25.2,30.5z"/>
<path class="st4" d="M22.2,30.5v-0.8c0,0.1-0.1,0.1-0.1,0.1h-2.2c-0.1,0-0.1-0.1-0.1-0.1v0.8c0,0,0,0.1,0.1,0.1h2.4
	C22.2,30.6,22.2,30.6,22.2,30.5z"/>
<path class="st4" d="M19.2,30.5v-0.8c0,0.1-0.1,0.1-0.1,0.1h-2.2c-0.1,0-0.1-0.1-0.1-0.1v0.8c0,0,0,0.1,0.1,0.1h2.4
	C19.2,30.6,19.2,30.6,19.2,30.5z"/>
<path class="st4" d="M16.2,30.6c0,0,0.1-0.1,0.1-0.1v-0.8c0,0.1-0.1,0.1-0.1,0.1h-2.2c-0.1,0-0.1-0.1-0.1-0.1v0.8
	c0,0.1,0.1,0.1,0.1,0.1h1.6c0,0,0.1,0,0.1,0L16.2,30.6z"/>
<path class="st4" d="M13.1,30.7c0.1,0,0.1-0.1,0.1-0.1v-0.8c0,0.1-0.1,0.1-0.1,0.1h-2.2c-0.1,0-0.1-0.1-0.1-0.1v0.8
	c0,0.1,0.1,0.1,0.1,0.1H13.1z"/>
<path class="st4" d="M32.5,33.1H15.5c-0.1,0-0.1-0.1-0.1-0.1l0,0v0.8c0,0.1,0.1,0.1,0.1,0.1h0h16.9c0.1,0,0.1-0.1,0.1-0.1
	c0,0,0,0,0,0V33C32.6,33.1,32.6,33.1,32.5,33.1C32.5,33.1,32.5,33.1,32.5,33.1z"/>
<linearGradient id="SVGID_30_" gradientUnits="userSpaceOnUse" x1="43.525" y1="17.29" x2="43.525" y2="20.13" gradientTransform="matrix(1 0 0 -1 0 37.73)">
	<stop  offset="0" style="stop-color:#1A1A1A"/>
	<stop  offset="1" style="stop-color:#595959"/>
</linearGradient>
<path class="st34" d="M42.4,17.6h2.2c0.2,0,0.3,0.1,0.3,0.3v2.2c0,0.2-0.1,0.3-0.3,0.3h-2.2c-0.2,0-0.3-0.1-0.3-0.3v-2.2
	C42.1,17.7,42.3,17.6,42.4,17.6z"/>
<linearGradient id="SVGID_31_" gradientUnits="userSpaceOnUse" x1="40.525" y1="17.29" x2="40.525" y2="20.13" gradientTransform="matrix(1 0 0 -1 0 37.73)">
	<stop  offset="0" style="stop-color:#1A1A1A"/>
	<stop  offset="1" style="stop-color:#595959"/>
</linearGradient>
<path class="st35" d="M39.4,17.6h2.2c0.2,0,0.3,0.1,0.3,0.3v2.2c0,0.2-0.1,0.3-0.3,0.3h-2.2c-0.2,0-0.3-0.1-0.3-0.3v-2.2
	C39.1,17.7,39.3,17.6,39.4,17.6z"/>
<linearGradient id="SVGID_32_" gradientUnits="userSpaceOnUse" x1="37.515" y1="17.29" x2="37.515" y2="20.13" gradientTransform="matrix(1 0 0 -1 0 37.73)">
	<stop  offset="0" style="stop-color:#1A1A1A"/>
	<stop  offset="1" style="stop-color:#595959"/>
</linearGradient>
<path class="st36" d="M36.4,17.6h2.2c0.2,0,0.3,0.1,0.3,0.3v2.2c0,0.2-0.1,0.3-0.3,0.3h-2.2c-0.2,0-0.3-0.1-0.3-0.3v-2.2
	C36.1,17.7,36.2,17.6,36.4,17.6z"/>
<linearGradient id="SVGID_33_" gradientUnits="userSpaceOnUse" x1="34.515" y1="17.29" x2="34.515" y2="20.13" gradientTransform="matrix(1 0 0 -1 0 37.73)">
	<stop  offset="0" style="stop-color:#1A1A1A"/>
	<stop  offset="1" style="stop-color:#595959"/>
</linearGradient>
<path class="st37" d="M33.4,17.6h2.2c0.2,0,0.3,0.1,0.3,0.3v2.2c0,0.2-0.1,0.3-0.3,0.3h-2.2c-0.2,0-0.3-0.1-0.3-0.3v-2.2
	C33.1,17.7,33.2,17.6,33.4,17.6z"/>
<linearGradient id="SVGID_34_" gradientUnits="userSpaceOnUse" x1="31.505" y1="17.29" x2="31.505" y2="20.13" gradientTransform="matrix(1 0 0 -1 0 37.73)">
	<stop  offset="0" style="stop-color:#1A1A1A"/>
	<stop  offset="1" style="stop-color:#595959"/>
</linearGradient>
<path class="st38" d="M30.4,17.6h2.2c0.2,0,0.3,0.1,0.3,0.3v2.2c0,0.2-0.1,0.3-0.3,0.3h-2.2c-0.2,0-0.3-0.1-0.3-0.3v-2.2
	C30.1,17.7,30.2,17.6,30.4,17.6z"/>
<linearGradient id="SVGID_35_" gradientUnits="userSpaceOnUse" x1="28.505" y1="17.29" x2="28.505" y2="20.13" gradientTransform="matrix(1 0 0 -1 0 37.73)">
	<stop  offset="0" style="stop-color:#1A1A1A"/>
	<stop  offset="1" style="stop-color:#595959"/>
</linearGradient>
<path class="st39" d="M27.4,17.6h2.2c0.2,0,0.3,0.1,0.3,0.3v2.2c0,0.2-0.1,0.3-0.3,0.3h-2.2c-0.2,0-0.3-0.1-0.3-0.3v-2.2
	C27.1,17.7,27.2,17.6,27.4,17.6z"/>
<linearGradient id="SVGID_36_" gradientUnits="userSpaceOnUse" x1="25.505" y1="17.29" x2="25.505" y2="20.13" gradientTransform="matrix(1 0 0 -1 0 37.73)">
	<stop  offset="0" style="stop-color:#1A1A1A"/>
	<stop  offset="1" style="stop-color:#595959"/>
</linearGradient>
<path class="st40" d="M24.4,17.6h2.2c0.2,0,0.3,0.1,0.3,0.3v2.2c0,0.2-0.1,0.3-0.3,0.3h-2.2c-0.2,0-0.3-0.1-0.3-0.3v-2.2
	C24.1,17.7,24.2,17.6,24.4,17.6z"/>
<linearGradient id="SVGID_37_" gradientUnits="userSpaceOnUse" x1="22.495" y1="17.29" x2="22.495" y2="20.13" gradientTransform="matrix(1 0 0 -1 0 37.73)">
	<stop  offset="0" style="stop-color:#1A1A1A"/>
	<stop  offset="1" style="stop-color:#595959"/>
</linearGradient>
<path class="st41" d="M21.4,17.6h2.2c0.2,0,0.3,0.1,0.3,0.3v2.2c0,0.2-0.1,0.3-0.3,0.3h-2.2c-0.2,0-0.3-0.1-0.3-0.3v-2.2
	C21.1,17.7,21.2,17.6,21.4,17.6z"/>
<linearGradient id="SVGID_38_" gradientUnits="userSpaceOnUse" x1="19.495" y1="17.29" x2="19.495" y2="20.13" gradientTransform="matrix(1 0 0 -1 0 37.73)">
	<stop  offset="0" style="stop-color:#1A1A1A"/>
	<stop  offset="1" style="stop-color:#595959"/>
</linearGradient>
<path class="st42" d="M18.4,17.6h2.2c0.2,0,0.3,0.1,0.3,0.3v2.2c0,0.2-0.1,0.3-0.3,0.3h-2.2c-0.2,0-0.3-0.1-0.3-0.3v-2.2
	C18.1,17.7,18.2,17.6,18.4,17.6z"/>
<linearGradient id="SVGID_39_" gradientUnits="userSpaceOnUse" x1="16.485" y1="17.29" x2="16.485" y2="20.13" gradientTransform="matrix(1 0 0 -1 0 37.73)">
	<stop  offset="0" style="stop-color:#1A1A1A"/>
	<stop  offset="1" style="stop-color:#595959"/>
</linearGradient>
<path class="st43" d="M15.4,17.6h2.2c0.2,0,0.3,0.1,0.3,0.3v2.2c0,0.2-0.1,0.3-0.3,0.3h-2.2c-0.2,0-0.3-0.1-0.3-0.3v-2.2
	C15.1,17.7,15.2,17.6,15.4,17.6z"/>
<linearGradient id="SVGID_40_" gradientUnits="userSpaceOnUse" x1="13.485" y1="17.29" x2="13.485" y2="20.13" gradientTransform="matrix(1 0 0 -1 0 37.73)">
	<stop  offset="0" style="stop-color:#1A1A1A"/>
	<stop  offset="1" style="stop-color:#595959"/>
</linearGradient>
<path class="st44" d="M12.4,17.6h2.2c0.2,0,0.3,0.1,0.3,0.3v2.2c0,0.2-0.1,0.3-0.3,0.3h-2.2c-0.2,0-0.3-0.1-0.3-0.3v-2.2
	C12.1,17.7,12.2,17.6,12.4,17.6z"/>
<linearGradient id="SVGID_41_" gradientUnits="userSpaceOnUse" x1="10.485" y1="17.29" x2="10.485" y2="20.13" gradientTransform="matrix(1 0 0 -1 0 37.73)">
	<stop  offset="0" style="stop-color:#1A1A1A"/>
	<stop  offset="1" style="stop-color:#595959"/>
</linearGradient>
<path class="st45" d="M9.4,17.6h2.2c0.2,0,0.3,0.1,0.3,0.3v2.2c0,0.2-0.1,0.3-0.3,0.3H9.4c-0.2,0-0.3-0.1-0.3-0.3v-2.2
	C9.1,17.7,9.2,17.6,9.4,17.6z"/>
<linearGradient id="SVGID_42_" gradientUnits="userSpaceOnUse" x1="7.475" y1="17.29" x2="7.475" y2="20.13" gradientTransform="matrix(1 0 0 -1 0 37.73)">
	<stop  offset="0" style="stop-color:#1A1A1A"/>
	<stop  offset="1" style="stop-color:#595959"/>
</linearGradient>
<path class="st46" d="M6.4,17.6h2.2c0.2,0,0.3,0.1,0.3,0.3v2.2c0,0.2-0.1,0.3-0.3,0.3H6.4c-0.2,0-0.3-0.1-0.3-0.3v-2.2
	C6.1,17.7,6.2,17.6,6.4,17.6z"/>
<linearGradient id="SVGID_43_" gradientUnits="userSpaceOnUse" x1="4.475" y1="17.29" x2="4.475" y2="20.13" gradientTransform="matrix(1 0 0 -1 0 37.73)">
	<stop  offset="0" style="stop-color:#1A1A1A"/>
	<stop  offset="1" style="stop-color:#595959"/>
</linearGradient>
<path class="st47" d="M3.4,17.6h2.2c0.2,0,0.3,0.1,0.3,0.3v2.2c0,0.2-0.1,0.3-0.3,0.3H3.4c-0.2,0-0.3-0.1-0.3-0.3v-2.2
	C3.1,17.7,3.2,17.6,3.4,17.6z"/>
<linearGradient id="SVGID_44_" gradientUnits="userSpaceOnUse" x1="42.29" y1="18.715" x2="44.76" y2="18.715" gradientTransform="matrix(1 0 0 -1 0 37.73)">
	<stop  offset="0" style="stop-color:#CCCCCC"/>
	<stop  offset="1" style="stop-color:#F7F7F7"/>
</linearGradient>
<path class="st48" d="M42.4,17.8h2.2c0.1,0,0.1,0.1,0.1,0.1v2.2c0,0.1-0.1,0.1-0.1,0.1h-2.2c-0.1,0-0.1-0.1-0.1-0.1v-2.2
	C42.3,17.8,42.4,17.8,42.4,17.8z"/>
<linearGradient id="SVGID_45_" gradientUnits="userSpaceOnUse" x1="39.28" y1="18.715" x2="41.76" y2="18.715" gradientTransform="matrix(1 0 0 -1 0 37.73)">
	<stop  offset="0" style="stop-color:#CCCCCC"/>
	<stop  offset="1" style="stop-color:#F7F7F7"/>
</linearGradient>
<path class="st49" d="M39.4,17.8h2.2c0.1,0,0.1,0.1,0.1,0.1v2.2c0,0.1-0.1,0.1-0.1,0.1h-2.2c-0.1,0-0.1-0.1-0.1-0.1v-2.2
	C39.3,17.8,39.3,17.8,39.4,17.8z"/>
<linearGradient id="SVGID_46_" gradientUnits="userSpaceOnUse" x1="36.28" y1="18.715" x2="38.75" y2="18.715" gradientTransform="matrix(1 0 0 -1 0 37.73)">
	<stop  offset="0" style="stop-color:#CCCCCC"/>
	<stop  offset="1" style="stop-color:#F7F7F7"/>
</linearGradient>
<path class="st50" d="M36.4,17.8h2.2c0.1,0,0.1,0.1,0.1,0.1v2.2c0,0.1-0.1,0.1-0.1,0.1h-2.2c-0.1,0-0.1-0.1-0.1-0.1v-2.2
	C36.3,17.8,36.3,17.8,36.4,17.8z"/>
<linearGradient id="SVGID_47_" gradientUnits="userSpaceOnUse" x1="33.28" y1="18.715" x2="35.75" y2="18.715" gradientTransform="matrix(1 0 0 -1 0 37.73)">
	<stop  offset="0" style="stop-color:#CCCCCC"/>
	<stop  offset="1" style="stop-color:#F7F7F7"/>
</linearGradient>
<path class="st51" d="M33.4,17.8h2.2c0.1,0,0.1,0.1,0.1,0.1v2.2c0,0.1-0.1,0.1-0.1,0.1h-2.2c-0.1,0-0.1-0.1-0.1-0.1v-2.2
	C33.3,17.8,33.3,17.8,33.4,17.8z"/>
<linearGradient id="SVGID_48_" gradientUnits="userSpaceOnUse" x1="30.27" y1="18.715" x2="32.75" y2="18.715" gradientTransform="matrix(1 0 0 -1 0 37.73)">
	<stop  offset="0" style="stop-color:#CCCCCC"/>
	<stop  offset="1" style="stop-color:#F7F7F7"/>
</linearGradient>
<path class="st52" d="M30.4,17.8h2.2c0.1,0,0.1,0.1,0.1,0.1v2.2c0,0.1-0.1,0.1-0.1,0.1h-2.2c-0.1,0-0.1-0.1-0.1-0.1v-2.2
	C30.3,17.8,30.3,17.8,30.4,17.8z"/>
<linearGradient id="SVGID_49_" gradientUnits="userSpaceOnUse" x1="27.27" y1="18.715" x2="29.74" y2="18.715" gradientTransform="matrix(1 0 0 -1 0 37.73)">
	<stop  offset="0" style="stop-color:#CCCCCC"/>
	<stop  offset="1" style="stop-color:#F7F7F7"/>
</linearGradient>
<path class="st53" d="M27.4,17.8h2.2c0.1,0,0.1,0.1,0.1,0.1v2.2c0,0.1-0.1,0.1-0.1,0.1h-2.2c-0.1,0-0.1-0.1-0.1-0.1v-2.2
	C27.3,17.8,27.3,17.8,27.4,17.8z"/>
<linearGradient id="SVGID_50_" gradientUnits="userSpaceOnUse" x1="24.27" y1="18.715" x2="26.74" y2="18.715" gradientTransform="matrix(1 0 0 -1 0 37.73)">
	<stop  offset="0" style="stop-color:#CCCCCC"/>
	<stop  offset="1" style="stop-color:#F7F7F7"/>
</linearGradient>
<path class="st54" d="M24.4,17.8h2.2c0.1,0,0.1,0.1,0.1,0.1v2.2c0,0.1-0.1,0.1-0.1,0.1h-2.2c-0.1,0-0.1-0.1-0.1-0.1v-2.2
	C24.3,17.8,24.3,17.8,24.4,17.8z"/>
<linearGradient id="SVGID_51_" gradientUnits="userSpaceOnUse" x1="21.26" y1="18.715" x2="23.74" y2="18.715" gradientTransform="matrix(1 0 0 -1 0 37.73)">
	<stop  offset="0" style="stop-color:#CCCCCC"/>
	<stop  offset="1" style="stop-color:#F7F7F7"/>
</linearGradient>
<path class="st55" d="M21.4,17.8h2.2c0.1,0,0.1,0.1,0.1,0.1v2.2c0,0.1-0.1,0.1-0.1,0.1h-2.2c-0.1,0-0.1-0.1-0.1-0.1v-2.2
	C21.3,17.8,21.3,17.8,21.4,17.8z"/>
<linearGradient id="SVGID_52_" gradientUnits="userSpaceOnUse" x1="18.26" y1="18.715" x2="20.73" y2="18.715" gradientTransform="matrix(1 0 0 -1 0 37.73)">
	<stop  offset="0" style="stop-color:#CCCCCC"/>
	<stop  offset="1" style="stop-color:#F7F7F7"/>
</linearGradient>
<path class="st56" d="M18.4,17.8h2.2c0.1,0,0.1,0.1,0.1,0.1v2.2c0,0.1-0.1,0.1-0.1,0.1h-2.2c-0.1,0-0.1-0.1-0.1-0.1v-2.2
	C18.3,17.8,18.3,17.8,18.4,17.8z"/>
<linearGradient id="SVGID_53_" gradientUnits="userSpaceOnUse" x1="15.25" y1="18.715" x2="17.73" y2="18.715" gradientTransform="matrix(1 0 0 -1 0 37.73)">
	<stop  offset="0" style="stop-color:#CCCCCC"/>
	<stop  offset="1" style="stop-color:#F7F7F7"/>
</linearGradient>
<path class="st57" d="M15.4,17.8h2.2c0.1,0,0.1,0.1,0.1,0.1v2.2c0,0.1-0.1,0.1-0.1,0.1h-2.2c-0.1,0-0.1-0.1-0.1-0.1v-2.2
	C15.2,17.8,15.3,17.8,15.4,17.8z"/>
<linearGradient id="SVGID_54_" gradientUnits="userSpaceOnUse" x1="12.25" y1="18.715" x2="14.72" y2="18.715" gradientTransform="matrix(1 0 0 -1 0 37.73)">
	<stop  offset="0" style="stop-color:#CCCCCC"/>
	<stop  offset="1" style="stop-color:#F7F7F7"/>
</linearGradient>
<path class="st58" d="M12.4,17.8h2.2c0.1,0,0.1,0.1,0.1,0.1v2.2c0,0.1-0.1,0.1-0.1,0.1h-2.2c-0.1,0-0.1-0.1-0.1-0.1v-2.2
	C12.2,17.8,12.3,17.8,12.4,17.8z"/>
<linearGradient id="SVGID_55_" gradientUnits="userSpaceOnUse" x1="9.25" y1="18.715" x2="11.72" y2="18.715" gradientTransform="matrix(1 0 0 -1 0 37.73)">
	<stop  offset="0" style="stop-color:#CCCCCC"/>
	<stop  offset="1" style="stop-color:#F7F7F7"/>
</linearGradient>
<path class="st59" d="M9.4,17.8h2.2c0.1,0,0.1,0.1,0.1,0.1v2.2c0,0.1-0.1,0.1-0.1,0.1H9.4c-0.1,0-0.1-0.1-0.1-0.1v-2.2
	C9.2,17.8,9.3,17.8,9.4,17.8z"/>
<linearGradient id="SVGID_56_" gradientUnits="userSpaceOnUse" x1="6.24" y1="18.715" x2="8.72" y2="18.715" gradientTransform="matrix(1 0 0 -1 0 37.73)">
	<stop  offset="0" style="stop-color:#CCCCCC"/>
	<stop  offset="1" style="stop-color:#F7F7F7"/>
</linearGradient>
<path class="st60" d="M6.4,17.8h2.2c0.1,0,0.1,0.1,0.1,0.1v2.2c0,0.1-0.1,0.1-0.1,0.1H6.4c-0.1,0-0.1-0.1-0.1-0.1v-2.2
	C6.2,17.8,6.3,17.8,6.4,17.8z"/>
<linearGradient id="SVGID_57_" gradientUnits="userSpaceOnUse" x1="3.24" y1="18.715" x2="5.71" y2="18.715" gradientTransform="matrix(1 0 0 -1 0 37.73)">
	<stop  offset="0" style="stop-color:#CCCCCC"/>
	<stop  offset="1" style="stop-color:#F7F7F7"/>
</linearGradient>
<path class="st61" d="M3.4,17.8h2.2c0.1,0,0.1,0.1,0.1,0.1v2.2c0,0.1-0.1,0.1-0.1,0.1H3.4c-0.1,0-0.1-0.1-0.1-0.1v-2.2
	C3.2,17.8,3.3,17.8,3.4,17.8z"/>
<path class="st2" d="M42.4,18.5h2.2c0.1,0,0.1,0.1,0.1,0.1v-0.8c0-0.1-0.1-0.1-0.1-0.1h-2.2c-0.1,0-0.1,0.1-0.1,0.1v0.8
	C42.3,18.6,42.4,18.5,42.4,18.5z"/>
<path class="st2" d="M39.4,18.5h2.2c0.1,0,0.1,0.1,0.1,0.1v-0.8c0-0.1-0.1-0.1-0.1-0.1h-2.2c-0.1,0-0.1,0.1-0.1,0.1v0.8
	C39.3,18.6,39.4,18.5,39.4,18.5z"/>
<path class="st2" d="M36.4,18.5h2.2c0.1,0,0.1,0.1,0.1,0.1v-0.8c0-0.1-0.1-0.1-0.1-0.1h-2.2c-0.1,0-0.1,0.1-0.1,0.1v0.8
	C36.3,18.6,36.3,18.5,36.4,18.5z"/>
<path class="st2" d="M33.4,18.5h2.2c0.1,0,0.1,0.1,0.1,0.1v-0.8c0-0.1-0.1-0.1-0.1-0.1h-2.2c-0.1,0-0.1,0.1-0.1,0.1v0.8
	C33.3,18.6,33.3,18.5,33.4,18.5z"/>
<path class="st2" d="M30.3,17.9v0.8c0-0.1,0.1-0.1,0.1-0.1h2.2c0.1,0,0.1,0.1,0.1,0.1v-0.8c0-0.1-0.1-0.1-0.1-0.1h-2.2
	C30.3,17.8,30.3,17.8,30.3,17.9C30.3,17.9,30.3,17.9,30.3,17.9z"/>
<path class="st2" d="M27.4,17.8c-0.1,0-0.1,0.1-0.1,0.1v0.8c0-0.1,0.1-0.1,0.1-0.1h2.2c0.1,0,0.1,0.1,0.1,0.1v-0.8
	c0-0.1-0.1-0.1-0.1-0.1H27.4z"/>
<path class="st2" d="M24.3,17.9v0.8c0-0.1,0.1-0.1,0.1-0.1h2.2c0.1,0,0.1,0.1,0.1,0.1v-0.8c0-0.1-0.1-0.1-0.1-0.1h-2.2
	C24.3,17.8,24.3,17.9,24.3,17.9z"/>
<path class="st2" d="M21.3,17.9v0.8c0-0.1,0.1-0.1,0.1-0.1h2.2c0.1,0,0.1,0.1,0.1,0.1v-0.8c0-0.1-0.1-0.1-0.1-0.1h-2.2
	C21.3,17.8,21.3,17.9,21.3,17.9z"/>
<path class="st2" d="M18.3,17.9v0.8c0-0.1,0.1-0.1,0.1-0.1h2.2c0.1,0,0.1,0.1,0.1,0.1v-0.8c0-0.1-0.1-0.1-0.1-0.1h-2.2
	C18.3,17.8,18.3,17.9,18.3,17.9z"/>
<path class="st2" d="M15.4,17.8c-0.1,0-0.1,0.1-0.1,0.1v0.8c0-0.1,0.1-0.1,0.1-0.1h2.2c0.1,0,0.1,0.1,0.1,0.1v-0.8
	c0-0.1-0.1-0.1-0.1-0.1H15.4z"/>
<path class="st2" d="M12.4,17.8c-0.1,0-0.1,0.1-0.1,0.1v0.8c0-0.1,0.1-0.1,0.1-0.1h2.2c0.1,0,0.1,0.1,0.1,0.1v-0.8
	c0-0.1-0.1-0.1-0.1-0.1H12.4z"/>
<path class="st2" d="M9.4,17.8c-0.1,0-0.1,0.1-0.1,0.1v0.8c0-0.1,0.1-0.1,0.1-0.1h2.2c0.1,0,0.1,0.1,0.1,0.1v-0.8
	c0-0.1-0.1-0.1-0.1-0.1H9.4z"/>
<path class="st2" d="M6.4,18.5h2.2c0.1,0,0.1,0.1,0.1,0.1v-0.8c0-0.1-0.1-0.1-0.1-0.1H6.4c-0.1,0-0.1,0.1-0.1,0.1v0.8
	C6.3,18.6,6.3,18.5,6.4,18.5z"/>
<path class="st2" d="M3.4,17.8c-0.1,0-0.1,0.1-0.1,0.1v0.8c0-0.1,0.1-0.1,0.1-0.1h2.2c0.1,0,0.1,0.1,0.1,0.1v-0.8
	c0-0.1-0.1-0.1-0.1-0.1H3.4z"/>
<linearGradient id="SVGID_58_" gradientUnits="userSpaceOnUse" x1="37.515" y1="10.85" x2="37.515" y2="13.68" gradientTransform="matrix(1 0 0 -1 0 37.73)">
	<stop  offset="0" style="stop-color:#1A1A1A"/>
	<stop  offset="1" style="stop-color:#595959"/>
</linearGradient>
<path class="st62" d="M36.4,24.1h2.2c0.2,0,0.3,0.1,0.3,0.3v2.2c0,0.2-0.1,0.3-0.3,0.3h-2.2c-0.2,0-0.3-0.1-0.3-0.3v-2.2
	C36.1,24.2,36.2,24.1,36.4,24.1z"/>
<linearGradient id="SVGID_59_" gradientUnits="userSpaceOnUse" x1="34.515" y1="10.85" x2="34.515" y2="13.68" gradientTransform="matrix(1 0 0 -1 0 37.73)">
	<stop  offset="0" style="stop-color:#1A1A1A"/>
	<stop  offset="1" style="stop-color:#595959"/>
</linearGradient>
<path class="st63" d="M33.4,24.1h2.2c0.2,0,0.3,0.1,0.3,0.3v2.2c0,0.2-0.1,0.3-0.3,0.3h-2.2c-0.2,0-0.3-0.1-0.3-0.3v-2.2
	C33.1,24.2,33.2,24.1,33.4,24.1z"/>
<linearGradient id="SVGID_60_" gradientUnits="userSpaceOnUse" x1="31.505" y1="10.85" x2="31.505" y2="13.68" gradientTransform="matrix(1 0 0 -1 0 37.73)">
	<stop  offset="0" style="stop-color:#1A1A1A"/>
	<stop  offset="1" style="stop-color:#595959"/>
</linearGradient>
<path class="st64" d="M30.4,24.1h2.2c0.2,0,0.3,0.1,0.3,0.3v2.2c0,0.2-0.1,0.3-0.3,0.3h-2.2c-0.2,0-0.3-0.1-0.3-0.3v-2.2
	C30.1,24.2,30.2,24.1,30.4,24.1z"/>
<linearGradient id="SVGID_61_" gradientUnits="userSpaceOnUse" x1="28.505" y1="10.85" x2="28.505" y2="13.68" gradientTransform="matrix(1 0 0 -1 0 37.73)">
	<stop  offset="0" style="stop-color:#1A1A1A"/>
	<stop  offset="1" style="stop-color:#595959"/>
</linearGradient>
<path class="st65" d="M27.4,24.1h2.2c0.2,0,0.3,0.1,0.3,0.3v2.2c0,0.2-0.1,0.3-0.3,0.3h-2.2c-0.2,0-0.3-0.1-0.3-0.3v-2.2
	C27.1,24.2,27.2,24.1,27.4,24.1z"/>
<linearGradient id="SVGID_62_" gradientUnits="userSpaceOnUse" x1="25.505" y1="10.85" x2="25.505" y2="13.68" gradientTransform="matrix(1 0 0 -1 0 37.73)">
	<stop  offset="0" style="stop-color:#1A1A1A"/>
	<stop  offset="1" style="stop-color:#595959"/>
</linearGradient>
<path class="st66" d="M24.4,24.1h2.2c0.2,0,0.3,0.1,0.3,0.3v2.2c0,0.2-0.1,0.3-0.3,0.3h-2.2c-0.2,0-0.3-0.1-0.3-0.3v-2.2
	C24.1,24.2,24.2,24.1,24.4,24.1z"/>
<linearGradient id="SVGID_63_" gradientUnits="userSpaceOnUse" x1="22.495" y1="10.85" x2="22.495" y2="13.68" gradientTransform="matrix(1 0 0 -1 0 37.73)">
	<stop  offset="0" style="stop-color:#1A1A1A"/>
	<stop  offset="1" style="stop-color:#595959"/>
</linearGradient>
<path class="st67" d="M21.4,24.1h2.2c0.2,0,0.3,0.1,0.3,0.3v2.2c0,0.2-0.1,0.3-0.3,0.3h-2.2c-0.2,0-0.3-0.1-0.3-0.3v-2.2
	C21.1,24.2,21.2,24.1,21.4,24.1z"/>
<linearGradient id="SVGID_64_" gradientUnits="userSpaceOnUse" x1="19.495" y1="10.85" x2="19.495" y2="13.68" gradientTransform="matrix(1 0 0 -1 0 37.73)">
	<stop  offset="0" style="stop-color:#1A1A1A"/>
	<stop  offset="1" style="stop-color:#595959"/>
</linearGradient>
<path class="st68" d="M18.4,24.1h2.2c0.2,0,0.3,0.1,0.3,0.3v2.2c0,0.2-0.1,0.3-0.3,0.3h-2.2c-0.2,0-0.3-0.1-0.3-0.3v-2.2
	C18.1,24.2,18.2,24.1,18.4,24.1z"/>
<linearGradient id="SVGID_65_" gradientUnits="userSpaceOnUse" x1="16.485" y1="10.85" x2="16.485" y2="13.68" gradientTransform="matrix(1 0 0 -1 0 37.73)">
	<stop  offset="0" style="stop-color:#1A1A1A"/>
	<stop  offset="1" style="stop-color:#595959"/>
</linearGradient>
<path class="st69" d="M15.4,24.1h2.2c0.2,0,0.3,0.1,0.3,0.3v2.2c0,0.2-0.1,0.3-0.3,0.3h-2.2c-0.2,0-0.3-0.1-0.3-0.3v-2.2
	C15.1,24.2,15.2,24.1,15.4,24.1z"/>
<linearGradient id="SVGID_66_" gradientUnits="userSpaceOnUse" x1="13.485" y1="10.85" x2="13.485" y2="13.68" gradientTransform="matrix(1 0 0 -1 0 37.73)">
	<stop  offset="0" style="stop-color:#1A1A1A"/>
	<stop  offset="1" style="stop-color:#595959"/>
</linearGradient>
<path class="st70" d="M12.4,24.1h2.2c0.2,0,0.3,0.1,0.3,0.3v2.2c0,0.2-0.1,0.3-0.3,0.3h-2.2c-0.2,0-0.3-0.1-0.3-0.3v-2.2
	C12.1,24.2,12.2,24.1,12.4,24.1z"/>
<linearGradient id="SVGID_67_" gradientUnits="userSpaceOnUse" x1="10.485" y1="10.85" x2="10.485" y2="13.68" gradientTransform="matrix(1 0 0 -1 0 37.73)">
	<stop  offset="0" style="stop-color:#1A1A1A"/>
	<stop  offset="1" style="stop-color:#595959"/>
</linearGradient>
<path class="st71" d="M9.4,24.1h2.2c0.2,0,0.3,0.1,0.3,0.3v2.2c0,0.2-0.1,0.3-0.3,0.3H9.4c-0.2,0-0.3-0.1-0.3-0.3v-2.2
	C9.1,24.2,9.2,24.1,9.4,24.1z"/>
<linearGradient id="SVGID_68_" gradientUnits="userSpaceOnUse" x1="36.28" y1="12.265" x2="38.75" y2="12.265" gradientTransform="matrix(1 0 0 -1 0 37.73)">
	<stop  offset="0" style="stop-color:#CCCCCC"/>
	<stop  offset="1" style="stop-color:#F7F7F7"/>
</linearGradient>
<path class="st72" d="M36.4,24.2h2.2c0.1,0,0.1,0.1,0.1,0.1v2.2c0,0.1-0.1,0.1-0.1,0.1h-2.2c-0.1,0-0.1-0.1-0.1-0.1v-2.2
	C36.3,24.3,36.3,24.2,36.4,24.2z"/>
<linearGradient id="SVGID_69_" gradientUnits="userSpaceOnUse" x1="33.28" y1="12.265" x2="35.75" y2="12.265" gradientTransform="matrix(1 0 0 -1 0 37.73)">
	<stop  offset="0" style="stop-color:#CCCCCC"/>
	<stop  offset="1" style="stop-color:#F7F7F7"/>
</linearGradient>
<path class="st73" d="M33.4,24.2h2.2c0.1,0,0.1,0.1,0.1,0.1v2.2c0,0.1-0.1,0.1-0.1,0.1h-2.2c-0.1,0-0.1-0.1-0.1-0.1v-2.2
	C33.3,24.3,33.3,24.2,33.4,24.2z"/>
<linearGradient id="SVGID_70_" gradientUnits="userSpaceOnUse" x1="30.27" y1="12.265" x2="32.75" y2="12.265" gradientTransform="matrix(1 0 0 -1 0 37.73)">
	<stop  offset="0" style="stop-color:#CCCCCC"/>
	<stop  offset="1" style="stop-color:#F7F7F7"/>
</linearGradient>
<path class="st74" d="M30.4,24.2h2.2c0.1,0,0.1,0.1,0.1,0.1v2.2c0,0.1-0.1,0.1-0.1,0.1h-2.2c-0.1,0-0.1-0.1-0.1-0.1v-2.2
	C30.3,24.3,30.3,24.2,30.4,24.2z"/>
<linearGradient id="SVGID_71_" gradientUnits="userSpaceOnUse" x1="27.27" y1="12.265" x2="29.74" y2="12.265" gradientTransform="matrix(1 0 0 -1 0 37.73)">
	<stop  offset="0" style="stop-color:#CCCCCC"/>
	<stop  offset="1" style="stop-color:#F7F7F7"/>
</linearGradient>
<path class="st75" d="M27.4,24.2h2.2c0.1,0,0.1,0.1,0.1,0.1v2.2c0,0.1-0.1,0.1-0.1,0.1h-2.2c-0.1,0-0.1-0.1-0.1-0.1v-2.2
	C27.3,24.3,27.3,24.2,27.4,24.2z"/>
<linearGradient id="SVGID_72_" gradientUnits="userSpaceOnUse" x1="24.27" y1="12.265" x2="26.74" y2="12.265" gradientTransform="matrix(1 0 0 -1 0 37.73)">
	<stop  offset="0" style="stop-color:#CCCCCC"/>
	<stop  offset="1" style="stop-color:#F7F7F7"/>
</linearGradient>
<path class="st76" d="M24.4,24.2h2.2c0.1,0,0.1,0.1,0.1,0.1v2.2c0,0.1-0.1,0.1-0.1,0.1h-2.2c-0.1,0-0.1-0.1-0.1-0.1v-2.2
	C24.3,24.3,24.3,24.2,24.4,24.2z"/>
<linearGradient id="SVGID_73_" gradientUnits="userSpaceOnUse" x1="21.26" y1="12.265" x2="23.74" y2="12.265" gradientTransform="matrix(1 0 0 -1 0 37.73)">
	<stop  offset="0" style="stop-color:#CCCCCC"/>
	<stop  offset="1" style="stop-color:#F7F7F7"/>
</linearGradient>
<path class="st77" d="M21.4,24.2h2.2c0.1,0,0.1,0.1,0.1,0.1v2.2c0,0.1-0.1,0.1-0.1,0.1h-2.2c-0.1,0-0.1-0.1-0.1-0.1v-2.2
	C21.3,24.3,21.3,24.2,21.4,24.2z"/>
<linearGradient id="SVGID_74_" gradientUnits="userSpaceOnUse" x1="18.26" y1="12.265" x2="20.73" y2="12.265" gradientTransform="matrix(1 0 0 -1 0 37.73)">
	<stop  offset="0" style="stop-color:#CCCCCC"/>
	<stop  offset="1" style="stop-color:#F7F7F7"/>
</linearGradient>
<path class="st78" d="M18.4,24.2h2.2c0.1,0,0.1,0.1,0.1,0.1v2.2c0,0.1-0.1,0.1-0.1,0.1h-2.2c-0.1,0-0.1-0.1-0.1-0.1v-2.2
	C18.3,24.3,18.3,24.2,18.4,24.2z"/>
<linearGradient id="SVGID_75_" gradientUnits="userSpaceOnUse" x1="15.25" y1="12.265" x2="17.73" y2="12.265" gradientTransform="matrix(1 0 0 -1 0 37.73)">
	<stop  offset="0" style="stop-color:#CCCCCC"/>
	<stop  offset="1" style="stop-color:#F7F7F7"/>
</linearGradient>
<path class="st79" d="M15.4,24.2h2.2c0.1,0,0.1,0.1,0.1,0.1v2.2c0,0.1-0.1,0.1-0.1,0.1h-2.2c-0.1,0-0.1-0.1-0.1-0.1v-2.2
	C15.2,24.3,15.3,24.2,15.4,24.2z"/>
<linearGradient id="SVGID_76_" gradientUnits="userSpaceOnUse" x1="12.25" y1="12.265" x2="14.72" y2="12.265" gradientTransform="matrix(1 0 0 -1 0 37.73)">
	<stop  offset="0" style="stop-color:#CCCCCC"/>
	<stop  offset="1" style="stop-color:#F7F7F7"/>
</linearGradient>
<path class="st80" d="M12.4,24.2h2.2c0.1,0,0.1,0.1,0.1,0.1v2.2c0,0.1-0.1,0.1-0.1,0.1h-2.2c-0.1,0-0.1-0.1-0.1-0.1v-2.2
	C12.2,24.3,12.3,24.2,12.4,24.2z"/>
<linearGradient id="SVGID_77_" gradientUnits="userSpaceOnUse" x1="9.25" y1="12.265" x2="11.72" y2="12.265" gradientTransform="matrix(1 0 0 -1 0 37.73)">
	<stop  offset="0" style="stop-color:#CCCCCC"/>
	<stop  offset="1" style="stop-color:#F7F7F7"/>
</linearGradient>
<path class="st81" d="M9.4,24.2h2.2c0.1,0,0.1,0.1,0.1,0.1v2.2c0,0.1-0.1,0.1-0.1,0.1H9.4c-0.1,0-0.1-0.1-0.1-0.1v-2.2
	C9.2,24.3,9.3,24.2,9.4,24.2z"/>
<linearGradient id="SVGID_78_" gradientUnits="userSpaceOnUse" x1="6.61" y1="7.63" x2="6.61" y2="10.49" gradientTransform="matrix(1 0 0 -1 0 37.73)">
	<stop  offset="0" style="stop-color:#1A1A1A"/>
	<stop  offset="1" style="stop-color:#595959"/>
</linearGradient>
<path class="st82" d="M3,29.8v-2.3c0-0.1,0.1-0.3,0.3-0.3h6.6c0.1,0,0.3,0.1,0.3,0.3v2.3c0,0.1-0.1,0.3-0.3,0.3H3.3
	C3.1,30.1,3,30,3,29.8z"/>
<linearGradient id="SVGID_79_" gradientUnits="userSpaceOnUse" x1="6.61" y1="7.81" x2="6.61" y2="10.31" gradientTransform="matrix(1 0 0 -1 0 37.73)">
	<stop  offset="0" style="stop-color:#CCCCCC"/>
	<stop  offset="1" style="stop-color:#F7F7F7"/>
</linearGradient>
<path class="st83" d="M3.4,27.4h6.5c0.1,0,0.2,0.1,0.2,0.2v2.2c0,0.1-0.1,0.2-0.2,0.2H3.4c-0.1,0-0.2-0.1-0.2-0.2v-2.2
	C3.2,27.5,3.3,27.4,3.4,27.4z"/>
<linearGradient id="SVGID_80_" gradientUnits="userSpaceOnUse" x1="41.39" y1="7.63" x2="41.39" y2="10.49" gradientTransform="matrix(1 0 0 -1 0 37.73)">
	<stop  offset="0" style="stop-color:#1A1A1A"/>
	<stop  offset="1" style="stop-color:#595959"/>
</linearGradient>
<path class="st84" d="M37.8,29.8v-2.3c0-0.1,0.1-0.3,0.3-0.3h6.6c0.1,0,0.3,0.1,0.3,0.3v2.3c0,0.1-0.1,0.3-0.3,0.3h-6.6
	C37.9,30.1,37.8,30,37.8,29.8z"/>
<linearGradient id="SVGID_81_" gradientUnits="userSpaceOnUse" x1="13.455" y1="4.41" x2="13.455" y2="7.24" gradientTransform="matrix(1 0 0 -1 0 37.73)">
	<stop  offset="0" style="stop-color:#1A1A1A"/>
	<stop  offset="1" style="stop-color:#595959"/>
</linearGradient>
<path class="st85" d="M12.4,30.5h2.2c0.2,0,0.3,0.1,0.3,0.3V33c0,0.2-0.1,0.3-0.3,0.3h-2.2c-0.2,0-0.3-0.1-0.3-0.3v-2.2
	C12,30.6,12.2,30.5,12.4,30.5z"/>
<linearGradient id="SVGID_82_" gradientUnits="userSpaceOnUse" x1="10.455" y1="4.41" x2="10.455" y2="7.24" gradientTransform="matrix(1 0 0 -1 0 37.73)">
	<stop  offset="0" style="stop-color:#1A1A1A"/>
	<stop  offset="1" style="stop-color:#595959"/>
</linearGradient>
<path class="st86" d="M9.4,30.5h2.2c0.2,0,0.3,0.1,0.3,0.3V33c0,0.2-0.1,0.3-0.3,0.3H9.4C9.2,33.3,9,33.2,9,33v-2.2
	C9,30.6,9.2,30.5,9.4,30.5z"/>
<linearGradient id="SVGID_83_" gradientUnits="userSpaceOnUse" x1="7.445" y1="4.41" x2="7.445" y2="7.24" gradientTransform="matrix(1 0 0 -1 0 37.73)">
	<stop  offset="0" style="stop-color:#1A1A1A"/>
	<stop  offset="1" style="stop-color:#595959"/>
</linearGradient>
<path class="st87" d="M6.4,30.5h2.2c0.2,0,0.3,0.1,0.3,0.3V33c0,0.2-0.1,0.3-0.3,0.3H6.4C6.2,33.3,6,33.2,6,33v-2.2
	C6,30.6,6.2,30.5,6.4,30.5z"/>
<linearGradient id="SVGID_84_" gradientUnits="userSpaceOnUse" x1="4.445" y1="4.41" x2="4.445" y2="7.24" gradientTransform="matrix(1 0 0 -1 0 37.73)">
	<stop  offset="0" style="stop-color:#1A1A1A"/>
	<stop  offset="1" style="stop-color:#595959"/>
</linearGradient>
<path class="st88" d="M3.3,30.5h2.2c0.2,0,0.3,0.1,0.3,0.3V33c0,0.2-0.1,0.3-0.3,0.3H3.3C3.2,33.3,3,33.2,3,33v-2.2
	C3,30.6,3.2,30.5,3.3,30.5z"/>
<linearGradient id="SVGID_85_" gradientUnits="userSpaceOnUse" x1="12.22" y1="5.825" x2="14.69" y2="5.825" gradientTransform="matrix(1 0 0 -1 0 37.73)">
	<stop  offset="0" style="stop-color:#CCCCCC"/>
	<stop  offset="1" style="stop-color:#F7F7F7"/>
</linearGradient>
<path class="st89" d="M12.4,30.7h2.2c0.1,0,0.1,0.1,0.1,0.1V33c0,0.1-0.1,0.1-0.1,0.1h-2.2c-0.1,0-0.1-0.1-0.1-0.1v-2.2
	C12.2,30.7,12.3,30.7,12.4,30.7z"/>
<linearGradient id="SVGID_86_" gradientUnits="userSpaceOnUse" x1="9.22" y1="5.825" x2="11.69" y2="5.825" gradientTransform="matrix(1 0 0 -1 0 37.73)">
	<stop  offset="0" style="stop-color:#CCCCCC"/>
	<stop  offset="1" style="stop-color:#F7F7F7"/>
</linearGradient>
<path class="st90" d="M9.4,30.7h2.2c0.1,0,0.1,0.1,0.1,0.1V33c0,0.1-0.1,0.1-0.1,0.1H9.4c-0.1,0-0.1-0.1-0.1-0.1v-2.2
	C9.2,30.7,9.3,30.7,9.4,30.7z"/>
<linearGradient id="SVGID_87_" gradientUnits="userSpaceOnUse" x1="6.21" y1="5.825" x2="8.69" y2="5.825" gradientTransform="matrix(1 0 0 -1 0 37.73)">
	<stop  offset="0" style="stop-color:#CCCCCC"/>
	<stop  offset="1" style="stop-color:#F7F7F7"/>
</linearGradient>
<path class="st91" d="M6.3,30.7h2.2c0.1,0,0.1,0.1,0.1,0.1V33c0,0.1-0.1,0.1-0.1,0.1H6.3c-0.1,0-0.1-0.1-0.1-0.1v-2.2
	C6.2,30.7,6.3,30.7,6.3,30.7z"/>
<linearGradient id="SVGID_88_" gradientUnits="userSpaceOnUse" x1="3.21" y1="5.825" x2="5.68" y2="5.825" gradientTransform="matrix(1 0 0 -1 0 37.73)">
	<stop  offset="0" style="stop-color:#CCCCCC"/>
	<stop  offset="1" style="stop-color:#F7F7F7"/>
</linearGradient>
<path class="st92" d="M3.4,30.7h2.2c0.1,0,0.1,0.1,0.1,0.1V33c0,0.1-0.1,0.1-0.1,0.1H3.4c-0.1,0-0.1-0.1-0.1-0.1v-2.2
	C3.2,30.7,3.3,30.7,3.4,30.7z"/>
<linearGradient id="SVGID_89_" gradientUnits="userSpaceOnUse" x1="43.555" y1="4.41" x2="43.555" y2="7.24" gradientTransform="matrix(1 0 0 -1 0 37.73)">
	<stop  offset="0" style="stop-color:#1A1A1A"/>
	<stop  offset="1" style="stop-color:#595959"/>
</linearGradient>
<path class="st93" d="M42.5,30.5h2.2c0.2,0,0.3,0.1,0.3,0.3V33c0,0.2-0.1,0.3-0.3,0.3h-2.2c-0.2,0-0.3-0.1-0.3-0.3v-2.2
	C42.1,30.6,42.3,30.5,42.5,30.5z"/>
<linearGradient id="SVGID_90_" gradientUnits="userSpaceOnUse" x1="40.555" y1="4.41" x2="40.555" y2="7.24" gradientTransform="matrix(1 0 0 -1 0 37.73)">
	<stop  offset="0" style="stop-color:#1A1A1A"/>
	<stop  offset="1" style="stop-color:#595959"/>
</linearGradient>
<path class="st94" d="M39.5,30.5h2.2c0.2,0,0.3,0.1,0.3,0.3V33c0,0.2-0.1,0.3-0.3,0.3h-2.2c-0.2,0-0.3-0.1-0.3-0.3v-2.2
	C39.1,30.6,39.3,30.5,39.5,30.5z"/>
<linearGradient id="SVGID_91_" gradientUnits="userSpaceOnUse" x1="37.545" y1="4.41" x2="37.545" y2="7.24" gradientTransform="matrix(1 0 0 -1 0 37.73)">
	<stop  offset="0" style="stop-color:#1A1A1A"/>
	<stop  offset="1" style="stop-color:#595959"/>
</linearGradient>
<path class="st95" d="M36.5,30.5h2.2c0.2,0,0.3,0.1,0.3,0.3V33c0,0.2-0.1,0.3-0.3,0.3h-2.2c-0.2,0-0.3-0.1-0.3-0.3v-2.2
	C36.1,30.6,36.3,30.5,36.5,30.5z"/>
<linearGradient id="SVGID_92_" gradientUnits="userSpaceOnUse" x1="34.545" y1="4.41" x2="34.545" y2="7.24" gradientTransform="matrix(1 0 0 -1 0 37.73)">
	<stop  offset="0" style="stop-color:#1A1A1A"/>
	<stop  offset="1" style="stop-color:#595959"/>
</linearGradient>
<path class="st96" d="M33.5,30.5h2.2c0.2,0,0.3,0.1,0.3,0.3V33c0,0.2-0.1,0.3-0.3,0.3h-2.2c-0.2,0-0.3-0.1-0.3-0.3v-2.2
	C33.1,30.6,33.3,30.5,33.5,30.5z"/>
<linearGradient id="SVGID_93_" gradientUnits="userSpaceOnUse" x1="42.32" y1="5.825" x2="44.79" y2="5.825" gradientTransform="matrix(1 0 0 -1 0 37.73)">
	<stop  offset="0" style="stop-color:#CCCCCC"/>
	<stop  offset="1" style="stop-color:#F7F7F7"/>
</linearGradient>
<path class="st97" d="M42.5,30.7h2.2c0.1,0,0.1,0.1,0.1,0.1V33c0,0.1-0.1,0.1-0.1,0.1h-2.2c-0.1,0-0.1-0.1-0.1-0.1v-2.2
	C42.3,30.7,42.4,30.7,42.5,30.7z"/>
<linearGradient id="SVGID_94_" gradientUnits="userSpaceOnUse" x1="39.31" y1="5.825" x2="41.79" y2="5.825" gradientTransform="matrix(1 0 0 -1 0 37.73)">
	<stop  offset="0" style="stop-color:#CCCCCC"/>
	<stop  offset="1" style="stop-color:#F7F7F7"/>
</linearGradient>
<path class="st98" d="M39.5,30.7h2.2c0.1,0,0.1,0.1,0.1,0.1V33c0,0.1-0.1,0.1-0.1,0.1h-2.2c-0.1,0-0.1-0.1-0.1-0.1v-2.2
	C39.3,30.7,39.4,30.7,39.5,30.7z"/>
<linearGradient id="SVGID_95_" gradientUnits="userSpaceOnUse" x1="36.31" y1="5.825" x2="38.78" y2="5.825" gradientTransform="matrix(1 0 0 -1 0 37.73)">
	<stop  offset="0" style="stop-color:#CCCCCC"/>
	<stop  offset="1" style="stop-color:#F7F7F7"/>
</linearGradient>
<path class="st99" d="M36.5,30.7h2.2c0.1,0,0.1,0.1,0.1,0.1V33c0,0.1-0.1,0.1-0.1,0.1h-2.2c-0.1,0-0.1-0.1-0.1-0.1v-2.2
	C36.3,30.7,36.4,30.7,36.5,30.7z"/>
<linearGradient id="SVGID_96_" gradientUnits="userSpaceOnUse" x1="33.31" y1="5.825" x2="35.78" y2="5.825" gradientTransform="matrix(1 0 0 -1 0 37.73)">
	<stop  offset="0" style="stop-color:#CCCCCC"/>
	<stop  offset="1" style="stop-color:#F7F7F7"/>
</linearGradient>
<path class="st100" d="M33.5,30.7h2.2c0.1,0,0.1,0.1,0.1,0.1V33c0,0.1-0.1,0.1-0.1,0.1h-2.2c-0.1,0-0.1-0.1-0.1-0.1v-2.2
	C33.3,30.7,33.4,30.7,33.5,30.7z"/>
<linearGradient id="SVGID_97_" gradientUnits="userSpaceOnUse" x1="24" y1="4.41" x2="24" y2="7.27" gradientTransform="matrix(1 0 0 -1 0 37.73)">
	<stop  offset="0" style="stop-color:#1A1A1A"/>
	<stop  offset="1" style="stop-color:#595959"/>
</linearGradient>
<path class="st101" d="M15.2,33.1v-2.3c0-0.1,0.1-0.3,0.3-0.3h17c0.1,0,0.3,0.1,0.3,0.3v2.3c0,0.1-0.1,0.3-0.3,0.3h-17
	C15.3,33.3,15.2,33.2,15.2,33.1z"/>
<linearGradient id="SVGID_98_" gradientUnits="userSpaceOnUse" x1="24" y1="4.59" x2="24" y2="7.09" gradientTransform="matrix(1 0 0 -1 0 37.73)">
	<stop  offset="0" style="stop-color:#CCCCCC"/>
	<stop  offset="1" style="stop-color:#F7F7F7"/>
</linearGradient>
<path class="st102" d="M15.6,30.6h16.8c0.1,0,0.2,0.1,0.2,0.2V33c0,0.1-0.1,0.2-0.2,0.2H15.6c-0.1,0-0.2-0.1-0.2-0.2v-2.2
	C15.4,30.7,15.5,30.6,15.6,30.6z"/>
<path class="st2" d="M13.9,30.7h-1.5c-0.1,0-0.1,0.1-0.1,0.1v0.8c0-0.1,0.1-0.1,0.1-0.1h2.2c0.1,0,0.1,0.1,0.1,0.1v-0.8
	c0-0.1-0.1-0.1-0.1-0.1C14.5,30.7,13.9,30.7,13.9,30.7z"/>
<path class="st2" d="M10.9,30.7H9.4c-0.1,0-0.1,0.1-0.1,0.1v0.8c0-0.1,0.1-0.1,0.1-0.1h2.2c0.1,0,0.1,0.1,0.1,0.1v-0.8
	c0-0.1-0.1-0.1-0.1-0.1C11.5,30.7,10.9,30.7,10.9,30.7z"/>
<path class="st2" d="M6.2,30.8v0.8c0-0.1,0.1-0.1,0.1-0.1h2.2c0.1,0,0.1,0.1,0.1,0.1v-0.8c0-0.1-0.1-0.1-0.1-0.1H6.3
	C6.3,30.7,6.2,30.7,6.2,30.8z"/>
<path class="st2" d="M3.2,30.8v0.8c0-0.1,0.1-0.1,0.1-0.1h2.2c0.1,0,0.1,0.1,0.1,0.1v-0.8c0-0.1-0.1-0.1-0.1-0.1H3.3
	C3.3,30.7,3.2,30.7,3.2,30.8z"/>
<path class="st2" d="M44.7,30.7h-2.2c-0.1,0-0.1,0.1-0.1,0.1v0.8c0-0.1,0.1-0.1,0.1-0.1h2.2c0.1,0,0.1,0.1,0.1,0.1v-0.8
	C44.8,30.7,44.7,30.7,44.7,30.7z"/>
<path class="st2" d="M39.3,30.8v0.8c0-0.1,0.1-0.1,0.1-0.1h2.2c0.1,0,0.1,0.1,0.1,0.1v-0.8c0-0.1-0.1-0.1-0.1-0.1h-2.2
	C39.4,30.7,39.3,30.7,39.3,30.8z"/>
<path class="st2" d="M38.1,30.7h-1.7c-0.1,0-0.1,0.1-0.1,0.1v0.8c0-0.1,0.1-0.1,0.1-0.1h2.2c0.1,0,0.1,0.1,0.1,0.1v-0.8
	c0-0.1-0.1-0.1-0.1-0.1H38.1z"/>
<path class="st2" d="M34.9,30.7h-1.5c-0.1,0-0.1,0.1-0.1,0.1v0.8c0-0.1,0.1-0.1,0.1-0.1h2.2c0.1,0,0.1,0.1,0.1,0.1v-0.8
	c0-0.1-0.1-0.1-0.1-0.1H34.9z"/>
<path class="st2" d="M31.8,30.6h-0.7c0,0-0.1,0-0.1,0h-2.2c0,0-0.1,0-0.1,0h-0.7c0,0-0.1,0-0.1,0h-2.2c0,0-0.1,0-0.1,0h-0.7
	c0,0-0.1,0-0.1,0h-2.2c0,0-0.1,0-0.1,0h-0.7c0,0-0.1,0-0.1,0h-2.2c0,0-0.1,0-0.1,0h-0.7c0,0-0.1,0-0.1,0h-2.2c0,0-0.1,0-0.1,0h-0.7
	c0,0-0.1,0-0.1,0h-0.6c0,0,0,0.1,0,0.1v0.8c0-0.1,0.1-0.1,0.1-0.1h16.9c0.1,0,0.1,0.1,0.1,0.1l0,0v-0.8c0,0,0-0.1,0-0.1H32
	C31.9,30.7,31.9,30.7,31.8,30.6z"/>
<linearGradient id="SVGID_99_" gradientUnits="userSpaceOnUse" x1="41.39" y1="7.81" x2="41.39" y2="10.31" gradientTransform="matrix(1 0 0 -1 0 37.73)">
	<stop  offset="0" style="stop-color:#CCCCCC"/>
	<stop  offset="1" style="stop-color:#F7F7F7"/>
</linearGradient>
<path class="st103" d="M38.2,27.4h6.4c0.1,0,0.2,0.1,0.2,0.2v2.1c0,0.1-0.1,0.2-0.2,0.2h-6.4c-0.1,0-0.2-0.1-0.2-0.2v-2.1
	C38,27.5,38.1,27.4,38.2,27.4z"/>
<linearGradient id="SVGID_100_" gradientUnits="userSpaceOnUse" x1="36.015" y1="7.63" x2="36.015" y2="10.46" gradientTransform="matrix(1 0 0 -1 0 37.73)">
	<stop  offset="0" style="stop-color:#1A1A1A"/>
	<stop  offset="1" style="stop-color:#595959"/>
</linearGradient>
<path class="st104" d="M34.9,27.3h2.2c0.2,0,0.3,0.1,0.3,0.3v2.2c0,0.2-0.1,0.3-0.3,0.3h-2.2c-0.2,0-0.3-0.1-0.3-0.3v-2.2
	C34.6,27.4,34.7,27.3,34.9,27.3z"/>
<linearGradient id="SVGID_101_" gradientUnits="userSpaceOnUse" x1="33.015" y1="7.63" x2="33.015" y2="10.46" gradientTransform="matrix(1 0 0 -1 0 37.73)">
	<stop  offset="0" style="stop-color:#1A1A1A"/>
	<stop  offset="1" style="stop-color:#595959"/>
</linearGradient>
<path class="st105" d="M31.9,27.3h2.2c0.2,0,0.3,0.1,0.3,0.3v2.2c0,0.2-0.1,0.3-0.3,0.3h-2.2c-0.2,0-0.3-0.1-0.3-0.3v-2.2
	C31.6,27.4,31.7,27.3,31.9,27.3z"/>
<linearGradient id="SVGID_102_" gradientUnits="userSpaceOnUse" x1="30.005" y1="7.63" x2="30.005" y2="10.46" gradientTransform="matrix(1 0 0 -1 0 37.73)">
	<stop  offset="0" style="stop-color:#1A1A1A"/>
	<stop  offset="1" style="stop-color:#595959"/>
</linearGradient>
<path class="st106" d="M28.9,27.3h2.2c0.2,0,0.3,0.1,0.3,0.3v2.2c0,0.2-0.1,0.3-0.3,0.3h-2.2c-0.2,0-0.3-0.1-0.3-0.3v-2.2
	C28.6,27.4,28.7,27.3,28.9,27.3z"/>
<linearGradient id="SVGID_103_" gradientUnits="userSpaceOnUse" x1="27.005" y1="7.63" x2="27.005" y2="10.46" gradientTransform="matrix(1 0 0 -1 0 37.73)">
	<stop  offset="0" style="stop-color:#1A1A1A"/>
	<stop  offset="1" style="stop-color:#595959"/>
</linearGradient>
<path class="st107" d="M25.9,27.3h2.2c0.2,0,0.3,0.1,0.3,0.3v2.2c0,0.2-0.1,0.3-0.3,0.3h-2.2c-0.2,0-0.3-0.1-0.3-0.3v-2.2
	C25.6,27.4,25.7,27.3,25.9,27.3z"/>
<linearGradient id="SVGID_104_" gradientUnits="userSpaceOnUse" x1="23.995" y1="7.63" x2="23.995" y2="10.46" gradientTransform="matrix(1 0 0 -1 0 37.73)">
	<stop  offset="0" style="stop-color:#1A1A1A"/>
	<stop  offset="1" style="stop-color:#595959"/>
</linearGradient>
<path class="st108" d="M22.9,27.3h2.2c0.2,0,0.3,0.1,0.3,0.3v2.2c0,0.2-0.1,0.3-0.3,0.3h-2.2c-0.2,0-0.3-0.1-0.3-0.3v-2.2
	C22.6,27.4,22.7,27.3,22.9,27.3z"/>
<linearGradient id="SVGID_105_" gradientUnits="userSpaceOnUse" x1="20.995" y1="7.63" x2="20.995" y2="10.46" gradientTransform="matrix(1 0 0 -1 0 37.73)">
	<stop  offset="0" style="stop-color:#1A1A1A"/>
	<stop  offset="1" style="stop-color:#595959"/>
</linearGradient>
<path class="st109" d="M19.9,27.3h2.2c0.2,0,0.3,0.1,0.3,0.3v2.2c0,0.2-0.1,0.3-0.3,0.3h-2.2c-0.2,0-0.3-0.1-0.3-0.3v-2.2
	C19.6,27.4,19.7,27.3,19.9,27.3z"/>
<linearGradient id="SVGID_106_" gradientUnits="userSpaceOnUse" x1="17.995" y1="7.63" x2="17.995" y2="10.46" gradientTransform="matrix(1 0 0 -1 0 37.73)">
	<stop  offset="0" style="stop-color:#1A1A1A"/>
	<stop  offset="1" style="stop-color:#595959"/>
</linearGradient>
<path class="st110" d="M16.9,27.3h2.2c0.2,0,0.3,0.1,0.3,0.3v2.2c0,0.2-0.1,0.3-0.3,0.3h-2.2c-0.2,0-0.3-0.1-0.3-0.3v-2.2
	C16.6,27.4,16.7,27.3,16.9,27.3z"/>
<linearGradient id="SVGID_107_" gradientUnits="userSpaceOnUse" x1="14.985" y1="7.63" x2="14.985" y2="10.46" gradientTransform="matrix(1 0 0 -1 0 37.73)">
	<stop  offset="0" style="stop-color:#1A1A1A"/>
	<stop  offset="1" style="stop-color:#595959"/>
</linearGradient>
<path class="st111" d="M13.9,27.3h2.2c0.2,0,0.3,0.1,0.3,0.3v2.2c0,0.2-0.1,0.3-0.3,0.3h-2.2c-0.2,0-0.3-0.1-0.3-0.3v-2.2
	C13.6,27.4,13.7,27.3,13.9,27.3z"/>
<linearGradient id="SVGID_108_" gradientUnits="userSpaceOnUse" x1="11.985" y1="7.63" x2="11.985" y2="10.46" gradientTransform="matrix(1 0 0 -1 0 37.73)">
	<stop  offset="0" style="stop-color:#1A1A1A"/>
	<stop  offset="1" style="stop-color:#595959"/>
</linearGradient>
<path class="st112" d="M10.9,27.3h2.2c0.2,0,0.3,0.1,0.3,0.3v2.2c0,0.2-0.1,0.3-0.3,0.3h-2.2c-0.2,0-0.3-0.1-0.3-0.3v-2.2
	C10.6,27.4,10.7,27.3,10.9,27.3z"/>
<linearGradient id="SVGID_109_" gradientUnits="userSpaceOnUse" x1="34.78" y1="9.045" x2="37.25" y2="9.045" gradientTransform="matrix(1 0 0 -1 0 37.73)">
	<stop  offset="0" style="stop-color:#CCCCCC"/>
	<stop  offset="1" style="stop-color:#F7F7F7"/>
</linearGradient>
<path class="st113" d="M34.9,27.5h2.2c0.1,0,0.1,0.1,0.1,0.1v2.2c0,0.1-0.1,0.1-0.1,0.1h-2.2c-0.1,0-0.1-0.1-0.1-0.1v-2.2
	C34.8,27.5,34.8,27.5,34.9,27.5z"/>
<linearGradient id="SVGID_110_" gradientUnits="userSpaceOnUse" x1="31.77" y1="9.045" x2="34.25" y2="9.045" gradientTransform="matrix(1 0 0 -1 0 37.73)">
	<stop  offset="0" style="stop-color:#CCCCCC"/>
	<stop  offset="1" style="stop-color:#F7F7F7"/>
</linearGradient>
<path class="st114" d="M31.9,27.5h2.2c0.1,0,0.1,0.1,0.1,0.1v2.2c0,0.1-0.1,0.1-0.1,0.1h-2.2c-0.1,0-0.1-0.1-0.1-0.1v-2.2
	C31.8,27.5,31.8,27.5,31.9,27.5z"/>
<linearGradient id="SVGID_111_" gradientUnits="userSpaceOnUse" x1="28.77" y1="9.045" x2="31.24" y2="9.045" gradientTransform="matrix(1 0 0 -1 0 37.73)">
	<stop  offset="0" style="stop-color:#CCCCCC"/>
	<stop  offset="1" style="stop-color:#F7F7F7"/>
</linearGradient>
<path class="st115" d="M28.9,27.5h2.2c0.1,0,0.1,0.1,0.1,0.1v2.2c0,0.1-0.1,0.1-0.1,0.1h-2.2c-0.1,0-0.1-0.1-0.1-0.1v-2.2
	C28.8,27.5,28.8,27.5,28.9,27.5z"/>
<linearGradient id="SVGID_112_" gradientUnits="userSpaceOnUse" x1="25.77" y1="9.045" x2="28.24" y2="9.045" gradientTransform="matrix(1 0 0 -1 0 37.73)">
	<stop  offset="0" style="stop-color:#CCCCCC"/>
	<stop  offset="1" style="stop-color:#F7F7F7"/>
</linearGradient>
<path class="st116" d="M25.9,27.5h2.2c0.1,0,0.1,0.1,0.1,0.1v2.2c0,0.1-0.1,0.1-0.1,0.1h-2.2c-0.1,0-0.1-0.1-0.1-0.1v-2.2
	C25.8,27.5,25.8,27.5,25.9,27.5z"/>
<linearGradient id="SVGID_113_" gradientUnits="userSpaceOnUse" x1="22.76" y1="9.045" x2="25.24" y2="9.045" gradientTransform="matrix(1 0 0 -1 0 37.73)">
	<stop  offset="0" style="stop-color:#CCCCCC"/>
	<stop  offset="1" style="stop-color:#F7F7F7"/>
</linearGradient>
<path class="st117" d="M22.9,27.5h2.2c0.1,0,0.1,0.1,0.1,0.1v2.2c0,0.1-0.1,0.1-0.1,0.1h-2.2c-0.1,0-0.1-0.1-0.1-0.1v-2.2
	C22.8,27.5,22.8,27.5,22.9,27.5z"/>
<linearGradient id="SVGID_114_" gradientUnits="userSpaceOnUse" x1="19.76" y1="9.045" x2="22.23" y2="9.045" gradientTransform="matrix(1 0 0 -1 0 37.73)">
	<stop  offset="0" style="stop-color:#CCCCCC"/>
	<stop  offset="1" style="stop-color:#F7F7F7"/>
</linearGradient>
<path class="st118" d="M19.9,27.5h2.2c0.1,0,0.1,0.1,0.1,0.1v2.2c0,0.1-0.1,0.1-0.1,0.1h-2.2c-0.1,0-0.1-0.1-0.1-0.1v-2.2
	C19.8,27.5,19.8,27.5,19.9,27.5z"/>
<linearGradient id="SVGID_115_" gradientUnits="userSpaceOnUse" x1="16.76" y1="9.045" x2="19.23" y2="9.045" gradientTransform="matrix(1 0 0 -1 0 37.73)">
	<stop  offset="0" style="stop-color:#CCCCCC"/>
	<stop  offset="1" style="stop-color:#F7F7F7"/>
</linearGradient>
<path class="st119" d="M16.9,27.5h2.2c0.1,0,0.1,0.1,0.1,0.1v2.2c0,0.1-0.1,0.1-0.1,0.1h-2.2c-0.1,0-0.1-0.1-0.1-0.1v-2.2
	C16.8,27.5,16.8,27.5,16.9,27.5z"/>
<linearGradient id="SVGID_116_" gradientUnits="userSpaceOnUse" x1="13.75" y1="9.045" x2="16.23" y2="9.045" gradientTransform="matrix(1 0 0 -1 0 37.73)">
	<stop  offset="0" style="stop-color:#CCCCCC"/>
	<stop  offset="1" style="stop-color:#F7F7F7"/>
</linearGradient>
<path class="st120" d="M13.9,27.5h2.2c0.1,0,0.1,0.1,0.1,0.1v2.2c0,0.1-0.1,0.1-0.1,0.1h-2.2c-0.1,0-0.1-0.1-0.1-0.1v-2.2
	C13.8,27.5,13.8,27.5,13.9,27.5z"/>
<linearGradient id="SVGID_117_" gradientUnits="userSpaceOnUse" x1="10.75" y1="9.045" x2="13.22" y2="9.045" gradientTransform="matrix(1 0 0 -1 0 37.73)">
	<stop  offset="0" style="stop-color:#CCCCCC"/>
	<stop  offset="1" style="stop-color:#F7F7F7"/>
</linearGradient>
<path class="st121" d="M10.9,27.5h2.2c0.1,0,0.1,0.1,0.1,0.1v2.2c0,0.1-0.1,0.1-0.1,0.1h-2.2c-0.1,0-0.1-0.1-0.1-0.1v-2.2
	C10.8,27.5,10.8,27.5,10.9,27.5z"/>
<path class="st2" d="M3.3,28.2h6.6c0.1,0,0.1,0.1,0.1,0.1l0,0v-0.8c0,0,0-0.1,0-0.1H9.4c0,0-0.1,0-0.1,0H8.6c0,0,0,0-0.1,0H3.3
	c0,0-0.1,0.1-0.1,0.1v0.8C3.2,28.2,3.3,28.2,3.3,28.2C3.3,28.2,3.3,28.2,3.3,28.2z"/>
<path class="st2" d="M38,27.5c0,0-0.1,0.1-0.1,0.1v0.8c0-0.1,0.1-0.1,0.1-0.1h6.5c0.1,0,0.1,0.1,0.1,0.1v-0.8c0-0.1-0.1-0.1-0.1-0.1
	h-0.1h-5c0,0-0.1,0-0.1,0h-0.8c0,0-0.1,0-0.1,0L38,27.5z"/>
<path class="st2" d="M34.9,27.5c-0.1,0-0.1,0.1-0.1,0.1v0.8c0-0.1,0.1-0.1,0.1-0.1h2.2c0.1,0,0.1,0.1,0.1,0.1v-0.8
	c0-0.1-0.1-0.1-0.1-0.1H34.9z"/>
<path class="st2" d="M31.9,27.5c-0.1,0-0.1,0.1-0.1,0.1v0.8c0-0.1,0.1-0.1,0.1-0.1h2.2c0.1,0,0.1,0.1,0.1,0.1v-0.8
	c0-0.1-0.1-0.1-0.1-0.1H31.9z"/>
<path class="st2" d="M28.9,27.5c-0.1,0-0.1,0.1-0.1,0.1v0.8c0-0.1,0.1-0.1,0.1-0.1h2.2c0.1,0,0.1,0.1,0.1,0.1v-0.8
	c0-0.1-0.1-0.1-0.1-0.1H28.9z"/>
<path class="st2" d="M25.9,27.5c-0.1,0-0.1,0.1-0.1,0.1v0.8c0-0.1,0.1-0.1,0.1-0.1h2.2c0.1,0,0.1,0.1,0.1,0.1v-0.8
	c0-0.1-0.1-0.1-0.1-0.1H25.9z"/>
<path class="st2" d="M22.9,27.5c-0.1,0-0.1,0.1-0.1,0.1v0.8c0-0.1,0.1-0.1,0.1-0.1h2.2c0.1,0,0.1,0.1,0.1,0.1v-0.8
	c0-0.1-0.1-0.1-0.1-0.1H22.9z"/>
<path class="st2" d="M19.9,27.5c-0.1,0-0.1,0.1-0.1,0.1v0.8c0-0.1,0.1-0.1,0.1-0.1h2.2c0.1,0,0.1,0.1,0.1,0.1v-0.8
	c0-0.1-0.1-0.1-0.1-0.1H19.9z"/>
<path class="st2" d="M16.9,27.5c-0.1,0-0.1,0.1-0.1,0.1v0.8c0-0.1,0.1-0.1,0.1-0.1h2.2c0.1,0,0.1,0.1,0.1,0.1v-0.8
	c0-0.1-0.1-0.1-0.1-0.1H16.9z"/>
<path class="st2" d="M13.9,27.5c-0.1,0-0.1,0.1-0.1,0.1v0.8c0-0.1,0.1-0.1,0.1-0.1h2.2c0.1,0,0.1,0.1,0.1,0.1v-0.8
	c0-0.1-0.1-0.1-0.1-0.1H13.9z"/>
<path class="st2" d="M10.9,27.5c-0.1,0-0.1,0.1-0.1,0.1v0.8c0-0.1,0.1-0.1,0.1-0.1h2.2c0.1,0,0.1,0.1,0.1,0.1v-0.8
	c0-0.1-0.1-0.1-0.1-0.1H10.9z"/>
<linearGradient id="SVGID_118_" gradientUnits="userSpaceOnUse" x1="5.18" y1="14.07" x2="5.18" y2="16.93" gradientTransform="matrix(1 0 0 -1 0 37.73)">
	<stop  offset="0" style="stop-color:#1A1A1A"/>
	<stop  offset="1" style="stop-color:#595959"/>
</linearGradient>
<path class="st122" d="M3,23.4v-2.3c0-0.1,0.1-0.3,0.3-0.3h3.8c0.1,0,0.3,0.1,0.3,0.3v2.3c0,0.1-0.1,0.3-0.3,0.3H3.3
	C3.1,23.7,3,23.5,3,23.4z"/>
<linearGradient id="SVGID_119_" gradientUnits="userSpaceOnUse" x1="5.18" y1="14.25" x2="5.18" y2="16.75" gradientTransform="matrix(1 0 0 -1 0 37.73)">
	<stop  offset="0" style="stop-color:#CCCCCC"/>
	<stop  offset="1" style="stop-color:#F7F7F7"/>
</linearGradient>
<path class="st123" d="M3.4,21H7c0.1,0,0.2,0.1,0.2,0.1v2.2c0,0.1-0.1,0.1-0.2,0.1H3.4c-0.1,0-0.2-0.1-0.2-0.1v-2.2
	C3.2,21,3.3,21,3.4,21z"/>
<linearGradient id="SVGID_120_" gradientUnits="userSpaceOnUse" x1="39.015" y1="14.08" x2="39.015" y2="16.92" gradientTransform="matrix(1 0 0 -1 0 37.73)">
	<stop  offset="0" style="stop-color:#1A1A1A"/>
	<stop  offset="1" style="stop-color:#595959"/>
</linearGradient>
<path class="st124" d="M37.9,20.8h2.2c0.2,0,0.3,0.1,0.3,0.3v2.2c0,0.2-0.1,0.3-0.3,0.3h-2.2c-0.2,0-0.3-0.1-0.3-0.3v-2.2
	C37.6,21,37.7,20.8,37.9,20.8z"/>
<linearGradient id="SVGID_121_" gradientUnits="userSpaceOnUse" x1="36.015" y1="14.08" x2="36.015" y2="16.92" gradientTransform="matrix(1 0 0 -1 0 37.73)">
	<stop  offset="0" style="stop-color:#1A1A1A"/>
	<stop  offset="1" style="stop-color:#595959"/>
</linearGradient>
<path class="st125" d="M34.9,20.8h2.2c0.2,0,0.3,0.1,0.3,0.3v2.2c0,0.2-0.1,0.3-0.3,0.3h-2.2c-0.2,0-0.3-0.1-0.3-0.3v-2.2
	C34.6,21,34.7,20.8,34.9,20.8z"/>
<linearGradient id="SVGID_122_" gradientUnits="userSpaceOnUse" x1="33.015" y1="14.08" x2="33.015" y2="16.92" gradientTransform="matrix(1 0 0 -1 0 37.73)">
	<stop  offset="0" style="stop-color:#1A1A1A"/>
	<stop  offset="1" style="stop-color:#595959"/>
</linearGradient>
<path class="st126" d="M31.9,20.8h2.2c0.2,0,0.3,0.1,0.3,0.3v2.2c0,0.2-0.1,0.3-0.3,0.3h-2.2c-0.2,0-0.3-0.1-0.3-0.3v-2.2
	C31.6,21,31.7,20.8,31.9,20.8z"/>
<linearGradient id="SVGID_123_" gradientUnits="userSpaceOnUse" x1="30.005" y1="14.08" x2="30.005" y2="16.92" gradientTransform="matrix(1 0 0 -1 0 37.73)">
	<stop  offset="0" style="stop-color:#1A1A1A"/>
	<stop  offset="1" style="stop-color:#595959"/>
</linearGradient>
<path class="st127" d="M28.9,20.8h2.2c0.2,0,0.3,0.1,0.3,0.3v2.2c0,0.2-0.1,0.3-0.3,0.3h-2.2c-0.2,0-0.3-0.1-0.3-0.3v-2.2
	C28.6,21,28.7,20.8,28.9,20.8z"/>
<linearGradient id="SVGID_124_" gradientUnits="userSpaceOnUse" x1="27.005" y1="14.08" x2="27.005" y2="16.92" gradientTransform="matrix(1 0 0 -1 0 37.73)">
	<stop  offset="0" style="stop-color:#1A1A1A"/>
	<stop  offset="1" style="stop-color:#595959"/>
</linearGradient>
<path class="st128" d="M25.9,20.8h2.2c0.2,0,0.3,0.1,0.3,0.3v2.2c0,0.2-0.1,0.3-0.3,0.3h-2.2c-0.2,0-0.3-0.1-0.3-0.3v-2.2
	C25.6,21,25.7,20.8,25.9,20.8z"/>
<linearGradient id="SVGID_125_" gradientUnits="userSpaceOnUse" x1="23.995" y1="14.08" x2="23.995" y2="16.92" gradientTransform="matrix(1 0 0 -1 0 37.73)">
	<stop  offset="0" style="stop-color:#1A1A1A"/>
	<stop  offset="1" style="stop-color:#595959"/>
</linearGradient>
<path class="st129" d="M22.9,20.8h2.2c0.2,0,0.3,0.1,0.3,0.3v2.2c0,0.2-0.1,0.3-0.3,0.3h-2.2c-0.2,0-0.3-0.1-0.3-0.3v-2.2
	C22.6,21,22.7,20.8,22.9,20.8z"/>
<linearGradient id="SVGID_126_" gradientUnits="userSpaceOnUse" x1="20.995" y1="14.08" x2="20.995" y2="16.92" gradientTransform="matrix(1 0 0 -1 0 37.73)">
	<stop  offset="0" style="stop-color:#1A1A1A"/>
	<stop  offset="1" style="stop-color:#595959"/>
</linearGradient>
<path class="st130" d="M19.9,20.8h2.2c0.2,0,0.3,0.1,0.3,0.3v2.2c0,0.2-0.1,0.3-0.3,0.3h-2.2c-0.2,0-0.3-0.1-0.3-0.3v-2.2
	C19.6,21,19.7,20.8,19.9,20.8z"/>
<linearGradient id="SVGID_127_" gradientUnits="userSpaceOnUse" x1="17.995" y1="14.08" x2="17.995" y2="16.92" gradientTransform="matrix(1 0 0 -1 0 37.73)">
	<stop  offset="0" style="stop-color:#1A1A1A"/>
	<stop  offset="1" style="stop-color:#595959"/>
</linearGradient>
<path class="st131" d="M16.9,20.8h2.2c0.2,0,0.3,0.1,0.3,0.3v2.2c0,0.2-0.1,0.3-0.3,0.3h-2.2c-0.2,0-0.3-0.1-0.3-0.3v-2.2
	C16.6,21,16.7,20.8,16.9,20.8z"/>
<linearGradient id="SVGID_128_" gradientUnits="userSpaceOnUse" x1="14.985" y1="14.08" x2="14.985" y2="16.92" gradientTransform="matrix(1 0 0 -1 0 37.73)">
	<stop  offset="0" style="stop-color:#1A1A1A"/>
	<stop  offset="1" style="stop-color:#595959"/>
</linearGradient>
<path class="st132" d="M13.9,20.8h2.2c0.2,0,0.3,0.1,0.3,0.3v2.2c0,0.2-0.1,0.3-0.3,0.3h-2.2c-0.2,0-0.3-0.1-0.3-0.3v-2.2
	C13.6,21,13.7,20.8,13.9,20.8z"/>
<linearGradient id="SVGID_129_" gradientUnits="userSpaceOnUse" x1="11.985" y1="14.08" x2="11.985" y2="16.92" gradientTransform="matrix(1 0 0 -1 0 37.73)">
	<stop  offset="0" style="stop-color:#1A1A1A"/>
	<stop  offset="1" style="stop-color:#595959"/>
</linearGradient>
<path class="st133" d="M10.9,20.8h2.2c0.2,0,0.3,0.1,0.3,0.3v2.2c0,0.2-0.1,0.3-0.3,0.3h-2.2c-0.2,0-0.3-0.1-0.3-0.3v-2.2
	C10.6,21,10.7,20.8,10.9,20.8z"/>
<linearGradient id="SVGID_130_" gradientUnits="userSpaceOnUse" x1="8.975" y1="14.08" x2="8.975" y2="16.92" gradientTransform="matrix(1 0 0 -1 0 37.73)">
	<stop  offset="0" style="stop-color:#1A1A1A"/>
	<stop  offset="1" style="stop-color:#595959"/>
</linearGradient>
<path class="st134" d="M7.9,20.8h2.2c0.2,0,0.3,0.1,0.3,0.3v2.2c0,0.2-0.1,0.3-0.3,0.3H7.9c-0.2,0-0.3-0.1-0.3-0.3v-2.2
	C7.6,21,7.7,20.8,7.9,20.8z"/>
<linearGradient id="SVGID_131_" gradientUnits="userSpaceOnUse" x1="37.78" y1="15.505" x2="40.26" y2="15.505" gradientTransform="matrix(1 0 0 -1 0 37.73)">
	<stop  offset="0" style="stop-color:#CCCCCC"/>
	<stop  offset="1" style="stop-color:#F7F7F7"/>
</linearGradient>
<path class="st135" d="M37.9,21h2.2c0.1,0,0.1,0.1,0.1,0.1v2.2c0,0.1-0.1,0.1-0.1,0.1h-2.2c-0.1,0-0.1-0.1-0.1-0.1v-2.2
	C37.8,21.1,37.8,21,37.9,21z"/>
<linearGradient id="SVGID_132_" gradientUnits="userSpaceOnUse" x1="34.78" y1="15.505" x2="37.25" y2="15.505" gradientTransform="matrix(1 0 0 -1 0 37.73)">
	<stop  offset="0" style="stop-color:#CCCCCC"/>
	<stop  offset="1" style="stop-color:#F7F7F7"/>
</linearGradient>
<path class="st136" d="M34.9,21h2.2c0.1,0,0.1,0.1,0.1,0.1v2.2c0,0.1-0.1,0.1-0.1,0.1h-2.2c-0.1,0-0.1-0.1-0.1-0.1v-2.2
	C34.8,21.1,34.8,21,34.9,21z"/>
<linearGradient id="SVGID_133_" gradientUnits="userSpaceOnUse" x1="31.77" y1="15.505" x2="34.25" y2="15.505" gradientTransform="matrix(1 0 0 -1 0 37.73)">
	<stop  offset="0" style="stop-color:#CCCCCC"/>
	<stop  offset="1" style="stop-color:#F7F7F7"/>
</linearGradient>
<path class="st137" d="M31.9,21h2.2c0.1,0,0.1,0.1,0.1,0.1v2.2c0,0.1-0.1,0.1-0.1,0.1h-2.2c-0.1,0-0.1-0.1-0.1-0.1v-2.2
	C31.8,21.1,31.8,21,31.9,21z"/>
<linearGradient id="SVGID_134_" gradientUnits="userSpaceOnUse" x1="28.77" y1="15.505" x2="31.24" y2="15.505" gradientTransform="matrix(1 0 0 -1 0 37.73)">
	<stop  offset="0" style="stop-color:#CCCCCC"/>
	<stop  offset="1" style="stop-color:#F7F7F7"/>
</linearGradient>
<path class="st138" d="M28.9,21h2.2c0.1,0,0.1,0.1,0.1,0.1v2.2c0,0.1-0.1,0.1-0.1,0.1h-2.2c-0.1,0-0.1-0.1-0.1-0.1v-2.2
	C28.8,21.1,28.8,21,28.9,21z"/>
<linearGradient id="SVGID_135_" gradientUnits="userSpaceOnUse" x1="25.77" y1="15.505" x2="28.24" y2="15.505" gradientTransform="matrix(1 0 0 -1 0 37.73)">
	<stop  offset="0" style="stop-color:#CCCCCC"/>
	<stop  offset="1" style="stop-color:#F7F7F7"/>
</linearGradient>
<path class="st139" d="M25.9,21h2.2c0.1,0,0.1,0.1,0.1,0.1v2.2c0,0.1-0.1,0.1-0.1,0.1h-2.2c-0.1,0-0.1-0.1-0.1-0.1v-2.2
	C25.8,21.1,25.8,21,25.9,21z"/>
<linearGradient id="SVGID_136_" gradientUnits="userSpaceOnUse" x1="22.76" y1="15.505" x2="25.24" y2="15.505" gradientTransform="matrix(1 0 0 -1 0 37.73)">
	<stop  offset="0" style="stop-color:#CCCCCC"/>
	<stop  offset="1" style="stop-color:#F7F7F7"/>
</linearGradient>
<path class="st140" d="M22.9,21h2.2c0.1,0,0.1,0.1,0.1,0.1v2.2c0,0.1-0.1,0.1-0.1,0.1h-2.2c-0.1,0-0.1-0.1-0.1-0.1v-2.2
	C22.8,21.1,22.8,21,22.9,21z"/>
<linearGradient id="SVGID_137_" gradientUnits="userSpaceOnUse" x1="19.76" y1="15.505" x2="22.23" y2="15.505" gradientTransform="matrix(1 0 0 -1 0 37.73)">
	<stop  offset="0" style="stop-color:#CCCCCC"/>
	<stop  offset="1" style="stop-color:#F7F7F7"/>
</linearGradient>
<path class="st141" d="M19.9,21h2.2c0.1,0,0.1,0.1,0.1,0.1v2.2c0,0.1-0.1,0.1-0.1,0.1h-2.2c-0.1,0-0.1-0.1-0.1-0.1v-2.2
	C19.8,21.1,19.8,21,19.9,21z"/>
<linearGradient id="SVGID_138_" gradientUnits="userSpaceOnUse" x1="16.76" y1="15.505" x2="19.23" y2="15.505" gradientTransform="matrix(1 0 0 -1 0 37.73)">
	<stop  offset="0" style="stop-color:#CCCCCC"/>
	<stop  offset="1" style="stop-color:#F7F7F7"/>
</linearGradient>
<path class="st142" d="M16.9,21h2.2c0.1,0,0.1,0.1,0.1,0.1v2.2c0,0.1-0.1,0.1-0.1,0.1h-2.2c-0.1,0-0.1-0.1-0.1-0.1v-2.2
	C16.8,21.1,16.8,21,16.9,21z"/>
<linearGradient id="SVGID_139_" gradientUnits="userSpaceOnUse" x1="13.75" y1="15.505" x2="16.23" y2="15.505" gradientTransform="matrix(1 0 0 -1 0 37.73)">
	<stop  offset="0" style="stop-color:#CCCCCC"/>
	<stop  offset="1" style="stop-color:#F7F7F7"/>
</linearGradient>
<path class="st143" d="M13.9,21h2.2c0.1,0,0.1,0.1,0.1,0.1v2.2c0,0.1-0.1,0.1-0.1,0.1h-2.2c-0.1,0-0.1-0.1-0.1-0.1v-2.2
	C13.8,21.1,13.8,21,13.9,21z"/>
<linearGradient id="SVGID_140_" gradientUnits="userSpaceOnUse" x1="10.75" y1="15.505" x2="13.22" y2="15.505" gradientTransform="matrix(1 0 0 -1 0 37.73)">
	<stop  offset="0" style="stop-color:#CCCCCC"/>
	<stop  offset="1" style="stop-color:#F7F7F7"/>
</linearGradient>
<path class="st144" d="M10.9,21h2.2c0.1,0,0.1,0.1,0.1,0.1v2.2c0,0.1-0.1,0.1-0.1,0.1h-2.2c-0.1,0-0.1-0.1-0.1-0.1v-2.2
	C10.8,21.1,10.8,21,10.9,21z"/>
<linearGradient id="SVGID_141_" gradientUnits="userSpaceOnUse" x1="7.74" y1="15.505" x2="10.22" y2="15.505" gradientTransform="matrix(1 0 0 -1 0 37.73)">
	<stop  offset="0" style="stop-color:#CCCCCC"/>
	<stop  offset="1" style="stop-color:#F7F7F7"/>
</linearGradient>
<path class="st145" d="M7.9,21h2.2c0.1,0,0.1,0.1,0.1,0.1v2.2c0,0.1-0.1,0.1-0.1,0.1H7.9c-0.1,0-0.1-0.1-0.1-0.1v-2.2
	C7.7,21.1,7.8,21,7.9,21z"/>
<path class="st2" d="M3.3,21.7H7c0.1,0,0.1,0.1,0.1,0.1l0,0v-0.8c0,0,0-0.1,0-0.1H6.4c0,0,0,0-0.1,0H5.6c0,0,0,0-0.1,0H3.4
	c0,0,0,0-0.1,0c-0.1,0-0.1,0.1-0.1,0.1v0.8C3.2,21.8,3.2,21.7,3.3,21.7C3.3,21.7,3.3,21.7,3.3,21.7z"/>
<path class="st2" d="M37.9,21c-0.1,0-0.1,0.1-0.1,0.1v0.8c0-0.1,0.1-0.1,0.1-0.1h2.2c0.1,0,0.1,0.1,0.1,0.1v-0.8
	c0-0.1,0-0.1-0.1-0.1H37.9z"/>
<path class="st2" d="M34.9,21c-0.1,0-0.1,0.1-0.1,0.1v0.8c0-0.1,0.1-0.1,0.1-0.1h2.2c0.1,0,0.1,0.1,0.1,0.1v-0.8
	c0-0.1,0-0.1-0.1-0.1H34.9z"/>
<path class="st2" d="M31.9,21c-0.1,0-0.1,0.1-0.1,0.1v0.8c0-0.1,0.1-0.1,0.1-0.1h2.2c0.1,0,0.1,0.1,0.1,0.1v-0.8
	c0-0.1,0-0.1-0.1-0.1H31.9z"/>
<path class="st2" d="M28.9,21c-0.1,0-0.1,0.1-0.1,0.1v0.8c0-0.1,0.1-0.1,0.1-0.1h2.2c0.1,0,0.1,0.1,0.1,0.1v-0.8
	c0-0.1,0-0.1-0.1-0.1H28.9z"/>
<path class="st2" d="M25.9,21c-0.1,0-0.1,0.1-0.1,0.1v0.8c0-0.1,0.1-0.1,0.1-0.1h2.2c0.1,0,0.1,0.1,0.1,0.1v-0.8
	c0-0.1,0-0.1-0.1-0.1H25.9z"/>
<path class="st2" d="M22.9,21c-0.1,0-0.1,0.1-0.1,0.1v0.8c0-0.1,0.1-0.1,0.1-0.1h2.2c0.1,0,0.1,0.1,0.1,0.1v-0.8
	c0-0.1,0-0.1-0.1-0.1H22.9z"/>
<path class="st2" d="M19.9,21c-0.1,0-0.1,0.1-0.1,0.1v0.8c0-0.1,0.1-0.1,0.1-0.1h2.2c0.1,0,0.1,0.1,0.1,0.1v-0.8
	c0-0.1,0-0.1-0.1-0.1H19.9z"/>
<path class="st2" d="M16.9,21c-0.1,0-0.1,0.1-0.1,0.1v0.8c0-0.1,0.1-0.1,0.1-0.1h2.2c0.1,0,0.1,0.1,0.1,0.1v-0.8
	c0-0.1,0-0.1-0.1-0.1H16.9z"/>
<path class="st2" d="M13.9,21c-0.1,0-0.1,0.1-0.1,0.1v0.8c0-0.1,0.1-0.1,0.1-0.1h2.2c0.1,0,0.1,0.1,0.1,0.1v-0.8
	c0-0.1,0-0.1-0.1-0.1H13.9z"/>
<path class="st2" d="M10.9,21c-0.1,0-0.1,0.1-0.1,0.1v0.8c0-0.1,0.1-0.1,0.1-0.1h2.2c0.1,0,0.1,0.1,0.1,0.1v-0.8
	c0-0.1,0-0.1-0.1-0.1H10.9z"/>
<path class="st2" d="M7.9,21c-0.1,0-0.1,0.1-0.1,0.1v0.8c0-0.1,0.1-0.1,0.1-0.1h2.2c0.1,0,0.1,0.1,0.1,0.1v-0.8
	c0-0.1-0.1-0.1-0.1-0.1H7.9z"/>
<linearGradient id="SVGID_142_" gradientUnits="userSpaceOnUse" x1="5.895" y1="10.85" x2="5.895" y2="13.71" gradientTransform="matrix(1 0 0 -1 0 37.73)">
	<stop  offset="0" style="stop-color:#1A1A1A"/>
	<stop  offset="1" style="stop-color:#595959"/>
</linearGradient>
<path class="st146" d="M3,26.6v-2.3C3,24.1,3.1,24,3.3,24h5.2c0.1,0,0.3,0.1,0.3,0.3v2.3c0,0.1-0.1,0.3-0.3,0.3H3.3
	C3.1,26.9,3,26.8,3,26.6z"/>
<linearGradient id="SVGID_143_" gradientUnits="userSpaceOnUse" x1="5.895" y1="11.03" x2="5.895" y2="13.54" gradientTransform="matrix(1 0 0 -1 0 37.73)">
	<stop  offset="0" style="stop-color:#CCCCCC"/>
	<stop  offset="1" style="stop-color:#F7F7F7"/>
</linearGradient>
<path class="st147" d="M3.3,24.2h5.2c0.1,0,0.1,0,0.1,0.1v2.3c0,0.1,0,0.1-0.1,0.1H3.3c-0.1,0-0.1,0-0.1-0.1v-2.3
	C3.2,24.2,3.3,24.2,3.3,24.2z"/>
<linearGradient id="SVGID_144_" gradientUnits="userSpaceOnUse" x1="42.0899" y1="10.85" x2="42.0899" y2="16.94" gradientTransform="matrix(1 0 0 -1 0 37.73)">
	<stop  offset="0" style="stop-color:#1A1A1A"/>
	<stop  offset="1" style="stop-color:#595959"/>
</linearGradient>
<path class="st148" d="M39.6,26.9c-0.2,0-0.4-0.2-0.4-0.4c0,0,0,0,0,0v-2.1c0-0.2,0.2-0.4,0.3-0.4c0,0,0,0,0,0H41v-2.9
	c0-0.2,0.2-0.4,0.4-0.4l0,0h3.2c0.2,0,0.4,0.2,0.4,0.4c0,0,0,0,0,0v5.4c0,0.2-0.2,0.4-0.4,0.4l0,0L39.6,26.9z"/>
<linearGradient id="SVGID_145_" gradientUnits="userSpaceOnUse" x1="42.1" y1="11.03" x2="42.1" y2="16.76" gradientTransform="matrix(1 0 0 -1 0 37.73)">
	<stop  offset="0" style="stop-color:#CCCCCC"/>
	<stop  offset="1" style="stop-color:#F7F7F7"/>
</linearGradient>
<path class="st149" d="M41.2,21.2V24c0,0.1-0.1,0.2-0.2,0.2l0,0h-1.4c-0.1,0-0.2,0.1-0.2,0.2l0,0v2.1c0,0.1,0.1,0.2,0.2,0.2l0,0h5
	c0.1,0,0.2-0.1,0.2-0.2l0,0v-5.4c0-0.1-0.1-0.2-0.2-0.2l0,0h-3.2C41.3,21,41.2,21.1,41.2,21.2L41.2,21.2z"/>
<path class="st2" d="M3.3,24.9h5.2c0,0,0.1,0,0.1,0.1v-0.8c0,0,0,0,0-0.1H7.9H7.8H7.1c0,0-0.1,0-0.1,0H3.3c0,0,0,0-0.1,0
	c0,0,0,0,0,0.1L3.3,24.9C3.2,25,3.3,24.9,3.3,24.9z"/>
<path class="st2" d="M39.4,24.4v0.8c0-0.1,0.1-0.2,0.2-0.2l0,0H41c0.1,0,0.2-0.1,0.2-0.2l0,0V24c0,0.1-0.1,0.2-0.2,0.2l0,0h-0.9h0
	h-0.6C39.4,24.2,39.4,24.3,39.4,24.4z"/>
<path class="st2" d="M41.3,21c-0.1,0-0.1,0.1-0.1,0.1v0.8c0-0.1,0.1-0.2,0.2-0.2l0,0h3.2c0.1,0,0.2,0.1,0.2,0.2l0,0v-0.8
	c0-0.1-0.1-0.1-0.1-0.2l0,0h-2.2c0,0-0.1,0-0.1,0h-0.7c0,0-0.1,0-0.1,0L41.3,21z"/>
<path class="st2" d="M36.4,25h2.2c0.1,0,0.1,0.1,0.1,0.1v-0.8c0-0.1-0.1-0.1-0.1-0.1h-2.2c-0.1,0-0.1,0.1-0.1,0.1v0.8
	C36.3,25.1,36.3,25,36.4,25z"/>
<path class="st2" d="M33.4,25h2.2c0.1,0,0.1,0.1,0.1,0.1v-0.8c0-0.1-0.1-0.1-0.1-0.1h-2.2c-0.1,0-0.1,0.1-0.1,0.1v0.8
	C33.3,25.1,33.3,25,33.4,25z"/>
<path class="st2" d="M30.4,25h2.2c0.1,0,0.1,0.1,0.1,0.1v-0.8c0-0.1-0.1-0.1-0.1-0.1h-2.2c-0.1,0-0.1,0.1-0.1,0.1v0.8
	C30.3,25.1,30.3,25,30.4,25z"/>
<path class="st2" d="M27.4,25h2.2c0.1,0,0.1,0.1,0.1,0.1v-0.8c0-0.1-0.1-0.1-0.1-0.1h-2.2c-0.1,0-0.1,0.1-0.1,0.1v0.8
	C27.3,25.1,27.3,25,27.4,25z"/>
<path class="st2" d="M24.4,25h2.2c0.1,0,0.1,0.1,0.1,0.1v-0.8c0-0.1-0.1-0.1-0.1-0.1h-2.2c-0.1,0-0.1,0.1-0.1,0.1v0.8
	C24.3,25.1,24.3,25,24.4,25z"/>
<path class="st2" d="M21.4,25h2.2c0.1,0,0.1,0.1,0.1,0.1v-0.8c0-0.1-0.1-0.1-0.1-0.1h-2.2c-0.1,0-0.1,0.1-0.1,0.1v0.8
	C21.3,25.1,21.3,25,21.4,25z"/>
<path class="st2" d="M18.4,25h2.2c0.1,0,0.1,0.1,0.1,0.1v-0.8c0-0.1-0.1-0.1-0.1-0.1h-2.2c-0.1,0-0.1,0.1-0.1,0.1v0.8
	C18.3,25.1,18.3,25,18.4,25z"/>
<path class="st2" d="M15.4,25h2.2c0.1,0,0.1,0.1,0.1,0.1v-0.8c0-0.1-0.1-0.1-0.1-0.1h-2.2c-0.1,0-0.1,0.1-0.1,0.1v0.8
	C15.3,25.1,15.3,25,15.4,25z"/>
<path class="st2" d="M12.4,25h2.2c0.1,0,0.1,0.1,0.1,0.1v-0.8c0-0.1-0.1-0.1-0.1-0.1h-2.2c-0.1,0-0.1,0.1-0.1,0.1v0.8
	C12.2,25.1,12.3,25,12.4,25z"/>
<path class="st2" d="M9.4,24.2c-0.1,0-0.1,0.1-0.1,0.1v0.8c0-0.1,0.1-0.1,0.1-0.1h2.2c0.1,0,0.1,0.1,0.1,0.1v-0.8
	c0-0.1-0.1-0.1-0.1-0.1L9.4,24.2z"/>
</svg>
