<?xml version="1.0" encoding="utf-8"?>
<!-- Generator: Adobe Illustrator 21.0.0, SVG Export Plug-In . SVG Version: 6.00 Build 0)  -->
<svg version="1.1" id="katman_1" xmlns="http://www.w3.org/2000/svg" xmlns:xlink="http://www.w3.org/1999/xlink" x="0px" y="0px"
	 viewBox="0 0 15.8 16" style="enable-background:new 0 0 15.8 16;" xml:space="preserve">
<style type="text/css">
	.st0{fill:url(#_Yol__1_);}
	.st1{fill:#FFFFFF;}
	.st2{opacity:0.5;fill:#20396E;enable-background:new    ;}
	.st3{fill:#EAF6FE;}
	.st4{fill:none;}
	.st5{opacity:0.1;fill:#FFFFFF;enable-background:new    ;}
	.st6{opacity:0.2;enable-background:new    ;}
</style>
<title>preferences-desktop_5</title>
<linearGradient id="_Yol__1_" gradientUnits="userSpaceOnUse" x1="7.91" y1="0.7" x2="7.91" y2="15.06" gradientTransform="matrix(1 0 0 -1 0 15.73)">
	<stop  offset="0" style="stop-color:#2D5778"/>
	<stop  offset="0.39" style="stop-color:#2D5A7C"/>
	<stop  offset="0.74" style="stop-color:#2B6286"/>
	<stop  offset="1" style="stop-color:#2A6D94"/>
</linearGradient>
<path id="_Yol_" class="st0" d="M1,14.6V1l0,0h13.8l0,0v13.6L1,14.6L1,14.6z"/>
<rect x="11.2" y="7.2" class="st1" width="1.1" height="7.5"/>
<rect x="11.2" y="0.9" class="st1" width="1.1" height="3"/>
<rect x="7.3" y="10.8" class="st1" width="1.1" height="3.9"/>
<rect x="7.3" y="1" class="st1" width="1.1" height="6.5"/>
<rect x="3.4" y="7.4" class="st1" width="1.1" height="7.3"/>
<rect x="3.4" y="1" class="st1" width="1.1" height="3"/>
<rect x="11.1" y="7.1" class="st2" width="1.3" height="7.8"/>
<rect x="11.2" y="7.2" class="st3" width="1.1" height="7.5"/>
<rect x="11.1" y="0.7" class="st2" width="1.3" height="3.2"/>
<rect x="11.2" y="0.9" class="st3" width="1.1" height="3"/>
<rect x="7.2" y="10.6" class="st2" width="1.3" height="4.2"/>
<rect x="7.3" y="10.8" class="st3" width="1.1" height="3.9"/>
<rect x="7.2" y="0.8" class="st2" width="1.3" height="6.8"/>
<rect x="7.3" y="1" class="st3" width="1.1" height="6.5"/>
<rect x="3.3" y="7.3" class="st2" width="1.3" height="7.6"/>
<rect x="3.4" y="7.4" class="st3" width="1.1" height="7.3"/>
<rect x="3.3" y="0.9" class="st2" width="1.3" height="3.2"/>
<rect x="3.4" y="1" class="st3" width="1.1" height="3"/>
<rect x="0.7" y="0.6" class="st4" width="14.4" height="14.4"/>
<rect x="1" y="14.6" class="st1" width="13.7" height="0.2"/>
<path class="st1" d="M15.4,0.1h-15c-0.2,0-0.3,0.1-0.3,0.3c0,0,0,0,0,0v0.2c0-0.2,0.1-0.3,0.3-0.3l0,0h15c0.2,0,0.3,0.1,0.3,0.3
	c0,0,0,0,0,0V0.4C15.7,0.3,15.6,0.1,15.4,0.1C15.4,0.1,15.4,0.1,15.4,0.1z"/>
<path class="st2" d="M0.4,15.6c-0.2,0-0.4-0.2-0.4-0.4c0,0,0,0,0,0V0.4C0,0.2,0.2,0,0.4,0h15c0.2,0,0.4,0.2,0.4,0.4v14.8
	c0,0.2-0.2,0.4-0.4,0.4l0,0H0.4z M14.6,14.5V1.2H1.2v13.3H14.6z"/>
<path id="_Bileşik_Yol_" class="st3" d="M15.4,0.1h-15c-0.2,0-0.3,0.1-0.3,0.3c0,0,0,0,0,0v14.8c0,0.2,0.1,0.3,0.3,0.3c0,0,0,0,0,0
	h15c0.2,0,0.3-0.1,0.3-0.3c0,0,0,0,0,0V0.4C15.7,0.2,15.6,0.1,15.4,0.1z M14.8,14.6H1V1l0,0h13.8l0,0V14.6z"/>
<circle class="st2" cx="3.9" cy="6.3" r="1.6"/>
<circle class="st3" cx="3.9" cy="6.3" r="1.5"/>
<circle class="st2" cx="7.8" cy="9.8" r="1.6"/>
<circle class="st3" cx="7.8" cy="9.8" r="1.5"/>
<circle class="st2" cx="11.7" cy="6.3" r="1.6"/>
<circle class="st3" cx="11.7" cy="6.3" r="1.5"/>
<polygon class="st5" points="14.8,14.6 14.8,14.6 1,14.6 1,15.1 14.8,15.1 14.8,14.6 "/>
<path class="st5" d="M15.4,0.1h-15c-0.2,0-0.3,0.1-0.3,0.3c0,0,0,0,0,0v0.5c0-0.2,0.1-0.3,0.3-0.3l0,0h15c0.2,0,0.3,0.1,0.3,0.3V0.4
	C15.7,0.2,15.6,0.1,15.4,0.1C15.4,0.1,15.4,0.1,15.4,0.1z"/>
<path class="st6" d="M13.9,1.5h0.9V1l0,0H1.1v0.5l0,0L13.9,1.5L13.9,1.5z"/>
<path class="st6" d="M15.4,15.5h-15c-0.2,0-0.3-0.1-0.3-0.3c0,0,0,0,0,0v0.5c0,0.2,0.1,0.3,0.3,0.3c0,0,0,0,0,0h15
	c0.2,0,0.3-0.1,0.3-0.3c0,0,0,0,0,0v-0.5C15.7,15.4,15.6,15.5,15.4,15.5C15.4,15.5,15.4,15.5,15.4,15.5z"/>
<path class="st5" d="M3.9,5.3c0.7,0,1.3,0.5,1.5,1.2C5.5,5.7,5,4.9,4.2,4.8S2.6,5.2,2.5,6c0,0.2,0,0.4,0,0.5
	C2.6,5.8,3.2,5.3,3.9,5.3z"/>
<path class="st6" d="M3.9,7.8c-0.7,0-1.3-0.5-1.5-1.2C2.3,7.3,2.8,8.1,3.7,8.2s1.6-0.4,1.7-1.2c0-0.2,0-0.4,0-0.5
	C5.3,7.2,4.7,7.7,3.9,7.8z"/>
<path class="st5" d="M7.8,8.8c0.7,0,1.3,0.5,1.5,1.2c0.2-0.8-0.4-1.6-1.2-1.7S6.5,8.6,6.4,9.5c0,0.2,0,0.4,0,0.5
	C6.5,9.3,7.1,8.8,7.8,8.8z"/>
<path class="st6" d="M7.8,11.3c-0.7,0-1.4-0.5-1.5-1.3c-0.2,0.8,0.4,1.6,1.2,1.7s1.6-0.4,1.7-1.2c0-0.2,0-0.4,0-0.5
	C9.2,10.7,8.6,11.3,7.8,11.3z"/>
<path class="st5" d="M11.7,5.3c0.7,0,1.3,0.5,1.5,1.2c0.2-0.8-0.4-1.6-1.2-1.7c-0.8-0.2-1.6,0.4-1.7,1.2c0,0.2,0,0.4,0,0.5
	C10.4,5.8,11,5.3,11.7,5.3z"/>
<path class="st6" d="M11.7,7.8c-0.7,0-1.3-0.5-1.5-1.2c-0.2,0.8,0.4,1.6,1.2,1.7c0.8,0.2,1.6-0.4,1.7-1.2c0-0.2,0-0.4,0-0.5
	C13.1,7.2,12.4,7.8,11.7,7.8z"/>
</svg>
