<?xml version="1.0" encoding="utf-8"?>
<!-- Generator: Adobe Illustrator 21.0.0, SVG Export Plug-In . SVG Version: 6.00 Build 0)  -->
<svg version="1.1" id="katman_1" xmlns="http://www.w3.org/2000/svg" xmlns:xlink="http://www.w3.org/1999/xlink" x="0px" y="0px"
	 viewBox="0 0 31 32" style="enable-background:new 0 0 31 32;" xml:space="preserve">
<style type="text/css">
	.st0{fill:#333333;}
	.st1{fill:#C6C6C5;}
	.st2{fill:#9C9B9B;}
	.st3{fill:#D9D9D9;}
	.st4{fill:#B1B1B1;}
	.st5{opacity:0.2;enable-background:new    ;}
	.st6{opacity:0.1;fill:#FFFFFF;enable-background:new    ;}
	.st7{fill:url(#SVGID_1_);}
	.st8{opacity:0.2;}
	.st9{fill:url(#SVGID_2_);}
	.st10{fill:#FFC900;}
</style>
<title>Varlık 16</title>
<path class="st0" d="M7.6,31.1h-3c-0.3,0-0.6-0.2-0.6-0.5L0,10.2l5-3.9L7,0l8.4,2L24,0l2,6.3l5,3.9L30.9,11l-3.2,19.6
	c0,0.3-0.3,0.5-0.6,0.5L7.6,31.1z"/>
<polygon id="_Yol_" class="st1" points="15.6,10.3 23.9,10.3 23.9,0.2 15.5,2.1 "/>
<polygon id="_Yol_2" class="st2" points="15.6,10.3 7.2,10.3 7.2,0.2 15.5,2.1 "/>
<polygon id="_Yol_3" class="st3" points="2.4,21.8 7.2,21.8 7.2,0.2 5.2,6.4 0.2,10.3 "/>
<polygon id="_Yol_4" class="st3" points="28.7,21.8 23.9,21.8 23.9,0.2 25.9,6.4 30.9,10.3 "/>
<polygon id="_Yol_5" class="st4" points="23.9,21.8 23.9,0.2 25.9,6.4 "/>
<polygon id="_Yol_6" class="st4" points="7.2,21.8 7.2,0.2 5.2,6.4 "/>
<path class="st5" d="M29.7,9.4H7.4H7.3l0,0C7.1,9.5,7,9.6,6.9,9.7l-1.8,4.5L3.4,9.8C3.3,9.6,3.1,9.5,2.9,9.5H1.3l-1.3,1h2.9
	c0.2,0,0.4,0.1,0.5,0.3l1.7,4.5l1.8-4.5c0.1-0.1,0.2-0.2,0.3-0.3l0,0h0.1H31L29.7,9.4z"/>
<polygon class="st6" points="15.5,2.1 15.5,3.1 23.9,1.1 23.9,0.2 "/>
<polygon class="st6" points="15.6,10.3 15.6,10.3 15.5,2.1 7.2,0.2 7.2,1.1 15.5,3.1 "/>
<linearGradient id="SVGID_1_" gradientUnits="userSpaceOnUse" x1="11.6597" y1="15.7806" x2="-2.5903" y2="7.2906" gradientTransform="matrix(1 0 0 -1 0 31.73)">
	<stop  offset="0" style="stop-color:#E7E6E6"/>
	<stop  offset="0.38" style="stop-color:#C8C7C7"/>
	<stop  offset="0.77" style="stop-color:#ADAEAE"/>
	<stop  offset="1" style="stop-color:#A3A4A4"/>
</linearGradient>
<path class="st7" d="M4.6,31h2.8V10.3L6,17l-2.5-6.4c-0.1-0.2-0.3-0.3-0.5-0.3H0.2l3.9,20.3C4.1,30.8,4.4,31,4.6,31z"/>
<g class="st8">
	<path d="M4.1,30.6v-0.1H3.9l0.2,1.1c0,0.2,0.2,0.4,0.5,0.4h2.8v-1H4.6C4.4,31,4.1,30.8,4.1,30.6z"/>
</g>
<linearGradient id="SVGID_2_" gradientUnits="userSpaceOnUse" x1="2.4" y1="11.0757" x2="30.87" y2="11.0757" gradientTransform="matrix(1 0 0 -1 0 31.73)">
	<stop  offset="0" style="stop-color:#A3A4A4"/>
	<stop  offset="4.000000e-02" style="stop-color:#A7A8A8"/>
	<stop  offset="8.000000e-02" style="stop-color:#B2B2B2"/>
	<stop  offset="0.12" style="stop-color:#C5C5C5"/>
	<stop  offset="0.16" style="stop-color:#DFDEDE"/>
	<stop  offset="0.17" style="stop-color:#E7E6E6"/>
	<stop  offset="0.58" style="stop-color:#E5E4E4"/>
	<stop  offset="0.72" style="stop-color:#DEDEDE"/>
	<stop  offset="0.83" style="stop-color:#D3D2D2"/>
	<stop  offset="0.91" style="stop-color:#C2C2C2"/>
	<stop  offset="0.98" style="stop-color:#ACADAD"/>
	<stop  offset="1" style="stop-color:#A5A6A6"/>
</linearGradient>
<path class="st9" d="M30.9,10.3H7.5c-0.2,0-0.4,0.1-0.5,0.3L2.4,21.8l1.1,5.5l3.7,3.5C7.3,31,7.4,31,7.6,31H27
	c0.2,0,0.5-0.2,0.5-0.4L30.9,10.3z"/>
<path class="st5" d="M27.5,30.5L27.5,30.5c0,0.3-0.3,0.5-0.5,0.5H7.6c-0.1,0-0.2,0-0.3-0.1l-3.7-3.5l0,0H3.3l0.2,1l3.7,3.5
	C7.3,32,7.4,32,7.6,32H27c0.2,0,0.5-0.2,0.5-0.4l0.2-1.1L27.5,30.5z"/>
<g id="_Grup_">
	<g id="_Grup_2">
		<path id="_Yol_7" class="st10" d="M8.8,22.1c0,0,0,0,0.1,0V22L8.8,22.1z"/>
		<path id="_Yol_8" class="st10" d="M9.1,21.9l0.1-0.2L9.1,21.9c-0.1-0.1,0-0.2,0-0.2C9,21.9,9.1,21.9,9.1,21.9z"/>
		<path id="_Yol_9" class="st10" d="M9.4,21.7C9.5,21.6,9.4,21.6,9.4,21.7C9.4,21.6,9.3,21.7,9.4,21.7z"/>
		<path id="_Yol_10" class="st10" d="M15.9,18.7L15.9,18.7C15.8,18.7,15.8,18.8,15.9,18.7z"/>
		<path id="_Yol_11" class="st10" d="M15.8,18.7L15.8,18.7L15.8,18.7z"/>
		<path id="_Yol_12" class="st10" d="M13.4,19.1c-0.1,0.1-0.2,0.1-0.3,0.2H13c-0.1,0.1,0,0.1-0.1,0.1c-0.1,0-0.3,0.1-0.4,0.2
			c-0.1,0,0-0.1,0-0.1s-0.1,0.1-0.3,0.2l0,0c-0.4,0.3-0.9,0.5-1.3,0.8c0,0,0,0,0.1,0c-0.5,0.2-0.9,0.6-1.3,1
			c0.2-0.2,0.7-0.3,0.9-0.6c0.1,0,0.2-0.1,0.3-0.1c0.4-0.2,0.5-0.4,0.9-0.5c0.1,0,0,0,0.1,0l-0.3,0.2l0.2-0.1
			c-0.1,0.1-0.3,0.1-0.2,0.2c0.2-0.2,0.6-0.4,0.8-0.5c-0.1,0-0.2,0.1-0.4,0.2s-0.2,0-0.2,0c0.3-0.2,0.6-0.4,1-0.6
			c0.1,0,0.2-0.1,0.2-0.1s0,0,0,0.1c0.1-0.1,0-0.1,0.1-0.2v0.1c0-0.1,0.2-0.1,0.3-0.2s0,0.1-0.1,0.1c0.1,0,0.1-0.1,0.2-0.1v0.1
			c0.1-0.1,0.2-0.1,0.3-0.1s-0.1-0.1,0-0.1s0,0,0.1,0s0-0.1,0.1-0.1s0,0.1,0,0.1c0,0,0.1-0.1,0.2-0.1c0.1-0.1,0,0,0-0.1
			s0.1,0.1,0.1,0.1c-0.1,0.1-0.3,0.2-0.3,0.2l0.2-0.1c0,0,0.2,0,0.1,0.1c0.3-0.1,0.5-0.2,0.8-0.4c0,0-0.1,0-0.1,0s0.1,0,0.1,0
			s0-0.1,0.1-0.2c0.1,0,0.3-0.1,0.4-0.1v-0.1c0.1,0,0.1-0.1,0.2-0.1c0.1,0,0,0-0.1,0.1s0.1,0,0.2-0.1L16,18.8c0.1,0,0.2-0.1,0.2,0
			c0.1-0.1,0.4-0.2,0.5-0.3v0.1c0.1-0.1,0.3-0.1,0.4-0.3l0,0l0.2-0.1c0,0,0.1,0,0.1,0c0.1-0.1,0.3-0.1,0.5-0.2
			c0-0.1,0.2-0.2,0.3-0.3c0.8-0.3,1.6-0.6,2.3-0.9c0.1-0.1,0.3-0.1,0.4-0.2c-0.1,0-0.2,0.1-0.4,0.1c-0.1,0-0.2,0-0.3-0.1h0.1
			c-0.2,0.1-0.1,0-0.2,0.1v-0.1c0,0.1-0.2,0.1-0.2,0v0.1c-0.1,0-0.2,0-0.2,0v0.1c0,0-0.4,0.1-0.3,0c0,0,0,0.1-0.1,0.1v-0.1
			c-0.1,0-0.2,0.1-0.2,0.1c0,0,0.1-0.1,0.1-0.1c-0.4,0.1,0,0.2-0.4,0.4l0,0l-0.1,0.1h-0.1c-0.1,0.2-0.5,0.2-0.7,0.3s-0.2,0-0.4,0.1
			v0.1c-0.1,0-0.6,0.1-0.8,0.1c-0.1,0.1,0,0,0,0.1c-0.2,0.2-0.3,0.1-0.4,0.1s0.1,0,0.1,0.1c-0.2,0-0.1,0.1-0.4,0.2
			c0,0,0.1-0.1,0.1-0.1c-0.3,0.2-0.5,0.3-0.8,0.4l-1.2,0.4l0,0c-0.2,0-0.3,0.1-0.5,0.2L13.4,19.1z"/>
		<path id="_Yol_13" class="st10" d="M11.5,20.7L11.5,20.7l0.2-0.1C11.6,20.6,11.6,20.7,11.5,20.7z"/>
		<polygon id="_Yol_14" class="st10" points="11.4,20.5 11.4,20.6 11.5,20.5 		"/>
		<polygon id="_Yol_15" class="st10" points="13.6,19.6 13.6,19.6 13.3,19.8 		"/>
		<path id="_Yol_16" class="st10" d="M15.9,18.8c0,0-0.1,0.1-0.1,0.1L15.9,18.8L15.9,18.8z"/>
		<path id="_Yol_17" class="st10" d="M17.5,18.4c0-0.1,0.1,0,0-0.1S17.5,18.3,17.5,18.4z"/>
		<path id="_Yol_18" class="st10" d="M17.7,18.1c0,0-0.1,0-0.1,0.1C17.7,18.2,17.7,18.1,17.7,18.1z"/>
	</g>
	<g id="_Grup_3">
		<path id="_Yol_19" class="st10" d="M9.6,23.5c0,0,0,0,0.1,0v-0.1L9.6,23.5z"/>
		<path id="_Yol_20" class="st10" d="M9.9,23.3l0.1-0.2L9.9,23.3c-0.1-0.1,0-0.1,0-0.2C9.7,23.3,9.9,23.3,9.9,23.3z"/>
		<path id="_Yol_21" class="st10" d="M10.2,23.1C10.3,23,10.2,23,10.2,23.1C10.2,23,10.1,23.1,10.2,23.1z"/>
		<path id="_Yol_22" class="st10" d="M16.9,19.9L16.9,19.9C16.8,19.9,16.8,19.9,16.9,19.9z"/>
		<path id="_Yol_23" class="st10" d="M16.8,19.9L16.8,19.9L16.8,19.9z"/>
		<path id="_Yol_24" class="st10" d="M14.3,20.2c-0.1,0.1-0.2,0.1-0.3,0.2h-0.1c-0.1,0.1,0,0.1-0.1,0.2c-0.1,0-0.3,0.1-0.4,0.2
			c-0.1,0,0-0.1,0-0.1s-0.1,0.1-0.3,0.2l0,0c-0.4,0.3-0.9,0.6-1.4,0.9c0,0,0,0,0.1,0c-0.5,0.3-1,0.6-1.4,1c0.4-0.2,0.7-0.4,1-0.6
			c0.1,0,0.2-0.2,0.3-0.1c0.4-0.2,0.5-0.4,0.9-0.6c0.1,0,0.1,0,0.1,0l-0.3,0.2l0.2-0.1c-0.1,0.1-0.3,0.2-0.3,0.2
			c0.2-0.2,0.7-0.4,0.9-0.6c-0.1,0-0.2,0.1-0.4,0.2s-0.2,0-0.2,0c0.3-0.2,0.6-0.4,1-0.6c0.1-0.1,0.2-0.1,0.2-0.1s0,0,0,0.1
			c0.1-0.1,0-0.1,0.2-0.2v0.1c0-0.1,0.2-0.1,0.4-0.2c0.1,0,0,0.1-0.1,0.1c0.1,0,0.1-0.1,0.2-0.1v0.1c0.1-0.1,0.2-0.1,0.3-0.1
			s-0.1-0.1,0-0.1s0,0,0.1,0s0-0.1,0.1-0.1s0,0.1,0,0.1c0.1,0,0.1-0.1,0.2-0.1c0.1-0.1,0,0,0-0.1s0.1,0.1,0.2,0.1
			c-0.1,0.1-0.3,0.2-0.3,0.2l0.2-0.1c0,0,0.2,0,0.1,0.1c0.3-0.1,0.5-0.2,0.8-0.4H16c0,0,0.1,0,0.2,0s0-0.1,0.1-0.2
			c0.1,0,0.3-0.1,0.4-0.1v-0.1c0.1,0,0.1-0.1,0.3-0.1s0,0-0.1,0.1s0.1,0,0.2-0.1l-0.1,0.1c0.1,0,0.2-0.1,0.2,0
			c0.1-0.1,0.4-0.2,0.6-0.3v0.1c0.1-0.1,0.4-0.1,0.4-0.2l0,0l0.2-0.1c0,0,0.1,0,0.1,0c0.2-0.1,0.3-0.1,0.5-0.2
			c0-0.1,0.2-0.2,0.4-0.2c0.8-0.2,1.7-0.5,2.4-0.8c0.1-0.1,0.3-0.1,0.4-0.2c-0.1,0-0.2,0.1-0.4,0.1c-0.1,0-0.2,0-0.3-0.1l0.1,0
			c-0.2,0.1-0.1,0-0.2,0.1v-0.1c0,0.1-0.2,0.1-0.2,0L21,18c-0.1,0-0.2,0-0.2-0.1V18c0,0-0.4,0.1-0.3,0c0,0-0.1,0.1-0.1,0.1V18
			c-0.1,0-0.2,0.1-0.2,0.1c0,0,0.1-0.1,0.1-0.1c-0.4,0.1,0,0.2-0.4,0.4l0,0l-0.1,0.1h-0.1c-0.1,0.2-0.5,0.2-0.7,0.3s-0.2,0-0.4,0.1
			v0.1c-0.2,0-0.7,0.1-0.9,0c-0.1,0.1,0,0,0,0.1c-0.2,0.2-0.3,0.1-0.4,0.1s0.1,0,0.1,0.1c-0.2,0-0.2,0.1-0.5,0.2c0,0,0.1,0,0.1-0.1
			c-0.3,0.2-0.6,0.3-0.9,0.4c-0.4,0.1-0.9,0.3-1.3,0.4l0,0c-0.2,0-0.3,0.2-0.5,0.2L14.3,20.2z"/>
		<path id="_Yol_25" class="st10" d="M12.4,22L12.4,22l0.2-0.1C12.5,21.9,12.4,21.9,12.4,22z"/>
		<polygon id="_Yol_26" class="st10" points="12.3,21.8 12.2,21.9 12.4,21.8 		"/>
		<polygon id="_Yol_27" class="st10" points="14.6,20.7 14.5,20.8 14.2,21 		"/>
		<path id="_Yol_28" class="st10" d="M16.9,19.9c0,0-0.1,0.1-0.1,0.1L16.9,19.9L16.9,19.9z"/>
		<path id="_Yol_29" class="st10" d="M18.6,19.5c0-0.1,0.1,0,0-0.1S18.6,19.5,18.6,19.5z"/>
		<path id="_Yol_30" class="st10" d="M18.9,19.3c0,0-0.1,0-0.1,0.1C18.9,19.4,18.8,19.3,18.9,19.3z"/>
	</g>
	<g id="_Grup_4">
		<path id="_Yol_31" class="st10" d="M11,24.6c0,0,0,0,0.1,0v-0.1L11,24.6z"/>
		<path id="_Yol_32" class="st10" d="M11.3,24.4l0.1-0.2L11.3,24.4c-0.1-0.1,0-0.2,0-0.2C11.1,24.3,11.3,24.3,11.3,24.4z"/>
		<path id="_Yol_33" class="st10" d="M11.5,24.1C11.6,24.1,11.5,24,11.5,24.1C11.5,24.1,11.4,24.1,11.5,24.1z"/>
		<path id="_Yol_34" class="st10" d="M17.6,21.4L17.6,21.4C17.5,21.4,17.5,21.5,17.6,21.4z"/>
		<path id="_Yol_35" class="st10" d="M17.5,21.4L17.5,21.4L17.5,21.4z"/>
		<path id="_Yol_36" class="st10" d="M15.3,21.7c-0.1,0.1-0.2,0.1-0.3,0.1h-0.1c-0.1,0.1,0,0.1-0.1,0.1c-0.1,0-0.3,0.1-0.4,0.2
			c0,0,0-0.1,0-0.1s-0.1,0.1-0.2,0.2l0,0c-0.4,0.3-0.9,0.5-1.3,0.7l0,0c-0.5,0.2-0.9,0.5-1.2,0.9c0.2-0.2,0.7-0.3,0.9-0.5
			c0.1,0,0.2-0.1,0.3-0.1c0.4-0.1,0.5-0.3,0.8-0.5c0.1,0,0,0,0.1,0.1L13.5,23l0.2,0c-0.1,0.1-0.2,0.1-0.2,0.2
			c0.2-0.2,0.6-0.3,0.8-0.5c-0.1,0-0.2,0.1-0.3,0.1s-0.1,0-0.2,0c0.3-0.2,0.6-0.4,0.9-0.5c0.1,0,0.2-0.1,0.2-0.1s0,0,0,0.1
			c0.1-0.1,0-0.1,0.1-0.2v0.1c0-0.1,0.2-0.1,0.3-0.2s0,0.1-0.1,0.1c0.1,0,0.1-0.1,0.2-0.1v0.1c0.1-0.1,0.2-0.1,0.2,0s-0.1-0.1,0-0.1
			s0,0,0.1,0c0-0.1,0-0.1,0.1-0.1c0,0,0,0.1,0,0.1c0,0,0.1,0,0.1,0c0.1-0.1,0,0,0-0.1S16,22,16.1,22c-0.1,0.1-0.2,0.2-0.3,0.2
			l0.2-0.1c0,0,0.2,0,0.1,0.1c0.2-0.1,0.5-0.2,0.7-0.4h-0.1c0,0,0.1,0,0.1,0s0-0.1,0.1-0.2c0.1,0,0.3-0.1,0.4-0.1v-0.1
			c0.1,0,0.1-0.1,0.2-0.1s0,0,0,0.1s0.1,0,0.2-0.1v0.1c0.1,0,0.2-0.1,0.2,0c0.1-0.1,0.4-0.2,0.5-0.3v0.1c0.1-0.1,0.3-0.1,0.4-0.2
			l0,0l0.1-0.1c0,0,0.1,0,0.1,0c0,0,0,0,0,0c0.1-0.1,0.3-0.1,0.4-0.2c0-0.1,0.2-0.2,0.3-0.2c0.7-0.3,1.4-0.6,2-1
			c0.1,0,0.2-0.2,0.3-0.3c-0.1,0-0.1,0.1-0.3,0.2s-0.2,0-0.3,0h0.1c-0.1,0.1-0.1,0-0.2,0.1v-0.1c0,0.1-0.1,0.1-0.2,0.1v0.1
			c-0.1,0-0.2,0-0.2,0v0.1c0,0-0.4,0.2-0.3,0c0,0,0,0.1-0.1,0.1v-0.1c-0.1,0-0.2,0.1-0.2,0.1c0,0,0-0.1,0-0.1
			c-0.4,0.1,0,0.2-0.3,0.4l0,0L19.9,20h-0.1c-0.1,0.2-0.5,0.2-0.6,0.3s-0.2,0-0.4,0.1v0.1c-0.1,0-0.6,0.1-0.8,0c-0.1,0.1,0,0,0,0.1
			c-0.2,0.2-0.2,0.1-0.4,0.1s0.1,0,0.1,0.1c-0.2,0-0.1,0.1-0.4,0.2c0,0,0,0,0.1-0.1c-0.2,0.2-0.5,0.3-0.8,0.4
			c-0.3,0.1-0.8,0.3-1.1,0.4l0,0c-0.2,0-0.3,0.1-0.5,0.2L15.3,21.7z"/>
		<path id="_Yol_37" class="st10" d="M13.5,23.2L13.5,23.2l0.2-0.1C13.6,23.1,13.6,23.2,13.5,23.2z"/>
		<polygon id="_Yol_38" class="st10" points="13.4,23 13.4,23.1 13.5,23 		"/>
		<polygon id="_Yol_39" class="st10" points="15.5,22.2 15.4,22.2 15.2,22.4 		"/>
		<path id="_Yol_40" class="st10" d="M17.6,21.5c0,0-0.1,0-0.1,0.1L17.6,21.5L17.6,21.5z"/>
		<path id="_Yol_41" class="st10" d="M19,21.1c0-0.1,0.1,0,0-0.1S19.1,21.1,19,21.1z"/>
		<path id="_Yol_42" class="st10" d="M19.3,20.8C19.3,20.8,19.2,20.9,19.3,20.8C19.3,20.9,19.3,20.9,19.3,20.8z"/>
	</g>
</g>
<path class="st6" d="M7.5,11.3h23.2l0.2-1H7.5c-0.2,0-0.4,0.1-0.5,0.3L2.4,21.8l0.1,0.7L7,11.6C7.1,11.4,7.3,11.3,7.5,11.3z"/>
<path class="st6" d="M3.1,11.3c0.2,0,0.4,0.1,0.5,0.3L5,15.5L5.2,15l0,0l-1.7-4.4c-0.1-0.2-0.3-0.3-0.5-0.3H0.2l0.2,1L3.1,11.3z"/>
</svg>
