<?xml version="1.0" encoding="utf-8"?>
<!-- Generator: Adobe Illustrator 21.0.0, SVG Export Plug-In . SVG Version: 6.00 Build 0)  -->
<svg version="1.1" id="katman_1" xmlns="http://www.w3.org/2000/svg" xmlns:xlink="http://www.w3.org/1999/xlink" x="0px" y="0px"
	 viewBox="0 0 11.1 16" style="enable-background:new 0 0 11.1 16;" xml:space="preserve">
<style type="text/css">
	.st0{fill:url(#SVGID_1_);}
	.st1{opacity:0.2;fill:#1A1A1A;enable-background:new    ;}
	.st2{opacity:0.5;fill:#1A1A1A;enable-background:new    ;}
	.st3{fill:url(#SVGID_2_);}
	.st4{fill:url(#SVGID_3_);}
	.st5{fill:none;stroke:#1A1A1A;stroke-width:0.25;stroke-miterlimit:10;}
	.st6{fill:none;stroke:#999999;stroke-width:0.25;stroke-miterlimit:10;}
	.st7{fill:url(#SVGID_4_);}
	.st8{fill:url(#SVGID_5_);}
	.st9{fill:url(#SVGID_6_);}
	.st10{fill:url(#SVGID_7_);}
	.st11{fill:url(#SVGID_8_);}
	.st12{fill:url(#SVGID_9_);}
	.st13{fill:url(#SVGID_10_);}
	.st14{opacity:0.1;fill:#FFFFFF;enable-background:new    ;}
	.st15{opacity:0.1;enable-background:new    ;}
	.st16{fill:url(#SVGID_11_);}
	.st17{fill:url(#SVGID_12_);}
	.st18{fill:url(#SVGID_13_);}
</style>
<title>drive-removable-media_5</title>
<linearGradient id="SVGID_1_" gradientUnits="userSpaceOnUse" x1="5.575" y1="-9.999771e-03" x2="5.575" y2="15.73" gradientTransform="matrix(1 0 0 -1 0 15.73)">
	<stop  offset="0" style="stop-color:#1A1A1A"/>
	<stop  offset="9.000000e-02" style="stop-color:#292929"/>
	<stop  offset="0.26" style="stop-color:#3E3E3E"/>
	<stop  offset="0.45" style="stop-color:#4D4D4D"/>
	<stop  offset="0.67" style="stop-color:#565656"/>
	<stop  offset="1" style="stop-color:#595959"/>
</linearGradient>
<path class="st0" d="M1.8,0h7.5c1,0,1.8,0.8,1.8,1.8v12.1c0,1-0.8,1.8-1.8,1.8H1.8c-1,0-1.8-0.8-1.8-1.8V1.8C0,0.8,0.8,0,1.8,0z"/>
<path class="st1" d="M1.8,9.2c-1-1-1.5-2.3-1.5-3.6c0-2.9,2.4-5.2,5.3-5.2c2.9,0,5.3,2.3,5.3,5.2c0,0.6-0.1,1.3-0.4,1.9
	c0,0.1-0.1,0.2-0.2,0.2c-0.2,0-0.3-0.2-0.4-0.5c0-0.1,0-0.3,0.1-0.4c0.1-0.4,0.2-0.8,0.2-1.2C10.1,3,8.1,1,5.6,1
	C4,1,2.6,1.8,1.7,3.1C2.1,4,2.5,4.8,3.1,5.7C3.5,6.3,3.8,7,4.2,7.7v0.1L4.1,7.9C3.9,8,3.2,8.4,2.7,8.7L1.9,9.2L1.8,9.2L1.8,9.2z"/>
<circle class="st2" cx="10.8" cy="8.3" r="0.4"/>
<linearGradient id="SVGID_2_" gradientUnits="userSpaceOnUse" x1="10.78" y1="7.12" x2="10.78" y2="7.69" gradientTransform="matrix(1 0 0 -1 0 15.73)">
	<stop  offset="0" style="stop-color:#909092"/>
	<stop  offset="0.33" style="stop-color:#E5E5E5"/>
	<stop  offset="0.64" style="stop-color:#FFFFFF"/>
	<stop  offset="0.97" style="stop-color:#D9D1D1"/>
	<stop  offset="1" style="stop-color:#E5E5E5"/>
</linearGradient>
<circle class="st3" cx="10.8" cy="8.3" r="0.3"/>
<circle class="st2" cx="0.4" cy="8.3" r="0.4"/>
<linearGradient id="SVGID_3_" gradientUnits="userSpaceOnUse" x1="0.45" y1="7.12" x2="0.45" y2="7.69" gradientTransform="matrix(1 0 0 -1 0 15.73)">
	<stop  offset="0" style="stop-color:#909092"/>
	<stop  offset="0.33" style="stop-color:#E5E5E5"/>
	<stop  offset="0.64" style="stop-color:#FFFFFF"/>
	<stop  offset="0.97" style="stop-color:#D9D1D1"/>
	<stop  offset="1" style="stop-color:#E5E5E5"/>
</linearGradient>
<circle class="st4" cx="0.4" cy="8.3" r="0.3"/>
<circle class="st5" cx="0.8" cy="9.4" r="0.2"/>
<circle class="st6" cx="0.7" cy="0.6" r="0.4"/>
<circle class="st2" cx="0.7" cy="0.6" r="0.3"/>
<linearGradient id="SVGID_4_" gradientUnits="userSpaceOnUse" x1="0.7" y1="14.81" x2="0.7" y2="15.37" gradientTransform="matrix(1 0 0 -1 0 15.73)">
	<stop  offset="0" style="stop-color:#909092"/>
	<stop  offset="0.33" style="stop-color:#E5E5E5"/>
	<stop  offset="0.64" style="stop-color:#FFFFFF"/>
	<stop  offset="0.97" style="stop-color:#D9D1D1"/>
	<stop  offset="1" style="stop-color:#E5E5E5"/>
</linearGradient>
<circle class="st7" cx="0.7" cy="0.6" r="0.3"/>
<circle class="st6" cx="10.5" cy="0.6" r="0.4"/>
<circle class="st2" cx="10.5" cy="0.6" r="0.4"/>
<linearGradient id="SVGID_5_" gradientUnits="userSpaceOnUse" x1="10.53" y1="14.81" x2="10.53" y2="15.37" gradientTransform="matrix(1 0 0 -1 0 15.73)">
	<stop  offset="0" style="stop-color:#909092"/>
	<stop  offset="0.33" style="stop-color:#E5E5E5"/>
	<stop  offset="0.64" style="stop-color:#FFFFFF"/>
	<stop  offset="0.97" style="stop-color:#D9D1D1"/>
	<stop  offset="1" style="stop-color:#E5E5E5"/>
</linearGradient>
<circle class="st8" cx="10.5" cy="0.6" r="0.3"/>
<linearGradient id="SVGID_6_" gradientUnits="userSpaceOnUse" x1="5.58" y1="6.67" x2="5.58" y2="15.3102" gradientTransform="matrix(1 0 0 -1 0 15.73)">
	<stop  offset="0" style="stop-color:#CCCCCC"/>
	<stop  offset="1" style="stop-color:#F7F7F7"/>
</linearGradient>
<path class="st9" d="M4,7.8C3.8,7,1.8,3.8,1.6,3c0.9-1.4,2.4-2.2,4-2.2c2.6,0,4.7,2.1,4.7,4.7c0,0,0,0,0,0c0,0.4-0.1,0.8-0.2,1.2
	c0,0.1-0.1,0.2-0.1,0.4c0,0.3,0.2,0.5,0.3,0.3c0.2-0.6,0.3-1.2,0.4-1.8c0-2.8-2.4-5.1-5.2-5.1c-2.8,0-5.2,2.3-5.2,5.1c0,0,0,0,0,0
	c0,1.3,0.5,2.6,1.5,3.5C2.1,8.9,3.7,8,4,7.8z"/>
<path class="st1" d="M9.4,15.5c-0.4,0-0.7-0.3-0.8-0.7H6.2c0,0.4-0.4,0.7-0.8,0.7H1.2l0.1-0.2c0-0.1,0-0.2,0-0.3
	c-0.1-0.2-0.2-0.4-0.4-0.5H0.7H0.6H0.4v-4.2h0.1c0.1-0.1,3-1.8,3.8-2.3C4.4,8,4.4,7.8,4.3,7.7C4.2,7.5,2.4,4.3,1.8,3.3V3.2V3.1
	c0.8-1.3,2.3-2,3.8-2c2.5,0,4.5,2,4.5,4.4c0,0.4-0.1,0.8-0.2,1.2v0.1c-0.1,2-0.1,2.5-0.1,2.5c0,0.2,0.2,0.4,0.4,0.4l0,0h0.3
	c0.2,0,0.3,0.1,0.3,0.3v4.4h-0.1h-0.1c-0.1,0-0.1,0-0.2,0c-0.2,0.1-0.4,0.3-0.4,0.5c0,0.1,0,0.2,0,0.3l0.1,0.2L9.4,15.5z"/>
<linearGradient id="SVGID_7_" gradientUnits="userSpaceOnUse" x1="5.63" y1="0.36" x2="5.63" y2="14.491" gradientTransform="matrix(1 0 0 -1 0 15.73)">
	<stop  offset="0" style="stop-color:#CCCCCC"/>
	<stop  offset="1" style="stop-color:#F7F7F7"/>
</linearGradient>
<path class="st10" d="M9.4,15.4c-0.3,0-0.6-0.3-0.6-0.6l0,0v-0.1H6v0.1c0,0.3-0.3,0.6-0.6,0.6l0,0h-4c0.2-0.4,0-0.8-0.4-1
	c0,0-0.1,0-0.1,0c-0.1,0-0.1,0-0.2,0H0.6v-3.9c0.3-0.2,3-1.8,3.8-2.3c0.2-0.1,0.3-0.4,0.2-0.6c-0.1-0.2-2.3-4-2.5-4.4
	C2.7,2,4.1,1.2,5.6,1.2C8,1.2,9.9,3.1,10,5.5c0,0,0,0,0,0c0,0.4-0.1,0.8-0.2,1.2l0,0c0,0.1-0.1,2.6-0.1,2.7c0,0.3,0.2,0.5,0.5,0.5
	h0.3c0.1,0,0.2,0.1,0.2,0.2v4.2h-0.1c-0.1,0-0.2,0-0.3,0.1C10,14.5,9.9,14.7,9.8,15c0,0.1,0,0.2,0,0.4L9.4,15.4z"/>
<path d="M4,5.4"/>
<linearGradient id="SVGID_8_" gradientUnits="userSpaceOnUse" x1="5.7676" y1="12.56" x2="5.7676" y2="4.07" gradientTransform="matrix(1 0 0 -1 0 15.73)">
	<stop  offset="0" style="stop-color:#595959"/>
	<stop  offset="0.33" style="stop-color:#565656"/>
	<stop  offset="0.55" style="stop-color:#4D4D4D"/>
	<stop  offset="0.74" style="stop-color:#3E3E3E"/>
	<stop  offset="0.91" style="stop-color:#292929"/>
	<stop  offset="1" style="stop-color:#1A1A1A"/>
</linearGradient>
<path class="st11" d="M4,5.5V4.5h1v1.1H4.7v0.6c0,0.1,0,0.1,0.1,0.2L5.5,7V4.1H5.1l0.7-1.2l0.7,1.2H6V8l0.7-0.6
	c0-0.1,0.1-0.1,0.1-0.2V6.1C6.5,6,6.4,5.6,6.5,5.4S7,5,7.2,5.2s0.4,0.5,0.2,0.7C7.4,6,7.3,6,7.2,6.1v1.1c0,0.2-0.1,0.4-0.2,0.5l0,0
	l0,0.1L6.1,8.6C6,8.7,6,8.7,6,8.8v1.8c0.4,0.1,0.7,0.6,0.5,1c-0.1,0.4-0.6,0.7-1,0.5s-0.7-0.6-0.5-1c0.1-0.3,0.3-0.4,0.5-0.5V7.8
	c0-0.1,0-0.1-0.1-0.2L4.5,6.7C4.3,6.5,4.3,6.3,4.2,6.1V5.5H4z"/>
<circle class="st6" cx="10.5" cy="15.1" r="0.4"/>
<circle class="st2" cx="10.5" cy="15.1" r="0.4"/>
<linearGradient id="SVGID_9_" gradientUnits="userSpaceOnUse" x1="10.53" y1="0.32" x2="10.53" y2="0.89" gradientTransform="matrix(1 0 0 -1 0 15.73)">
	<stop  offset="0" style="stop-color:#909092"/>
	<stop  offset="0.33" style="stop-color:#E5E5E5"/>
	<stop  offset="0.64" style="stop-color:#FFFFFF"/>
	<stop  offset="0.97" style="stop-color:#D9D1D1"/>
	<stop  offset="1" style="stop-color:#E5E5E5"/>
</linearGradient>
<circle class="st12" cx="10.5" cy="15.1" r="0.3"/>
<circle class="st6" cx="0.7" cy="15.1" r="0.4"/>
<circle class="st2" cx="0.7" cy="15.1" r="0.4"/>
<linearGradient id="SVGID_10_" gradientUnits="userSpaceOnUse" x1="0.7" y1="0.32" x2="0.7" y2="0.89" gradientTransform="matrix(1 0 0 -1 0 15.73)">
	<stop  offset="0" style="stop-color:#909092"/>
	<stop  offset="0.33" style="stop-color:#E5E5E5"/>
	<stop  offset="0.64" style="stop-color:#FFFFFF"/>
	<stop  offset="0.97" style="stop-color:#D9D1D1"/>
	<stop  offset="1" style="stop-color:#E5E5E5"/>
</linearGradient>
<circle class="st13" cx="0.7" cy="15.1" r="0.3"/>
<path d="M4,5.4"/>
<path class="st14" d="M10.7,0H0.5C0.2,0,0,0.2,0,0.5v0.3c0-0.3,0.2-0.5,0.5-0.5l0,0h10.2c0.3,0,0.5,0.2,0.5,0.5c0,0,0,0,0,0V0.5
	C11.2,0.2,10.9,0,10.7,0C10.7,0,10.7,0,10.7,0z"/>
<path class="st15" d="M10.7,15.7H0.5c-0.3,0-0.5-0.2-0.5-0.5v0.3C0,15.8,0.2,16,0.5,16h10.2c0.3,0,0.5-0.2,0.5-0.5c0,0,0,0,0,0v-0.3
	C11.2,15.5,10.9,15.7,10.7,15.7C10.7,15.7,10.7,15.7,10.7,15.7z"/>
<path class="st14" d="M10.8,8.3c0.1,0,0.2,0.1,0.2,0.2c0,0,0-0.1,0-0.1C11,8.2,10.9,8,10.7,8s-0.3,0.1-0.3,0.3c0,0,0,0.1,0,0.1
	C10.5,8.3,10.6,8.3,10.8,8.3z"/>
<path class="st15" d="M10.8,8.6c-0.1,0-0.2-0.1-0.2-0.2c0,0,0,0.1,0,0.1c0,0.2,0.1,0.3,0.3,0.3s0.3-0.1,0.3-0.3c0,0,0-0.1,0-0.1
	C11,8.6,10.9,8.6,10.8,8.6z"/>
<path class="st14" d="M0.4,8.3c0.1,0,0.2,0.1,0.2,0.2c0,0,0-0.1,0-0.1C0.7,8.2,0.6,8,0.4,8S0.1,8.2,0.1,8.3c0,0,0,0.1,0,0.1
	C0.2,8.3,0.3,8.3,0.4,8.3z"/>
<path class="st15" d="M0.4,8.6c-0.1,0-0.2-0.1-0.2-0.2c0,0,0,0.1,0,0.1c0,0.2,0.1,0.3,0.3,0.3s0.3-0.1,0.3-0.3c0,0,0-0.1,0-0.1
	C0.7,8.6,0.6,8.6,0.4,8.6z"/>
<path class="st14" d="M0.7,0.6c0.1,0,0.2,0,0.3,0.2c0,0,0-0.1,0-0.1c0-0.2-0.1-0.3-0.3-0.3S0.4,0.5,0.4,0.6c0,0,0,0.1,0,0.1
	C0.5,0.7,0.6,0.6,0.7,0.6z"/>
<path class="st15" d="M0.7,0.9c-0.1,0-0.2-0.1-0.2-0.2c0,0,0,0.1,0,0.1c0,0.2,0.1,0.3,0.3,0.3S1,1.1,1,0.9c0,0,0-0.1,0-0.1
	C0.9,0.9,0.8,0.9,0.7,0.9z"/>
<path class="st14" d="M10.5,0.6c0.1,0,0.2,0.1,0.2,0.2c0,0,0-0.1,0-0.1c0-0.2-0.1-0.3-0.3-0.3s-0.3,0.1-0.3,0.3c0,0,0,0.1,0,0.1
	C10.3,0.6,10.4,0.6,10.5,0.6z"/>
<path class="st15" d="M10.5,0.9c-0.1,0-0.2-0.1-0.2-0.2c0,0,0,0.1,0,0.1c0,0.2,0.1,0.3,0.3,0.3s0.3-0.1,0.3-0.3c0,0,0-0.1,0-0.1
	C10.8,0.9,10.7,1,10.5,0.9z"/>
<path class="st15" d="M4,7.8L4,7.8C3.8,7,2,4.2,1.6,3.2L1.6,3.3C1.8,4,3.5,6.8,4,7.8z"/>
<linearGradient id="SVGID_11_" gradientUnits="userSpaceOnUse" x1="10.1991" y1="8.51" x2="10.1991" y2="10.06" gradientTransform="matrix(1 0 0 -1 0 15.73)">
	<stop  offset="0" style="stop-color:#CCCCCC"/>
	<stop  offset="1" style="stop-color:#F7F7F7"/>
</linearGradient>
<path class="st16" d="M10.3,5.8C10.3,5.8,10.3,5.7,10.3,5.8c0,0.3-0.1,0.6-0.2,1c0,0.1-0.1,0.2-0.1,0.4c0,0,0,0.1,0,0.1
	c0-0.1,0-0.1,0.1-0.2C10.3,6.6,10.3,6.2,10.3,5.8z"/>
<path class="st14" d="M5.6,0.7c2.8,0,5.1,2.2,5.2,5c0,0,0-0.1,0-0.1c0-2.8-2.3-5.1-5.1-5.1c0,0,0,0,0,0c-2.8,0-5.2,2.3-5.2,5.1
	c0,0,0,0,0,0c0,0,0,0.1,0,0.1C0.5,2.9,2.8,0.7,5.6,0.7z"/>
<path class="st15" d="M5.6,0.9C4,0.8,2.5,1.7,1.6,3c0,0.1,0,0.1,0.1,0.2c0.9-1.3,2.4-2.1,4-2.1c2.6,0,4.7,2,4.7,4.6
	c0-0.1,0-0.1,0-0.2C10.3,2.9,8.2,0.8,5.6,0.9C5.6,0.9,5.6,0.9,5.6,0.9z"/>
<path class="st15" d="M0.4,5.7c0,0,0,0.1,0,0.1c0,1.3,0.5,2.6,1.4,3.5C2.1,9.1,3.7,8.3,4,8c0,0,0-0.1-0.1-0.2
	C3.4,8.1,2.1,8.9,1.8,9.1C0.9,8.1,0.4,6.9,0.4,5.7z"/>
<path class="st15" d="M10.4,7.4c-0.1,0.2-0.3,0.1-0.3-0.2c0,0.1,0,0.1,0,0.2c0,0.3,0.2,0.5,0.3,0.3c0.2-0.6,0.3-1.2,0.4-1.8
	c0,0,0-0.1,0-0.1C10.8,6.2,10.6,6.8,10.4,7.4z"/>
<path class="st14" d="M4.3,8.2c-0.8,0.5-3.4,2.1-3.8,2.3v0.3c0.3-0.2,3-1.8,3.8-2.3C4.5,8.3,4.6,8.1,4.5,8C4.5,8,4.4,8.1,4.3,8.2z"
	/>
<linearGradient id="SVGID_12_" gradientUnits="userSpaceOnUse" x1="10.14" y1="5.33" x2="10.14" y2="6.21" gradientTransform="matrix(1 0 0 -1 0 15.73)">
	<stop  offset="0" style="stop-color:#CCCCCC"/>
	<stop  offset="1" style="stop-color:#F7F7F7"/>
</linearGradient>
<path class="st17" d="M10.4,10h-0.3c-0.3,0-0.5-0.2-0.5-0.4c0,0.1,0,0.2,0,0.2c0,0.3,0.2,0.5,0.5,0.5h0.3c0.1,0,0.2,0.1,0.2,0.2
	v-0.3C10.6,10.1,10.6,10,10.4,10z"/>
<path class="st14" d="M5.6,1.2C4.1,1.2,2.7,2,1.9,3.2L2,3.3c0.8-1.1,2.2-1.8,3.6-1.8c2.3,0,4.3,1.8,4.4,4.2c0-0.1,0-0.1,0-0.2
	C9.9,3.1,8,1.2,5.6,1.2z"/>
<path class="st15" d="M10.3,14.4C10,14.5,9.8,14.7,9.8,15c0,0.1,0,0.2,0,0.2c0-0.3,0.2-0.5,0.5-0.6c0.1,0,0.2-0.1,0.3-0.1h0.1v-0.3
	h-0.1C10.4,14.4,10.3,14.4,10.3,14.4z"/>
<path class="st15" d="M1.4,15c-0.1-0.3-0.3-0.5-0.5-0.6c-0.1,0-0.1,0-0.2,0H0.6v0.3h0.1c0.1,0,0.1,0,0.2,0c0.3,0.1,0.5,0.3,0.5,0.6
	l0,0C1.5,15.2,1.3,15.1,1.4,15z"/>
<path class="st15" d="M4.5,7.9L4.5,7.9c0,0,0-0.1,0-0.3C4.3,7.4,2.5,4.1,2,3.3L1.9,3.4C2.2,3.9,4.3,7.6,4.5,7.9z"/>
<linearGradient id="SVGID_13_" gradientUnits="userSpaceOnUse" x1="9.8492" y1="6.21" x2="9.8492" y2="10.06" gradientTransform="matrix(1 0 0 -1 0 15.73)">
	<stop  offset="0" style="stop-color:#CCCCCC"/>
	<stop  offset="1" style="stop-color:#F7F7F7"/>
</linearGradient>
<path class="st18" d="M9.8,7L9.8,7C9.9,6.6,10,6.2,10,5.8c0,0,0-0.1,0-0.1C10,6,9.9,6.4,9.8,6.7l0,0c0,0.1-0.1,2.6-0.1,2.7
	c0,0,0,0.1,0,0.1C9.7,8.9,9.8,7.1,9.8,7L9.8,7z"/>
<path class="st15" d="M8.8,14.7L8.8,14.7L6,14.7v0.1c0,0.3-0.3,0.6-0.6,0.6l0,0h-4c0,0.1,0,0.2,0,0.3h4C5.7,15.6,6,15.3,6,15l0,0
	v-0.1h2.8V15c0,0.3,0.3,0.6,0.6,0.6l0,0h0.4c0-0.1,0-0.2,0-0.3H9.4C9.1,15.4,8.8,15.1,8.8,14.7L8.8,14.7z"/>
<path d="M4,5.6"/>
<path class="st15" d="M4.8,6.6l0.7,0.7V7L4.8,6.3c0-0.1-0.1-0.1-0.1-0.2v0.3C4.7,6.5,4.8,6.5,4.8,6.6z"/>
<rect x="4" y="4.5" class="st15" width="1" height="0.3"/>
<polygon class="st15" points="6.3,4.1 6.4,4.1 5.8,2.9 5.1,4.1 5.2,4.1 5.8,3.2 "/>
<path class="st15" d="M6,8.3l0.7-0.6c0-0.1,0.1-0.1,0.1-0.2V7.2c0,0.1,0,0.1-0.1,0.2L6,8V8.3z"/>
<path class="st15" d="M5.5,10.9v-0.3C5.2,10.7,5,11,5,11.4c0,0,0,0.1,0,0.1C5,11.2,5.2,11,5.5,10.9z"/>
<path class="st15" d="M7,5.1c-0.3,0-0.5,0.2-0.5,0.5c0,0,0,0.1,0,0.1c0.1-0.3,0.4-0.4,0.7-0.3c0.2,0.1,0.3,0.2,0.3,0.3
	c0,0,0-0.1,0-0.1C7.5,5.4,7.3,5.1,7,5.1z"/>
<path class="st15" d="M6,10.6v0.3c0.3,0.1,0.5,0.3,0.6,0.6c0,0,0-0.1,0-0.1C6.6,11,6.3,10.7,6,10.6z"/>
<path class="st14" d="M7.1,7.7L7.1,7.7l-1,0.9C6,8.7,6,8.7,6,8.8v0.3C6,9,6,8.9,6.1,8.9L7,8h0.1l0,0c0.1-0.1,0.2-0.3,0.2-0.5V7.2
	C7.3,7.4,7.2,7.5,7.1,7.7L7.1,7.7z"/>
<path class="st14" d="M5.5,8V7.8c0-0.1,0-0.1-0.1-0.2L4.5,6.7C4.3,6.5,4.3,6.3,4.2,6.1v0.3c0,0.2,0.1,0.4,0.2,0.6l0.9,0.9
	C5.5,7.9,5.5,7.9,5.5,8z"/>
<path class="st14" d="M5.8,12.2c-0.4,0-0.7-0.3-0.8-0.7c0,0,0,0.1,0,0.1c0,0.4,0.4,0.8,0.8,0.8s0.8-0.4,0.8-0.8c0,0,0-0.1,0-0.1
	C6.5,11.9,6.2,12.2,5.8,12.2z"/>
<path class="st14" d="M10.5,15.1c0.1,0,0.2,0.1,0.2,0.2c0,0,0-0.1,0-0.1c0-0.2-0.1-0.3-0.3-0.3s-0.3,0.1-0.3,0.3c0,0,0,0.1,0,0.1
	C10.3,15.1,10.4,15.1,10.5,15.1z"/>
<path class="st15" d="M10.5,15.4c-0.1,0-0.2-0.1-0.2-0.2c0,0,0,0.1,0,0.1c0,0.2,0.1,0.3,0.3,0.3s0.3-0.1,0.3-0.3l0,0
	c0,0,0-0.1,0-0.1C10.8,15.4,10.7,15.4,10.5,15.4z"/>
<path class="st14" d="M0.7,15.1c0.1,0,0.2,0.1,0.2,0.2c0,0,0-0.1,0-0.1c0-0.2-0.1-0.3-0.3-0.3S0.4,15,0.4,15.1l0,0c0,0,0,0.1,0,0.1
	C0.4,15.1,0.6,15.1,0.7,15.1z"/>
<path class="st15" d="M0.7,15.4c-0.1,0-0.2-0.1-0.2-0.2c0,0,0,0.1,0,0.1c0,0.2,0.1,0.3,0.3,0.3S1,15.5,1,15.4c0,0,0-0.1,0-0.1
	C1,15.4,0.8,15.4,0.7,15.4z"/>
</svg>
