<?xml version="1.0" encoding="utf-8"?>
<!-- Generator: Adobe Illustrator 21.0.0, SVG Export Plug-In . SVG Version: 6.00 Build 0)  -->
<svg version="1.1" id="katman_1" xmlns="http://www.w3.org/2000/svg" xmlns:xlink="http://www.w3.org/1999/xlink" x="0px" y="0px"
	 viewBox="0 0 63.3 64" style="enable-background:new 0 0 63.3 64;" xml:space="preserve">
<style type="text/css">
	.st0{fill:url(#_Yol__1_);}
	.st1{fill:#FFFFFF;}
	.st2{opacity:0.5;fill:#20396E;enable-background:new    ;}
	.st3{fill:#EAF6FE;}
	.st4{fill:none;}
	.st5{opacity:0.1;fill:#FFFFFF;enable-background:new    ;}
	.st6{opacity:0.2;enable-background:new    ;}
</style>
<title>preferences-desktop</title>
<linearGradient id="_Yol__1_" gradientUnits="userSpaceOnUse" x1="31.655" y1="3.6" x2="31.655" y2="61.03" gradientTransform="matrix(1 0 0 -1 0 63.73)">
	<stop  offset="0" style="stop-color:#2D5778"/>
	<stop  offset="0.39" style="stop-color:#2D5A7C"/>
	<stop  offset="0.74" style="stop-color:#2B6286"/>
	<stop  offset="1" style="stop-color:#2A6D94"/>
</linearGradient>
<path id="_Yol_" class="st0" d="M3.9,58.5V4c0-0.1,0-0.1,0.1-0.1h55.3c0.1,0,0.1,0,0.1,0.1v54.5L3.9,58.5L3.9,58.5z"/>
<rect x="44.7" y="28.7" class="st1" width="4.2" height="30"/>
<rect x="44.7" y="3.4" class="st1" width="4.2" height="12"/>
<rect x="29.2" y="43" class="st1" width="4.2" height="15.7"/>
<rect x="29.2" y="3.8" class="st1" width="4.2" height="26"/>
<rect x="13.6" y="29.5" class="st1" width="4.2" height="29.2"/>
<rect x="13.6" y="3.9" class="st1" width="4.2" height="11.9"/>
<rect x="44.2" y="28.2" class="st2" width="5.2" height="31"/>
<rect x="44.7" y="28.7" class="st3" width="4.2" height="30"/>
<rect x="44.2" y="2.9" class="st2" width="5.2" height="13"/>
<rect x="44.7" y="3.4" class="st3" width="4.2" height="12"/>
<rect x="28.7" y="42.5" class="st2" width="5.3" height="16.7"/>
<rect x="29.2" y="43" class="st3" width="4.2" height="15.7"/>
<rect x="28.7" y="3.3" class="st2" width="5.3" height="27"/>
<rect x="29.2" y="3.8" class="st3" width="4.2" height="26"/>
<rect x="13.1" y="29" class="st2" width="5.2" height="30.2"/>
<rect x="13.6" y="29.5" class="st3" width="4.2" height="29.2"/>
<rect x="13.1" y="3.4" class="st2" width="5.2" height="13"/>
<rect x="13.6" y="3.9" class="st3" width="4.2" height="11.9"/>
<rect x="2.8" y="2.4" class="st4" width="57.7" height="57.7"/>
<rect x="4.2" y="58.3" class="st1" width="55" height="1"/>
<path class="st1" d="M61.5,0.5H1.7C1,0.5,0.5,1,0.5,1.7v1C0.5,2,1,1.5,1.7,1.5h59.8c0.7,0,1.2,0.5,1.2,1.2v-1
	C62.7,1.1,62.2,0.5,61.5,0.5C61.6,0.5,61.6,0.5,61.5,0.5z"/>
<path class="st2" d="M1.7,62.5c-0.9,0-1.7-0.7-1.7-1.7c0,0,0,0,0,0V1.7C0,0.8,0.8,0,1.7,0h59.8c0.9,0,1.7,0.7,1.8,1.7v59.1
	c0,0.9-0.7,1.7-1.7,1.7c0,0,0,0,0,0L1.7,62.5z M58.6,57.8l0-53.2h-54v53.2H58.6z"/>
<path id="_Bileşik_Yol_" class="st3" d="M61.5,0.5H1.7C1,0.5,0.5,1,0.5,1.7v59.1C0.5,61.4,1,62,1.6,62c0,0,0,0,0.1,0h59.9
	c0.6,0,1.2-0.5,1.2-1.1c0,0,0,0,0,0V1.7C62.8,1,62.2,0.5,61.5,0.5z M59.1,58.3H4.2V4.2c0,0,0-0.1,0-0.1h0h54.9c0,0,0,0,0,0.1
	L59.1,58.3L59.1,58.3z"/>
<circle class="st2" cx="15.7" cy="25" r="6.5"/>
<circle class="st3" cx="15.7" cy="25" r="5.9"/>
<circle class="st2" cx="31.4" cy="39.1" r="6.5"/>
<circle class="st3" cx="31.4" cy="39.1" r="5.9"/>
<circle class="st2" cx="46.8" cy="25" r="6.5"/>
<circle class="st3" cx="46.8" cy="25" r="5.9"/>
<polygon class="st5" points="59.1,58.2 59.1,58.3 4.2,58.3 4.2,60.3 59.1,60.3 59.1,58.2 "/>
<path class="st5" d="M61.5,0.5H1.7C1,0.5,0.5,1,0.5,1.7v2C0.5,3,1,2.5,1.7,2.5h59.8c0.7,0,1.2,0.5,1.3,1.2v-2
	C62.8,1,62.2,0.5,61.5,0.5z"/>
<path class="st6" d="M55.6,6.1h3.5v-2c0,0,0,0,0-0.1H4.2c0,0-0.1,0-0.1,0v0v2c0,0,0-0.1,0-0.1h0C4.2,6.1,55.6,6.1,55.6,6.1z"/>
<path class="st6" d="M61.6,62H1.7c-0.6,0-1.2-0.5-1.2-1.1c0,0,0,0,0-0.1v2C0.5,63.4,1,64,1.6,64c0,0,0,0,0.1,0h59.9
	c0.6,0,1.2-0.5,1.2-1.1c0,0,0,0,0,0v-2C62.8,61.5,62.3,62,61.6,62C61.6,62,61.6,62,61.6,62z"/>
<path class="st5" d="M15.7,21.1c2.9,0,5.3,2.1,5.9,4.9c0.7-3.2-1.3-6.4-4.6-7.1s-6.4,1.3-7.1,4.6c-0.2,0.8-0.2,1.7,0,2.6
	C10.4,23.2,12.8,21.1,15.7,21.1z"/>
<path class="st6" d="M15.7,31c-2.9,0-5.4-2.1-5.9-5c-0.7,3.2,1.3,6.4,4.6,7.1s6.4-1.3,7.1-4.6c0.2-0.8,0.2-1.7,0-2.6
	C21.1,28.9,18.6,31,15.7,31z"/>
<path class="st5" d="M31.4,35.2c2.9,0,5.3,2.1,5.9,4.9c0.7-3.2-1.3-6.4-4.6-7.1s-6.4,1.3-7.1,4.6c-0.2,0.8-0.2,1.7,0,2.6
	C26,37.3,28.5,35.2,31.4,35.2z"/>
<path class="st6" d="M31.4,45.1c-2.9,0-5.3-2.1-5.9-4.9c-0.7,3.2,1.3,6.4,4.6,7.1c3.2,0.7,6.4-1.3,7.1-4.6c0.2-0.8,0.2-1.7,0-2.6
	C36.7,43,34.2,45,31.4,45.1z"/>
<path class="st5" d="M46.8,21.1c2.9,0,5.3,2.1,5.9,4.9c0.8-3.2-1.2-6.5-4.5-7.2C45,18,41.8,20,41,23.2c-0.2,0.9-0.2,1.8,0,2.8
	C41.5,23.2,44,21.1,46.8,21.1z"/>
<path class="st6" d="M46.8,31c-2.9,0-5.3-2.1-5.8-5c-0.7,3.2,1.3,6.4,4.6,7.1s6.4-1.3,7.1-4.6c0.2-0.8,0.2-1.7,0-2.6
	C52.2,28.9,49.7,31,46.8,31z"/>
</svg>
