<?xml version="1.0" encoding="utf-8"?>
<!-- Generator: Adobe Illustrator 21.0.0, SVG Export Plug-In . SVG Version: 6.00 Build 0)  -->
<svg version="1.1" id="katman_1" xmlns="http://www.w3.org/2000/svg" xmlns:xlink="http://www.w3.org/1999/xlink" x="0px" y="0px"
	 viewBox="0 0 22.4 24" style="enable-background:new 0 0 22.4 24;" xml:space="preserve">
<style type="text/css">
	.st0{opacity:0.2;fill:#010101;enable-background:new    ;}
	.st1{fill:#7A3E1C;}
	.st2{fill:url(#SVGID_1_);}
	.st3{fill:url(#SVGID_2_);}
	.st4{fill:url(#SVGID_3_);}
	.st5{opacity:0.1;fill:#010101;enable-background:new    ;}
	.st6{opacity:0.1;fill:#FFFFFF;enable-background:new    ;}
	.st7{opacity:0.5;fill:#20396E;enable-background:new    ;}
	.st8{fill:url(#SVGID_4_);}
</style>
<title>folder-new_3</title>
<polygon class="st0" points="20.5,19.3 22.4,16.4 22,16.4 20.5,18.7 "/>
<path class="st1" d="M22.2,2.1c0-0.3-0.2-0.5-0.5-0.5l0,0h-8.2v-1C13.5,0.3,13.3,0,13,0H7C6.7,0,6.5,0.2,6.5,0.5v1H5
	c-0.3,0-0.5,0.2-0.5,0.5v1.8L3.9,3.7C3.4,3.4,2.8,3.2,2.2,3.1c-0.4,0-1.2,0.7-1.5,1C0.4,4.5,0.2,4.9,0,5.3c-0.1,0.4,0.5,1.7,0.8,2
	l0.4,0.6l-1,1.7C0.1,9.7,0.1,9.8,0.1,9.9v3.9c0,0.1,0.1,0.3,0.1,0.4l2,2.1l1.1,2.3c0.1,0.2,0.3,0.3,0.5,0.3h16.5h0.2l1.6-2.4
	l0.1-0.2L22.2,2.1z"/>
<linearGradient id="SVGID_1_" gradientUnits="userSpaceOnUse" x1="13.34" y1="7.44" x2="13.34" y2="24.61" gradientTransform="matrix(1 0 0 -1 0 23.73)">
	<stop  offset="0" style="stop-color:#7A3E1C;stop-opacity:0.8"/>
	<stop  offset="1" style="stop-color:#C96F29"/>
</linearGradient>
<path class="st2" d="M13.3,1.6V0.5c0-0.2-0.1-0.3-0.3-0.4H7c-0.2,0-0.4,0.1-0.4,0.3c0,0,0,0,0,0v1.1c0,0,0,0.1-0.1,0.1l0,0H5
	c-0.2,0-0.4,0.2-0.4,0.4v14.2H22V2.1c0-0.2-0.2-0.4-0.4-0.4l0,0h-8.3C13.4,1.7,13.3,1.7,13.3,1.6C13.3,1.6,13.3,1.6,13.3,1.6z"/>
<linearGradient id="SVGID_2_" gradientUnits="userSpaceOnUse" x1="22.9872" y1="4.6769" x2="20.3872" y2="7.0669" gradientTransform="matrix(1 0 0 -1 0 23.73)">
	<stop  offset="0" style="stop-color:#C96F29"/>
	<stop  offset="1" style="stop-color:#7A3E1C;stop-opacity:0.8"/>
</linearGradient>
<polygon class="st3" points="20.5,18.7 22,16.3 19.6,16.3 "/>
<linearGradient id="SVGID_3_" gradientUnits="userSpaceOnUse" x1="10.3" y1="5.2" x2="10.3" y2="20.48" gradientTransform="matrix(1 0 0 -1 0 23.73)">
	<stop  offset="0" style="stop-color:#DD932D"/>
	<stop  offset="6.000000e-02" style="stop-color:#FAAE42"/>
	<stop  offset="7.000000e-02" style="stop-color:#F9B045"/>
	<stop  offset="0.14" style="stop-color:#F8C863"/>
	<stop  offset="0.22" style="stop-color:#F8D87A"/>
	<stop  offset="0.3" style="stop-color:#F7E58B"/>
	<stop  offset="0.39" style="stop-color:#F7ED96"/>
	<stop  offset="0.5" style="stop-color:#F7F199"/>
	<stop  offset="1" style="stop-color:#FEDEB1"/>
</linearGradient>
<path class="st4" d="M20.1,3H6.8C6.4,3.5,5.9,4,5.6,4.5L5.4,4.6L4.2,4L3.8,3.8C3.3,3.5,2.7,3.4,2.2,3.3c-0.3,0-1.1,0.6-1.3,1
	C0.6,4.6,0.3,5,0.2,5.4C0.3,6,0.6,6.7,1,7.2l0.5,0.7L0.3,9.7c0,0.1-0.1,0.1-0.1,0.2v3.9c0,0.1,0,0.2,0.1,0.3l2,2.1l0,0l1.1,2.3
	c0.1,0.1,0.2,0.2,0.3,0.2h16.6V3.3C20.4,3.2,20.3,3,20.1,3z"/>
<path class="st5" d="M20.7,2.4H7.4C7.2,2.6,7,2.8,6.8,3h13.3c0.2,0,0.4,0.2,0.4,0.4c0,0,0,0,0,0v15.3l0.6-0.9v-15
	C21.1,2.6,20.9,2.4,20.7,2.4C20.7,2.4,20.7,2.4,20.7,2.4z"/>
<path class="st6" d="M7,0.9h6c0.2,0,0.4,0.2,0.4,0.4V0.5c0-0.2-0.2-0.4-0.4-0.4H7c-0.2,0-0.4,0.1-0.4,0.3c0,0,0,0,0,0v0.7
	C6.6,1,6.8,0.8,7,0.9C7,0.8,7,0.8,7,0.9z"/>
<path class="st6" d="M5,2.4h1.5c0,0,0.1,0,0.1-0.1l0,0V1.6c0,0,0,0.1-0.1,0.1l0,0H5c-0.2,0-0.4,0.2-0.4,0.4v0.7
	C4.6,2.5,4.8,2.4,5,2.4z"/>
<path class="st6" d="M21.7,1.7h-8.3c0,0-0.1,0-0.1-0.1c0,0,0,0,0,0v0.7c0,0,0,0.1,0.1,0.1l0,0h8.3c0.2,0,0.4,0.2,0.4,0.4
	c0,0,0,0,0,0V2.1C22.1,1.9,21.9,1.7,21.7,1.7L21.7,1.7z"/>
<path class="st6" d="M20.1,3H6.8C6.4,3.5,5.9,4,5.6,4.5L5.4,4.6L4.2,4L3.8,3.8C3.3,3.5,2.7,3.4,2.2,3.3c-0.3,0-1.1,0.6-1.3,1
	C0.6,4.6,0.3,5,0.2,5.4c0,0.2,0,0.3,0.1,0.5C0.4,5.5,0.6,5.2,0.8,5c0.3-0.3,1-1,1.3-1c0.6,0.1,1.1,0.3,1.6,0.5l0.4,0.2l1.1,0.5
	l0.2-0.1c0.4-0.5,0.8-1,1.2-1.5h13.3c0.2,0,0.4,0.2,0.4,0.4c0,0,0,0,0,0V3.3C20.5,3.1,20.3,3,20.1,3z"/>
<path class="st0" d="M3.5,18.5l-1.1-2.3l0,0l-2-2.1c-0.1-0.1-0.1-0.2-0.1-0.3v0.7c0,0.1,0,0.2,0.1,0.3l2,2.1l0,0l1.1,2.3
	c0.1,0.1,0.2,0.2,0.3,0.2h16.6v-0.7H3.9C3.7,18.7,3.6,18.6,3.5,18.5z"/>
<path class="st7" d="M13.9,23.4c-0.5,0-0.8-0.4-0.8-0.8v-3.6H9.4c-0.5,0-0.8-0.4-0.8-0.8v-3c0-0.5,0.4-0.8,0.8-0.8h3.6v-3.7
	c0-0.5,0.4-0.8,0.8-0.8h3c0.5,0,0.8,0.4,0.8,0.8v3.6h3.6c0.5,0,0.8,0.4,0.8,0.8v3c0,0.5-0.4,0.8-0.8,0.8h-3.6v3.6
	c0,0.5-0.4,0.8-0.8,0.8L13.9,23.4z"/>
<linearGradient id="SVGID_4_" gradientUnits="userSpaceOnUse" x1="15.3906" y1="-4.42" x2="15.3906" y2="12.24" gradientTransform="matrix(1 0 0 -1 0 23.73)">
	<stop  offset="0.16" style="stop-color:#41A4DC"/>
	<stop  offset="0.65" style="stop-color:#42B4E7"/>
	<stop  offset="1" style="stop-color:#A7DEEF"/>
</linearGradient>
<path class="st8" d="M21.4,14.3h-3.7v-3.7c0-0.4-0.3-0.7-0.7-0.7h-3c-0.4,0-0.7,0.3-0.7,0.7v3.7H9.4c-0.4,0-0.7,0.3-0.7,0.7v3
	c0,0.4,0.3,0.7,0.7,0.7h3.7v3.7c0,0.4,0.3,0.7,0.7,0.7h3c0.4,0,0.7-0.3,0.7-0.7v-3.7h3.7c0.4,0,0.7-0.3,0.7-0.7v-3
	C22.1,14.7,21.8,14.3,21.4,14.3C21.4,14.3,21.4,14.3,21.4,14.3z"/>
<path class="st6" d="M13.9,10.6h3c0.4,0,0.7,0.3,0.7,0.7v-0.7c0-0.4-0.3-0.7-0.7-0.7h-3c-0.4,0-0.7,0.3-0.7,0.7v0.7
	C13.1,10.9,13.5,10.6,13.9,10.6L13.9,10.6z"/>
<path class="st6" d="M9.4,15h3.7v-0.7H9.4c-0.4,0-0.7,0.3-0.7,0.7v0.7C8.7,15.3,9,15,9.4,15z"/>
<path class="st6" d="M21.4,14.3h-3.7V15h3.7c0.4,0,0.7,0.3,0.7,0.7V15C22.1,14.6,21.8,14.3,21.4,14.3z"/>
<path class="st0" d="M13.1,18.8H9.4c-0.4,0-0.7-0.3-0.7-0.7v0.7c0,0.4,0.3,0.7,0.7,0.7h3.7V18.8z"/>
<path class="st0" d="M16.9,23.3h-3c-0.4,0-0.7-0.3-0.7-0.7v0.7c0,0.4,0.3,0.7,0.7,0.7h3c0.4,0,0.7-0.3,0.7-0.7v-0.7
	C17.7,23,17.3,23.3,16.9,23.3z"/>
<path class="st0" d="M21.4,18.8h-3.7v0.7h3.7c0.4,0,0.7-0.3,0.7-0.7v-0.7C22.1,18.5,21.8,18.8,21.4,18.8
	C21.4,18.8,21.4,18.8,21.4,18.8z"/>
</svg>
