<?xml version="1.0" encoding="utf-8"?>
<!-- Generator: Adobe Illustrator 21.0.0, SVG Export Plug-In . SVG Version: 6.00 Build 0)  -->
<svg version="1.1" id="katman_1" xmlns="http://www.w3.org/2000/svg" xmlns:xlink="http://www.w3.org/1999/xlink" x="0px" y="0px"
	 viewBox="0 0 15.2 16" style="enable-background:new 0 0 15.2 16;" xml:space="preserve">
<style type="text/css">
	.st0{opacity:0.7;fill:#333333;enable-background:new    ;}
	.st1{fill:url(#SVGID_1_);}
	.st2{opacity:0.1;fill:#FFFFFF;enable-background:new    ;}
	.st3{fill:url(#SVGID_2_);}
	.st4{opacity:0.1;fill:#010101;enable-background:new    ;}
	.st5{fill:url(#SVGID_3_);}
	.st6{fill:#1A1A1A;}
	.st7{fill:#E6E7E8;}
	.st8{fill:#404041;}
	.st9{opacity:0.2;fill:#A6A6A6;enable-background:new    ;}
	.st10{fill:#FAFAFA;}
	.st11{fill:url(#SVGID_4_);}
</style>
<title>preferences-desktop-default-applications_11</title>
<path class="st0" d="M4.5,11.5c-0.1,0-0.3-0.1-0.3-0.3l0,0V0.3C4.2,0.1,4.3,0,4.5,0h1.2C5.9,0,6,0.1,6,0.2c0,0,0,0,0,0v0.1l0,0h1.3
	l0,0V0.3C7.3,0.1,7.4,0,7.5,0c0,0,0,0,0,0h4.9c0.1,0,0.3,0.1,0.3,0.3c0,0,0,0,0,0v0.1l0,0H13l0,0V0.3C13,0.1,13.1,0,13.3,0
	c0,0,0.1,0,0.1,0h0.5c0.1,0,0.3,0.1,0.4,0.2L15.1,1c0.1,0.1,0.1,0.2,0.1,0.4v9.9c0,0.1-0.1,0.3-0.3,0.3h0L4.5,11.5z"/>
<linearGradient id="SVGID_1_" gradientUnits="userSpaceOnUse" x1="9.6904" y1="4.11" x2="9.6904" y2="16.06" gradientTransform="matrix(1 0 0 -1 0 15.73)">
	<stop  offset="0" style="stop-color:#1A1A1A"/>
	<stop  offset="1" style="stop-color:#595959"/>
</linearGradient>
<path class="st1" d="M13.4,0.1c-0.1,0-0.1,0.1-0.1,0.2v0.1c0,0.1-0.1,0.1-0.1,0.2h-0.3c-0.1,0-0.2-0.1-0.2-0.1c0,0,0,0,0,0V0.3
	c0-0.1-0.1-0.1-0.1-0.2H7.6c-0.1,0-0.2,0.1-0.2,0.1c0,0,0,0,0,0v0.1c0,0.1-0.1,0.2-0.2,0.2l0,0H6c-0.1,0-0.1-0.1-0.1-0.2V0.3
	c0-0.1-0.1-0.2-0.2-0.2l0,0H4.5c-0.1,0-0.2,0.1-0.2,0.1c0,0,0,0,0,0v10.9c0,0.1,0.1,0.1,0.2,0.1h10.5c0.1,0,0.1-0.1,0.1-0.1V1.3
	c0-0.1,0-0.2-0.1-0.3l-0.8-0.8c-0.1-0.1-0.2-0.1-0.3-0.1L13.4,0.1z"/>
<path class="st2" d="M15,1.1l-0.8-0.8c-0.1-0.1-0.2-0.1-0.3-0.1h-0.5c-0.1,0-0.1,0.1-0.1,0.2v0.1c0,0.1-0.1,0.1-0.1,0.2h-0.3
	c-0.1,0-0.2,0-0.2-0.1c0,0,0,0,0,0V0.3c0-0.1-0.1-0.1-0.1-0.2H7.6c-0.1,0-0.2,0.1-0.2,0.1c0,0,0,0,0,0v0.1c0,0.1-0.1,0.2-0.2,0.2
	l0,0H6c-0.1,0-0.1-0.1-0.1-0.2V0.3c0-0.1-0.1-0.2-0.2-0.2l0,0H4.5c-0.1,0-0.2,0.1-0.2,0.1c0,0,0,0,0,0v0.5c0-0.1,0.1-0.2,0.1-0.2
	c0,0,0,0,0,0h1.2c0.1,0,0.2,0.1,0.2,0.1v0v0.1C5.9,0.9,5.9,1,6,1c0,0,0,0,0,0h1.3c0.1,0,0.2-0.1,0.2-0.1c0,0,0,0,0,0V0.8
	c0-0.1,0.1-0.2,0.1-0.2c0,0,0,0,0,0h4.9c0.1,0,0.1,0.1,0.1,0.1v0.1c0,0.1,0.1,0.1,0.1,0.2h0.3c0.1,0,0.1-0.1,0.1-0.1V0.8
	c0-0.1,0.1-0.2,0.1-0.2c0,0,0,0,0,0h0.5c0.1,0,0.2,0,0.3,0.1L15,1.6c0.1,0.1,0.1,0.2,0.1,0.3V1.3C15.1,1.2,15.1,1.1,15,1.1z"/>
<linearGradient id="SVGID_2_" gradientUnits="userSpaceOnUse" x1="7.53" y1="14.08" x2="12.48" y2="14.08" gradientTransform="matrix(1 0 0 -1 0 15.73)">
	<stop  offset="0" style="stop-color:#CCCCCC"/>
	<stop  offset="1.000000e-02" style="stop-color:#D2D2D2"/>
	<stop  offset="5.000000e-02" style="stop-color:#E3E3E3"/>
	<stop  offset="0.1" style="stop-color:#EEEEEE"/>
	<stop  offset="0.17" style="stop-color:#F5F5F5"/>
	<stop  offset="0.36" style="stop-color:#F7F7F7"/>
	<stop  offset="0.7" style="stop-color:#F5F5F5"/>
	<stop  offset="0.82" style="stop-color:#EEEEEE"/>
	<stop  offset="0.91" style="stop-color:#E3E3E3"/>
	<stop  offset="0.98" style="stop-color:#D2D2D2"/>
	<stop  offset="1" style="stop-color:#CCCCCC"/>
</linearGradient>
<path class="st3" d="M7.7,0.2h4.6c0.1,0,0.1,0.1,0.1,0.2v2.6c0,0.1-0.1,0.2-0.1,0.2H7.7C7.6,3.1,7.5,3,7.5,2.9V0.4
	C7.5,0.3,7.6,0.2,7.7,0.2z"/>
<path class="st4" d="M14.9,11.3H4.5c-0.1,0-0.2-0.1-0.2-0.1v0.5c0,0.1,0.1,0.1,0.2,0.1h10.5c0.1,0,0.1-0.1,0.1-0.1v-0.5
	C15.1,11.3,15,11.3,14.9,11.3z"/>
<linearGradient id="SVGID_3_" gradientUnits="userSpaceOnUse" x1="9.66" y1="4.04" x2="9.66" y2="15.18" gradientTransform="matrix(1 0 0 -1 0 15.73)">
	<stop  offset="0" style="stop-color:#CCCCCC"/>
	<stop  offset="1.000000e-02" style="stop-color:#D2D2D2"/>
	<stop  offset="5.000000e-02" style="stop-color:#E3E3E3"/>
	<stop  offset="0.1" style="stop-color:#EEEEEE"/>
	<stop  offset="0.17" style="stop-color:#F5F5F5"/>
	<stop  offset="0.36" style="stop-color:#F7F7F7"/>
	<stop  offset="0.7" style="stop-color:#F5F5F5"/>
	<stop  offset="0.82" style="stop-color:#EEEEEE"/>
	<stop  offset="0.91" style="stop-color:#E3E3E3"/>
	<stop  offset="0.98" style="stop-color:#D2D2D2"/>
	<stop  offset="1" style="stop-color:#CCCCCC"/>
</linearGradient>
<path class="st5" d="M6.1,4.8h7.1c0.1,0,0.1,0.1,0.1,0.2v5.6c0,0.1-0.1,0.1-0.1,0.1H6.1C6,10.8,6,10.7,6,10.6V5C6,4.9,6,4.8,6.1,4.8
	z"/>
<rect x="6.8" y="6.1" class="st6" width="5.6" height="0.2"/>
<rect x="6.8" y="6.9" class="st6" width="5.6" height="0.2"/>
<rect x="6.8" y="7.8" class="st6" width="5.6" height="0.2"/>
<rect x="6.8" y="8.6" class="st6" width="5.6" height="0.2"/>
<rect x="6.8" y="9.5" class="st6" width="5.6" height="0.2"/>
<path class="st7" d="M13.8,9.6h0.7c0.1,0,0.1,0.1,0.1,0.1V10c0,0.1-0.1,0.1-0.1,0.1h-0.7c-0.1,0-0.1-0.1-0.1-0.1V9.8
	C13.7,9.7,13.8,9.6,13.8,9.6z"/>
<path class="st2" d="M12.3,0.2H7.7c-0.1,0-0.2,0.1-0.2,0.1c0,0,0,0,0,0v0.5c0-0.1,0.1-0.1,0.2-0.1l0,0h4.6c0.1,0,0.1,0.1,0.1,0.2
	V0.4C12.5,0.3,12.4,0.2,12.3,0.2z"/>
<path class="st4" d="M12.3,3.1H7.7C7.6,3.1,7.5,3,7.5,2.9v0v0.5c0,0.1,0.1,0.2,0.2,0.2l0,0h4.6c0.1,0,0.1-0.1,0.1-0.2V2.9
	C12.5,3,12.4,3.1,12.3,3.1z"/>
<path class="st4" d="M11.7,0.5h-0.8c-0.1,0-0.1,0.1-0.1,0.2v0.5C10.8,1,10.8,1,10.9,1h0.8c0.1,0,0.1,0.1,0.1,0.1V0.7
	C11.9,0.6,11.8,0.5,11.7,0.5C11.7,0.5,11.7,0.5,11.7,0.5z"/>
<path class="st8" d="M10.9,0.5h0.8c0.1,0,0.1,0.1,0.1,0.2v2c0,0.1-0.1,0.2-0.1,0.2h-0.8c-0.1,0-0.1-0.1-0.1-0.2v-2
	C10.8,0.6,10.8,0.5,10.9,0.5z"/>
<path class="st9" d="M6.1,8.1c-0.8,0-1.4,0.6-1.4,1.4S5.3,11,6.1,11s1.4-0.6,1.4-1.4S6.9,8.1,6.1,8.1C6.1,8.1,6.1,8.1,6.1,8.1z
	 M6.1,10.1c-0.3,0-0.5-0.2-0.5-0.5S5.8,9,6.1,9c0.3,0,0.5,0.2,0.5,0.5S6.4,10.1,6.1,10.1L6.1,10.1z"/>
<path class="st9" d="M6.1,8.9c-0.4,0-0.7,0.3-0.7,0.7s0.3,0.7,0.7,0.7c0.4,0,0.7-0.3,0.7-0.7l0,0C6.7,9.2,6.4,8.9,6.1,8.9z
	 M6.1,10.1c-0.3,0-0.5-0.2-0.5-0.5S5.8,9,6.1,9c0.3,0,0.5,0.2,0.5,0.5S6.4,10.1,6.1,10.1L6.1,10.1z"/>
<path class="st10" d="M6.1,7.8c-1,0-1.8,0.8-1.8,1.7s0.8,1.8,1.8,1.8s1.8-0.8,1.8-1.8S7,7.8,6.1,7.8z M6.1,11
	c-0.8,0-1.4-0.6-1.4-1.4c0-0.8,0.6-1.4,1.4-1.4s1.4,0.6,1.4,1.4C7.5,10.3,6.9,11,6.1,11C6.1,11,6.1,11,6.1,11L6.1,11z"/>
<path class="st0" d="M6.1,15.6C2.7,15.6,0,12.9,0,9.6s2.7-6.1,6.1-6.1s6.1,2.7,6.1,6.1l0,0C12.2,12.9,9.4,15.6,6.1,15.6z M6.1,7.9
	c-0.9,0-1.6,0.7-1.6,1.6s0.7,1.6,1.6,1.6s1.6-0.7,1.6-1.6S7,7.9,6.1,7.9L6.1,7.9z"/>
<linearGradient id="SVGID_4_" gradientUnits="userSpaceOnUse" x1="9.6635" y1="-1.5777" x2="2.3735" y2="14.1023" gradientTransform="matrix(1 0 0 -1 0 15.73)">
	<stop  offset="0" style="stop-color:#000000"/>
	<stop  offset="5.000000e-02" style="stop-color:#232323"/>
	<stop  offset="0.18" style="stop-color:#7C7C7C"/>
	<stop  offset="0.29" style="stop-color:#BEBEBE"/>
	<stop  offset="0.37" style="stop-color:#E6E6E6"/>
	<stop  offset="0.41" style="stop-color:#F6F6F6"/>
	<stop  offset="0.69" style="stop-color:#878787"/>
	<stop  offset="1" style="stop-color:#FFFFFF"/>
</linearGradient>
<path class="st11" d="M6.1,3.6c-3.3,0-6,2.7-6,6s2.7,6,6,6s6-2.7,6-6S9.4,3.6,6.1,3.6L6.1,3.6z M6.1,11.3c-1,0-1.7-0.8-1.7-1.7
	s0.8-1.7,1.7-1.7c1,0,1.7,0.8,1.7,1.7c0,0,0,0,0,0C7.8,10.5,7,11.3,6.1,11.3z"/>
<path class="st2" d="M6.1,11.8c0.9,0,1.7-0.7,1.7-1.7c0-0.1,0-0.2,0-0.3c-0.1,0.9-1,1.6-1.9,1.5c-0.8-0.1-1.4-0.7-1.5-1.5
	c-0.2,0.9,0.5,1.8,1.4,2C5.9,11.8,6,11.8,6.1,11.8L6.1,11.8z"/>
<path class="st2" d="M6.1,4.1c3.2,0,5.8,2.5,5.9,5.7c0-0.1,0-0.2,0-0.2c0.4-3.3-1.9-6.3-5.2-6.7S0.5,4.8,0.1,8.1
	C0,8.6,0,9.1,0.1,9.6c0,0.1,0,0.2,0,0.2C0.2,6.6,2.9,4.1,6.1,4.1z"/>
<path class="st4" d="M6.1,8.3c0.9,0,1.6,0.6,1.7,1.5C8,8.9,7.3,8,6.4,7.8s-1.8,0.5-2,1.4c0,0.2,0,0.4,0,0.6C4.5,8.9,5.2,8.3,6.1,8.3
	z"/>
<path class="st4" d="M6.1,15.5c-3.2,0-5.8-2.5-5.9-5.7c0,0.1,0,0.2,0,0.2c0.5,3.3,3.6,5.5,6.8,5c2.6-0.4,4.7-2.5,5-5.1
	c0-0.1,0-0.2,0-0.2C11.9,12.9,9.3,15.5,6.1,15.5z"/>
</svg>
