<?xml version="1.0" encoding="utf-8"?>
<!-- Generator: Adobe Illustrator 21.0.0, SVG Export Plug-In . SVG Version: 6.00 Build 0)  -->
<svg version="1.1" id="katman_1" xmlns="http://www.w3.org/2000/svg" xmlns:xlink="http://www.w3.org/1999/xlink" x="0px" y="0px"
	 viewBox="0 0 16 13.6" style="enable-background:new 0 0 16 13.6;" xml:space="preserve">
<style type="text/css">
	.st0{fill:#E7E9EC;}
	.st1{fill:#2C2F33;}
	.st2{fill:url(#SVGID_1_);}
</style>
<title>Varlık 10</title>
<path class="st0" d="M3,13.6c-0.2,0-0.4-0.1-0.5-0.4l-0.8-1.6l-1.4-1.4C0.1,10.1,0.1,10,0.1,9.8V7.1c0-0.1,0-0.2,0.1-0.3l0.6-1.1
	L0.6,5.4c0,0-0.8-1.2-0.6-1.7c0.1-0.3,0.3-0.6,0.5-0.9c0.1-0.1,0.7-0.8,1.2-0.8C2.2,2.2,2.6,2.3,3,2.5l0.2,0.1v-1
	c0-0.3,0.2-0.5,0.5-0.5l0,0h0.9V0.5C4.6,0.2,4.8,0,5.1,0c0,0,0,0,0,0h4.2c0.3,0,0.5,0.2,0.5,0.5c0,0,0,0,0,0v0.6h5.6
	c0.3,0,0.5,0.2,0.5,0.5c0,0,0,0,0,0v10.2h-1v1.8L3,13.6L3,13.6z"/>
<path class="st1" d="M3.4,11.6V1.6c0-0.2,0.1-0.3,0.3-0.3h1.1V0.5c0-0.2,0.1-0.3,0.3-0.3c0,0,0,0,0,0h4.2c0.2,0,0.3,0.1,0.3,0.3v0.8
	h5.8c0.2,0,0.3,0.1,0.3,0.3v10.1H3.4z"/>
<linearGradient id="SVGID_1_" gradientUnits="userSpaceOnUse" x1="4.05" y1="10.5" x2="4.05" y2="10.57" gradientTransform="matrix(1 0 0 -1 0 13.73)">
	<stop  offset="0" style="stop-color:#C96E28;stop-opacity:0.6"/>
	<stop  offset="1" style="stop-color:#793D1A;stop-opacity:0.8"/>
</linearGradient>
<path class="st2" d="M4.1,3.2L4.1,3.2L4.1,3.2z"/>
<path class="st0" d="M14.4,2.2H5c-0.3,0.3-0.6,0.7-0.9,1L4,3.3L3.2,3L2.9,2.8C2.5,2.6,2.1,2.5,1.8,2.4C1.5,2.4,1,2.9,0.8,3.1
	C0.6,3.3,0.5,3.6,0.4,3.9c0.1,0.5,0.3,0.9,0.5,1.3l0.3,0.5L0.5,7c0,0,0,0.1,0,0.1v2.7c0,0.1,0,0.1,0,0.2l1.4,1.5l0,0l0.8,1.6
	c0,0.1,0.1,0.2,0.2,0.1h11.7V2.5C14.6,2.3,14.5,2.2,14.4,2.2z"/>
<path class="st1" d="M3,13.5c-0.2,0-0.3-0.1-0.4-0.2l-0.8-1.6l-1.4-1.5c-0.1-0.1-0.1-0.2-0.1-0.3V7.1c0-0.1,0-0.2,0.1-0.2L1,5.7
	L0.8,5.3C0.6,5,0.1,4.1,0.2,3.8C0.3,3.5,0.5,3.3,0.7,3c0.1-0.2,0.8-0.8,1.1-0.7C2.2,2.3,2.6,2.5,3,2.7l0.3,0.1L4,3.2l0,0L4.2,3
	c0.2-0.3,0.5-0.6,0.8-0.9l0,0h9.4c0.2,0,0.4,0.2,0.4,0.4l0,0v10.9L3,13.5z M1.7,2.6C1.4,2.7,1.1,2.9,0.9,3.2
	C0.8,3.4,0.6,3.7,0.5,3.9C0.6,4.4,0.8,4.8,1,5.1l0.4,0.6L0.6,7c0,0,0,0,0,0.1v2.8c0,0,0,0,0,0.1L2,11.4l0,0.1l0.8,1.6
	c0,0,0.1,0.1,0.1,0.1h11.5V2.5c0-0.1,0-0.1-0.1-0.1l0,0H5.1C4.8,2.6,4.6,2.9,4.4,3.2C4.3,3.4,4.3,3.4,4.2,3.4H4.2
	c-0.1,0-0.2,0-0.2,0L3.2,3.1L2.8,3C2.5,2.8,2.1,2.7,1.7,2.6L1.7,2.6z"/>
<path class="st1" d="M3.7,9.1C3.7,9.1,3.7,9.1,3.7,9.1L3.7,9.1L3.7,9.1z"/>
<path class="st1" d="M3.9,9L4,8.9L3.9,9C3.9,9,4,9,3.9,9C4,8.9,3.9,9,3.9,9z"/>
<path class="st1" d="M4.1,8.9C4.2,8.9,4.1,8.8,4.1,8.9S4.1,8.9,4.1,8.9z"/>
<path class="st1" d="M8.1,7L8.1,7C8,7,8,7.1,8.1,7z"/>
<path class="st1" d="M8,7L8,7z"/>
<path class="st1" d="M6.6,7.2c-0.1,0-0.1,0.1-0.2,0.1H6.3c-0.1,0,0,0-0.1,0.1C6.2,7.4,6.1,7.5,6,7.5c0,0,0,0,0-0.1S5.9,7.6,5.8,7.6
	l0,0C5.6,7.8,5.3,7.9,5,8.1l0,0C4.7,8.3,4.5,8.5,4.2,8.7c0.2-0.1,0.4-0.2,0.6-0.4S4.9,8.3,5,8.3c0.2-0.1,0.3-0.2,0.5-0.3l0,0
	L5.3,8.1h0.1c0,0-0.2,0.1-0.2,0.1C5.4,8.1,5.7,8,5.8,7.9C5.7,7.9,5.7,7.9,5.6,8S5.5,8,5.5,8c0.2-0.1,0.4-0.3,0.6-0.3
	c0.1,0,0.1-0.1,0.2-0.1s0,0,0,0s0-0.1,0.1-0.1v0.1c0-0.1,0.2-0.1,0.2-0.1s0,0.1-0.1,0.1s0.1-0.1,0.1-0.1v0.1c0-0.1,0.1,0,0.2,0
	s-0.1,0,0-0.1s0,0,0,0s0-0.1,0.1-0.1s0,0,0,0.1c0,0,0.1,0,0.1,0c0.1,0,0,0,0-0.1s0,0.1,0.1,0.1l0,0.2l0.1-0.1c0,0,0.1,0,0,0
	c0.2-0.1,0.3-0.1,0.5-0.2H7.6c0,0,0.1,0,0.1,0s0-0.1,0-0.1c0.1,0,0.2,0,0.2,0l0,0C8,7,8,7,8.1,7s0,0,0,0s0.1,0,0.1,0v0.1
	c0.1,0,0.1-0.1,0.1,0s0.2-0.1,0.3-0.2l0,0c0-0.1,0.2-0.1,0.2-0.2l0,0L9,6.6c0.1-0.1,0.2-0.1,0.3-0.1c0-0.1,0.1-0.1,0.2-0.2
	c0.5-0.2,1-0.4,1.4-0.6c0.1,0,0.2-0.1,0.2-0.1c-0.1,0-0.1,0-0.2,0.1c-0.1,0-0.1,0-0.2,0l0,0c-0.1,0.1-0.1,0-0.1,0.1V5.7
	c0,0-0.1,0-0.1,0v0.1c-0.1,0-0.1,0-0.1,0l0,0c0,0-0.2,0.1-0.2,0s0,0-0.1,0.1l0,0c-0.1,0-0.1,0.1-0.1,0c0,0,0,0,0-0.1
	C9.6,5.9,9.9,5.9,9.6,6v0l0,0H9.6c0,0.1-0.3,0.1-0.4,0.2S9,6.2,8.9,6.3l0,0c-0.1,0-0.4,0.1-0.5,0s0,0,0,0s-0.2,0-0.2,0.1s0.1,0,0,0
	S8.1,6.4,7.9,6.5s0,0,0-0.1C7.8,6.5,7.6,6.6,7.4,6.7L6.7,6.9l0,0C6.6,6.9,6.5,7,6.4,7L6.6,7.2z"/>
<path class="st1" d="M5.4,8.3L5.4,8.3L5.4,8.3C5.5,8.2,5.4,8.2,5.4,8.3z"/>
<polygon class="st1" points="5.4,8.1 5.3,8.2 5.4,8.1 "/>
<polygon class="st1" points="6.7,7.6 6.7,7.6 6.5,7.7 "/>
<path class="st1" d="M8.1,7.1C8.1,7.1,8,7.1,8.1,7.1L8.1,7.1L8.1,7.1z"/>
<path class="st1" d="M9,6.8C9,6.7,9.1,6.8,9,6.8C8.9,6.7,9.1,6.8,9,6.8z"/>
<path class="st1" d="M9.2,6.6C9.2,6.6,9.2,6.6,9.2,6.6C9.2,6.7,9.2,6.7,9.2,6.6z"/>
<path class="st1" d="M4.2,10C4.2,10,4.2,10,4.2,10l0.1-0.1L4.2,10z"/>
<path class="st1" d="M4.4,9.9l0.1-0.1L4.4,9.9c-0.1,0,0-0.1,0-0.1S4.4,9.8,4.4,9.9z"/>
<path class="st1" d="M4.6,9.7C4.6,9.7,4.6,9.6,4.6,9.7S4.5,9.7,4.6,9.7z"/>
<path class="st1" d="M8.7,7.7L8.7,7.7C8.7,7.7,8.6,7.8,8.7,7.7z"/>
<path class="st1" d="M8.7,7.7L8.7,7.7z"/>
<path class="st1" d="M7.1,8C7.1,8,7,8.1,7,8.1H6.9c-0.1,0.1,0,0-0.1,0.1c-0.1,0-0.2,0.1-0.2,0.1c0,0,0,0,0-0.1S6.5,8.4,6.4,8.4l0,0
	C6.2,8.6,5.8,8.8,5.6,9l0,0C5.3,9.1,5,9.4,4.7,9.6c0.2-0.1,0.4-0.2,0.6-0.4c0.1,0,0.2-0.1,0.2-0.1C5.8,9,5.8,8.9,6.1,8.8
	c0,0,0,0,0.1,0L6,8.9h0.1C6.1,8.9,6,9,6,9c0.1-0.1,0.4-0.2,0.5-0.4c-0.1,0-0.2,0.1-0.2,0.1s-0.1,0-0.1,0c0.2-0.1,0.4-0.3,0.6-0.4
	c0.1,0,0.1-0.1,0.2-0.1s0,0,0,0.1s0-0.1,0.1-0.1v0.1c0-0.1,0.2-0.1,0.2-0.1s0,0.1-0.1,0.1s0.1-0.1,0.1-0.1v0.1c0-0.1,0.1,0,0.2,0
	s-0.1,0,0-0.1s0,0,0,0s0-0.1,0.1-0.1s0,0,0,0.1c0,0,0.1,0,0.1,0c0.1,0,0,0,0-0.1s0,0.1,0.1,0.1S7.6,8.3,7.5,8.4l0.2-0.1
	c0,0,0.1,0,0.1,0C7.9,8.2,8.1,8.1,8.2,8c0,0-0.1,0-0.1,0s0.1,0,0.1,0s0-0.1,0.1-0.1c0.1,0,0.2,0,0.3,0l0,0c0.1,0,0.1-0.1,0.2-0.1
	s0,0,0,0s0.1,0,0.1,0v0.1c0.1,0,0.1-0.1,0.1,0s0.2-0.1,0.4-0.2l0,0c0-0.1,0.2-0.1,0.3-0.2l0,0l0.1-0.1c0.1,0,0.2-0.1,0.3-0.1
	c0-0.1,0.1-0.1,0.2-0.2c0.5-0.1,1-0.3,1.5-0.5c0.1-0.1,0.2-0.1,0.3-0.2c-0.1,0-0.1,0-0.2,0.1c-0.1,0-0.1,0-0.2,0l0,0
	c-0.1,0.1-0.1,0-0.2,0.1V6.5c0,0-0.1,0-0.1,0v0.1c-0.1,0-0.1,0-0.1,0l0,0c0,0-0.3,0.1-0.2,0c0,0,0,0-0.1,0l0,0c-0.1,0-0.1,0.1-0.1,0
	c0,0,0,0,0-0.1c-0.3,0.1,0,0.2-0.2,0.2l0,0h-0.1h-0.1C10.3,6.8,10,6.8,9.9,6.9s-0.1,0-0.2,0l0,0c-0.1,0-0.4,0.1-0.5,0s0,0,0,0
	S9,6.9,8.9,7s0.1,0,0,0S8.8,7.1,8.6,7.1c0,0,0,0,0.1-0.1C8.5,7.1,8.3,7.2,8.1,7.3C7.9,7.4,7.6,7.5,7.3,7.6l0,0
	C7.2,7.6,7.1,7.7,7,7.7L7.1,8z"/>
<path class="st1" d="M5.9,9L5.9,9L5.9,9C6,9,6,9,5.9,9z"/>
<polygon class="st1" points="5.9,8.9 5.8,9 5.9,8.9 "/>
<polygon class="st1" points="7.3,8.3 7.2,8.3 7.1,8.4 "/>
<path class="st1" d="M8.7,7.8C8.7,7.8,8.7,7.8,8.7,7.8L8.7,7.8L8.7,7.8z"/>
<path class="st1" d="M9.7,7.5C9.7,7.5,9.8,7.5,9.7,7.5C9.6,7.4,9.7,7.5,9.7,7.5z"/>
<path class="st1" d="M9.9,7.4C9.9,7.4,9.9,7.4,9.9,7.4C9.9,7.4,9.9,7.4,9.9,7.4z"/>
<path class="st1" d="M5.1,10.6C5.1,10.6,5.1,10.6,5.1,10.6L5.1,10.6L5.1,10.6z"/>
<path class="st1" d="M5.2,10.5l0.1-0.1L5.2,10.5c0,0,0.1-0.1,0.1-0.1S5.2,10.5,5.2,10.5z"/>
<path class="st1" d="M5.4,10.4C5.4,10.4,5.4,10.3,5.4,10.4S5.4,10.4,5.4,10.4z"/>
<path class="st1" d="M9.1,8.7L9.1,8.7C9.1,8.7,9.1,8.7,9.1,8.7z"/>
<path class="st1" d="M9.1,8.7L9.1,8.7z"/>
<path class="st1" d="M7.7,8.9C7.7,8.9,7.6,9,7.6,9H7.5c-0.1,0,0,0-0.1,0.1c-0.1,0-0.2,0.1-0.2,0.1c0,0,0,0,0-0.1S7.2,9.2,7.1,9.3
	l0,0C6.8,9.4,6.5,9.6,6.3,9.7l0,0C6,9.8,5.7,10,5.5,10.3c0.1-0.1,0.4-0.2,0.5-0.3s0.1-0.1,0.2-0.1c0.2-0.1,0.3-0.2,0.5-0.3l0,0
	L6.6,9.7h0.1c0,0-0.2,0.1-0.2,0.1C6.7,9.7,6.9,9.6,7,9.5C7,9.5,6.9,9.6,6.8,9.6s-0.1,0-0.1,0c0.2-0.1,0.4-0.2,0.6-0.3
	c0.1,0,0.1-0.1,0.1,0s0,0,0,0s0-0.1,0.1-0.1v0.1c0-0.1,0.1,0,0.2-0.1s0,0.1-0.1,0.1s0.1-0.1,0.1-0.1v0.1c0-0.1,0.1,0,0.2,0
	s-0.1,0,0-0.1S8,9,8,9c0,0,0.1,0,0.1,0c0,0,0,0,0,0.1c0,0,0.1,0,0.1,0c0.1,0,0,0,0-0.1s0,0.1,0.1,0.1S8.1,9.2,8.1,9.2l0.1-0.1
	c0,0,0.1,0,0,0C8.4,9.1,8.5,9,8.6,8.9c0,0,0,0-0.1,0s0.1,0,0.1,0s0-0.1,0-0.1c0.1,0,0.2,0,0.2,0l0,0C9,8.8,9,8.7,9.1,8.7s0,0,0,0
	s0.1,0,0.1,0v0.1c0,0,0.1-0.1,0.1,0s0.2-0.1,0.3-0.2l0,0c0-0.1,0.2-0.1,0.2-0.1l0,0l0.1-0.1c0.1,0,0.2-0.1,0.3-0.1
	c0-0.1,0.1-0.1,0.2-0.2c0.4-0.2,0.9-0.4,1.2-0.6c0.1,0,0.1-0.1,0.2-0.2c-0.1,0-0.1,0.1-0.2,0.1s-0.1,0-0.2,0l0,0
	c-0.1,0.1-0.1,0-0.1,0.1V7.4c0,0-0.1,0-0.1,0v0.1c-0.1,0-0.1,0-0.1,0l0,0c0,0-0.2,0.1-0.2,0s0,0-0.1,0.1l0,0c0,0-0.1,0.1-0.1,0.1
	c0,0,0,0,0-0.1c-0.2,0.1,0,0.1-0.2,0.2l0,0l0,0h0c0,0.1-0.3,0.1-0.4,0.2C10,8,10,8,9.9,8l0,0C9.8,8,9.5,8.1,9.4,8c-0.1-0.1,0,0,0,0
	S9.3,8,9.2,8.1s0.1,0,0,0S9.1,8.1,9,8.2s0,0,0-0.1C8.8,8.2,8.7,8.3,8.5,8.4C8.3,8.4,8,8.6,7.8,8.6l0,0c-0.1,0-0.2,0.1-0.3,0.1
	L7.7,8.9z"/>
<path class="st1" d="M6.6,9.8L6.6,9.8L6.6,9.8C6.7,9.7,6.7,9.8,6.6,9.8z"/>
<polygon class="st1" points="6.6,9.7 6.5,9.7 6.6,9.7 "/>
<polygon class="st1" points="7.8,9.2 7.8,9.2 7.6,9.3 "/>
<path class="st1" d="M9.1,8.7C9.1,8.7,9.1,8.7,9.1,8.7L9.1,8.7L9.1,8.7z"/>
<path class="st1" d="M10,8.5C10,8.4,10.1,8.5,10,8.5C9.9,8.4,10,8.5,10,8.5z"/>
<path class="st1" d="M10.2,8.3C10.2,8.3,10.1,8.3,10.2,8.3C10.2,8.4,10.2,8.3,10.2,8.3z"/>
</svg>
