<?xml version="1.0" encoding="utf-8"?>
<!-- Generator: Adobe Illustrator 21.0.0, SVG Export Plug-In . SVG Version: 6.00 Build 0)  -->
<svg version="1.1" id="katman_1" xmlns="http://www.w3.org/2000/svg" xmlns:xlink="http://www.w3.org/1999/xlink" x="0px" y="0px"
	 viewBox="0 0 48 48" style="enable-background:new 0 0 48 48;" xml:space="preserve">
<style type="text/css">
	.st0{opacity:0.3;enable-background:new    ;}
	.st1{fill:url(#SVGID_1_);}
	.st2{fill:url(#SVGID_2_);}
	.st3{opacity:0.2;}
	.st4{opacity:0.1;enable-background:new    ;}
	.st5{opacity:0.1;fill:#FFFFFF;enable-background:new    ;}
	.st6{fill:#F2F2F2;}
	.st7{fill:url(#SVGID_3_);}
	.st8{fill:url(#SVGID_4_);}
	.st9{fill:url(#SVGID_5_);}
	.st10{fill:url(#SVGID_6_);}
	.st11{opacity:0.7;enable-background:new    ;}
	.st12{opacity:0.7;fill:#333333;enable-background:new    ;}
	.st13{opacity:0.7;fill:#42210B;enable-background:new    ;}
	.st14{fill:#FFC807;}
	.st15{fill:url(#SVGID_7_);}
	.st16{fill:url(#SVGID_8_);}
	.st17{fill:url(#SVGID_9_);}
	.st18{fill:url(#SVGID_10_);}
	.st19{fill:url(#SVGID_11_);}
	.st20{fill:url(#SVGID_12_);}
	.st21{fill:url(#SVGID_13_);}
	.st22{fill:url(#SVGID_14_);}
</style>
<title>wmtweaks_1</title>
<path class="st0" d="M34.3,4.4c0-0.5-0.4-0.8-0.8-0.8l0,0H0.8C0.4,3.6,0,3.9,0,4.4v24h34.1V7.2h0.2L34.3,4.4z"/>
<linearGradient id="SVGID_1_" gradientUnits="userSpaceOnUse" x1="17.045" y1="21.44" x2="17.045" y2="43.29" gradientTransform="matrix(1 0 0 -1 0 49.2)">
	<stop  offset="0" style="stop-color:#A3A4A4"/>
	<stop  offset="3.000000e-02" style="stop-color:#A5A6A6"/>
	<stop  offset="0.44" style="stop-color:#C9C9C9"/>
	<stop  offset="0.78" style="stop-color:#DFDEDE"/>
	<stop  offset="1" style="stop-color:#E7E6E6"/>
</linearGradient>
<rect x="0.3" y="5.9" class="st1" width="33.6" height="22.2"/>
<linearGradient id="SVGID_2_" gradientUnits="userSpaceOnUse" x1="17.135" y1="10.75" x2="17.135" y2="45.11" gradientTransform="matrix(1 0 0 -1 0 49.2)">
	<stop  offset="5.000000e-02" style="stop-color:#1A1A1A"/>
	<stop  offset="0.39" style="stop-color:#1D1D1D"/>
	<stop  offset="0.66" style="stop-color:#272727"/>
	<stop  offset="0.91" style="stop-color:#383838"/>
	<stop  offset="1" style="stop-color:#404040"/>
</linearGradient>
<path class="st2" d="M34,6.9V4.4c0-0.3-0.3-0.6-0.6-0.6l0,0H0.8c-0.3,0-0.6,0.3-0.6,0.6v2.6H34z"/>
<g class="st3">
	<path d="M30.7,6.3l0.6-0.8l-0.6-0.8h0.5l0.3,0.4l0.3-0.4h0.5l-0.6,0.7l0.6,0.8h-0.5l-0.3-0.4l-0.3,0.4H30.7z"/>
</g>
<g class="st3">
	<path d="M28.8,6.3V5.8h-0.6V5.4h0.6V4.8h0.4v0.6h0.6v0.4h-0.6v0.6L28.8,6.3z"/>
</g>
<rect x="0.3" y="28.2" class="st4" width="33.6" height="1"/>
<path class="st5" d="M33.5,3.8H0.8c-0.3,0-0.6,0.3-0.6,0.6v1.1c0-0.3,0.3-0.6,0.6-0.6h32.6c0.3,0,0.6,0.3,0.6,0.6c0,0,0,0,0,0V4.4
	C34,4.1,33.8,3.8,33.5,3.8L33.5,3.8z"/>
<rect x="0.3" y="6.9" class="st4" width="33.8" height="1.1"/>
<path class="st6" d="M30.7,6.2l0.6-0.8l-0.6-0.8h0.5l0.3,0.4l0.3-0.4h0.5l-0.6,0.7l0.6,0.8h-0.5l-0.3-0.4l-0.3,0.4L30.7,6.2z"/>
<path class="st6" d="M28.8,6.2V5.6h-0.6V5.2h0.6V4.7h0.4v0.6h0.6v0.4h-0.6v0.6L28.8,6.2z"/>
<path class="st0" d="M41.1,11.2c0-0.5-0.4-0.8-0.8-0.8l0,0H7.7c-0.5,0-0.8,0.4-0.8,0.8v24H41V14.1h0.2V11.2z"/>
<linearGradient id="SVGID_3_" gradientUnits="userSpaceOnUse" x1="23.905" y1="14.58" x2="23.905" y2="36.43" gradientTransform="matrix(1 0 0 -1 0 49.2)">
	<stop  offset="0" style="stop-color:#A3A4A4"/>
	<stop  offset="3.000000e-02" style="stop-color:#A5A6A6"/>
	<stop  offset="0.44" style="stop-color:#C9C9C9"/>
	<stop  offset="0.78" style="stop-color:#DFDEDE"/>
	<stop  offset="1" style="stop-color:#E7E6E6"/>
</linearGradient>
<rect x="7.1" y="12.8" class="st7" width="33.6" height="22.2"/>
<linearGradient id="SVGID_4_" gradientUnits="userSpaceOnUse" x1="24" y1="3.89" x2="24" y2="38.25" gradientTransform="matrix(1 0 0 -1 0 49.2)">
	<stop  offset="5.000000e-02" style="stop-color:#1A1A1A"/>
	<stop  offset="0.39" style="stop-color:#1D1D1D"/>
	<stop  offset="0.66" style="stop-color:#272727"/>
	<stop  offset="0.91" style="stop-color:#383838"/>
	<stop  offset="1" style="stop-color:#404040"/>
</linearGradient>
<path class="st8" d="M40.9,13.8v-2.6c0-0.3-0.3-0.6-0.6-0.6l0,0H7.7c-0.3,0-0.6,0.3-0.6,0.6l0,0v2.6L40.9,13.8z"/>
<g class="st3">
	<path d="M37.5,13.2l0.6-0.8l-0.6-0.8h0.5l0.3,0.4l0.3-0.4h0.5l-0.6,0.7l0.6,0.8h-0.5l-0.3-0.4L38,13.2H37.5z"/>
</g>
<g class="st3">
	<path d="M35.7,13.2v-0.6h-0.6v-0.4h0.6v-0.6h0.4v0.6h0.6v0.4h-0.6v0.6H35.7z"/>
</g>
<rect x="7.1" y="35" class="st4" width="33.6" height="1"/>
<path class="st5" d="M40.3,10.7H7.7c-0.3,0-0.6,0.3-0.6,0.6l0,0v1.1c0-0.3,0.3-0.6,0.6-0.6c0,0,0,0,0,0h32.6c0.3,0,0.6,0.3,0.6,0.6
	c0,0,0,0,0,0v-1.1C40.9,10.9,40.6,10.7,40.3,10.7L40.3,10.7z"/>
<rect x="7.1" y="13.8" class="st4" width="33.8" height="1.1"/>
<path class="st6" d="M37.5,13l0.6-0.8l-0.6-0.8h0.5l0.3,0.4l0.3-0.4h0.5l-0.6,0.7l0.6,0.8h-0.5l-0.3-0.4L38,13H37.5z"/>
<path class="st6" d="M35.7,13v-0.6h-0.6v-0.3h0.6v-0.6h0.4v0.6h0.6v0.4h-0.6V13H35.7z"/>
<path class="st0" d="M48,18.1c0-0.5-0.4-0.8-0.8-0.8l0,0H14.5c-0.5,0-0.8,0.4-0.8,0.8v24h34.1V20.9H48V18.1z"/>
<linearGradient id="SVGID_5_" gradientUnits="userSpaceOnUse" x1="30.755" y1="7.73" x2="30.755" y2="29.58" gradientTransform="matrix(1 0 0 -1 0 49.2)">
	<stop  offset="0" style="stop-color:#A3A4A4"/>
	<stop  offset="3.000000e-02" style="stop-color:#A5A6A6"/>
	<stop  offset="0.44" style="stop-color:#C9C9C9"/>
	<stop  offset="0.78" style="stop-color:#DFDEDE"/>
	<stop  offset="1" style="stop-color:#E7E6E6"/>
</linearGradient>
<rect x="14" y="19.6" class="st9" width="33.6" height="22.2"/>
<linearGradient id="SVGID_6_" gradientUnits="userSpaceOnUse" x1="30.86" y1="-2.97" x2="30.86" y2="31.39" gradientTransform="matrix(1 0 0 -1 0 49.2)">
	<stop  offset="5.000000e-02" style="stop-color:#1A1A1A"/>
	<stop  offset="0.39" style="stop-color:#1D1D1D"/>
	<stop  offset="0.66" style="stop-color:#272727"/>
	<stop  offset="0.91" style="stop-color:#383838"/>
	<stop  offset="1" style="stop-color:#404040"/>
</linearGradient>
<path class="st10" d="M47.7,20.7v-2.5c0-0.3-0.3-0.6-0.6-0.6l0,0H14.5c-0.3,0-0.6,0.3-0.6,0.6v2.6L47.7,20.7z"/>
<g class="st3">
	<path d="M44.4,20.1l0.6-0.8l-0.6-0.8H45l0.3,0.4l0.3-0.4h0.5l-0.6,0.7l0.6,0.8h-0.5l-0.3-0.4L45,20.1L44.4,20.1z"/>
</g>
<g class="st3">
	<path d="M42.5,20v-0.5h-0.6v-0.4h0.6v-0.5H43v0.5h0.6v0.4H43V20H42.5z"/>
</g>
<rect x="14" y="41.9" class="st4" width="33.6" height="1"/>
<path class="st5" d="M47.2,17.5H14.5c-0.3,0-0.6,0.3-0.6,0.6v1c0-0.3,0.3-0.6,0.6-0.6h32.6c0.3,0,0.6,0.3,0.6,0.6l0,0v-1
	C47.7,17.8,47.5,17.5,47.2,17.5C47.2,17.5,47.2,17.5,47.2,17.5z"/>
<rect x="14" y="20.7" class="st4" width="33.8" height="1"/>
<path class="st6" d="M44.4,19.9l0.6-0.8l-0.6-0.8H45l0.3,0.4l0.3-0.4h0.5l-0.6,0.7l0.6,0.8h-0.5l-0.3-0.4L45,19.9L44.4,19.9z"/>
<path class="st6" d="M42.5,19.9v-0.5h-0.6V19h0.6v-0.5H43V19h0.6v0.4H43v0.5L42.5,19.9z"/>
<polygon class="st11" points="39.3,46.9 27.7,34.4 34,28.6 47.2,42.9 47.2,46.9 "/>
<polygon class="st12" points="18.6,23.6 23.9,18.7 34.3,29.3 28.4,34.8 "/>
<path class="st13" d="M35.7,14.6c-0.2,0-0.5-0.1-0.7-0.2L32.2,13c-0.2-0.1-0.5-0.1-0.7,0l-2.7,1.4c-0.2,0.1-0.5,0.2-0.7,0.2
	c-0.5,0-0.9-0.2-1.1-0.6c-0.3-0.3-0.4-0.8-0.3-1.2l0.5-3c0-0.2,0-0.5-0.2-0.7L24.8,7c-0.6-0.6-0.6-1.5,0-2.1
	c0.2-0.2,0.5-0.4,0.9-0.4l3-0.4c0.2,0,0.5-0.2,0.6-0.4l1.4-2.7c0.4-0.7,1.3-1.1,2-0.7c0.3,0.1,0.5,0.4,0.7,0.7l1.3,2.7
	c0.1,0.2,0.3,0.4,0.6,0.4l3,0.4c0.8,0.1,1.4,0.9,1.3,1.7c0,0.3-0.2,0.6-0.4,0.9l-2.2,2.1c-0.2,0.2-0.3,0.4-0.2,0.7l0.5,3
	c0.1,0.4,0,0.9-0.3,1.2C36.5,14.3,36.1,14.5,35.7,14.6L35.7,14.6z"/>
<path class="st14" d="M30.9,1l-1.3,2.7c-0.2,0.3-0.5,0.6-0.9,0.6l-3,0.4c-0.6,0.1-1.1,0.6-1,1.2c0,0.3,0.1,0.5,0.3,0.7l2.2,2.1
	c0.3,0.3,0.4,0.6,0.3,1l-0.5,3c-0.1,0.6,0.3,1.2,0.9,1.3c0.2,0,0.5,0,0.7-0.1l2.7-1.4c0.3-0.2,0.7-0.2,1.1,0l2.7,1.4
	c0.6,0.3,1.2,0.1,1.5-0.5c0.1-0.2,0.2-0.5,0.1-0.7l-0.5-3c-0.1-0.4,0.1-0.7,0.3-1l2.2-2.1c0.4-0.4,0.5-1.2,0-1.6
	c-0.2-0.2-0.4-0.3-0.7-0.3l-3-0.4c-0.4-0.1-0.7-0.3-0.8-0.6L32.9,1c-0.3-0.6-1-0.8-1.5-0.5C31.2,0.6,31,0.8,30.9,1z"/>
<path class="st13" d="M19.1,11.1c-0.2,0-0.4,0-0.6-0.1l-2-1.1c-0.1-0.1-0.3-0.1-0.4,0l-2,1.1c-0.2,0.1-0.4,0.1-0.6,0.1
	c-0.7,0-1.2-0.5-1.2-1.2c0-0.1,0-0.1,0-0.2l0.4-2.2c0-0.2,0-0.3-0.2-0.4l-1.6-1.6c-0.5-0.5-0.5-1.2,0-1.7c0.2-0.2,0.4-0.3,0.7-0.4
	L13.8,3c0.2,0,0.3-0.1,0.4-0.3l1-2c0.3-0.6,1-0.9,1.6-0.6c0.3,0.1,0.5,0.3,0.6,0.6l1,2C18.4,2.9,18.6,3,18.7,3L21,3.3
	c0.7,0.1,1.1,0.7,1,1.4c0,0.3-0.2,0.5-0.4,0.7L20,7c-0.1,0.1-0.2,0.3-0.1,0.4l0.4,2.2c0.1,0.7-0.3,1.3-1,1.4
	C19.2,11.1,19.1,11.1,19.1,11.1L19.1,11.1z"/>
<path class="st14" d="M15.5,0.8l-1,2c-0.1,0.2-0.4,0.4-0.6,0.5l-2.3,0.3c-0.5,0.1-0.8,0.5-0.7,1c0,0.2,0.1,0.3,0.2,0.5l1.6,1.6
	C13,6.9,13.1,7.1,13,7.4l-0.4,2.2c-0.1,0.5,0.2,0.9,0.7,1c0.2,0,0.4,0,0.5-0.1l2-1.1c0.2-0.1,0.5-0.1,0.8,0l2,1.1
	c0.4,0.2,0.9,0.1,1.1-0.4c0.1-0.2,0.1-0.3,0.1-0.5l-0.4-2.2c0-0.3,0-0.6,0.2-0.8l1.7-1.5c0.3-0.3,0.3-0.9,0-1.2
	c-0.1-0.1-0.3-0.2-0.5-0.2l-2.3-0.3c-0.3,0-0.5-0.2-0.7-0.5l-1-2c-0.2-0.4-0.7-0.6-1.1-0.4C15.7,0.6,15.6,0.7,15.5,0.8z"/>
<linearGradient id="SVGID_7_" gradientUnits="userSpaceOnUse" x1="31.8581" y1="33.62" x2="31.8581" y2="49.8" gradientTransform="matrix(1 0 0 -1 0 49.2)">
	<stop  offset="0" style="stop-color:#000000;stop-opacity:0.39"/>
	<stop  offset="1" style="stop-color:#000000;stop-opacity:0"/>
</linearGradient>
<path class="st15" d="M30.9,1l-1.3,2.7c-0.2,0.3-0.5,0.6-0.9,0.6l-3,0.4c-0.6,0.1-1.1,0.6-1,1.2c0,0.3,0.1,0.5,0.3,0.7l2.2,2.1
	c0.3,0.3,0.4,0.6,0.3,1l-0.5,3c-0.1,0.6,0.3,1.2,0.9,1.3c0.2,0,0.5,0,0.7-0.1l2.7-1.4c0.3-0.2,0.7-0.2,1.1,0l2.7,1.4
	c0.6,0.3,1.2,0.1,1.5-0.5c0.1-0.2,0.2-0.5,0.1-0.7l-0.5-3c-0.1-0.4,0.1-0.7,0.3-1l2.2-2.1c0.4-0.4,0.5-1.2,0-1.6
	c-0.2-0.2-0.4-0.3-0.7-0.3l-3-0.4c-0.4-0.1-0.7-0.3-0.8-0.6L32.9,1c-0.3-0.6-1-0.8-1.5-0.5C31.2,0.6,31,0.8,30.9,1z"/>
<linearGradient id="SVGID_8_" gradientUnits="userSpaceOnUse" x1="16.2699" y1="37.39" x2="16.2699" y2="48.79" gradientTransform="matrix(1 0 0 -1 0 49.2)">
	<stop  offset="0" style="stop-color:#000000;stop-opacity:0.39"/>
	<stop  offset="1" style="stop-color:#000000;stop-opacity:0"/>
</linearGradient>
<path class="st16" d="M15.5,0.8l-1,2c-0.1,0.2-0.4,0.4-0.6,0.5l-2.3,0.3c-0.5,0.1-0.8,0.5-0.7,1c0,0.2,0.1,0.3,0.2,0.5l1.6,1.6
	C13,6.9,13.1,7.1,13,7.4l-0.4,2.2c-0.1,0.5,0.2,0.9,0.7,1c0.2,0,0.4,0,0.5-0.1l2-1.1c0.2-0.1,0.5-0.1,0.8,0l2,1.1
	c0.4,0.2,0.9,0.1,1.1-0.4c0.1-0.2,0.1-0.3,0.1-0.5l-0.4-2.2c0-0.3,0-0.6,0.2-0.8l1.7-1.5c0.3-0.3,0.3-0.9,0-1.2
	c-0.1-0.1-0.3-0.2-0.5-0.2l-2.3-0.3c-0.3,0-0.5-0.2-0.7-0.5l-1-2c-0.2-0.4-0.7-0.6-1.1-0.4C15.7,0.6,15.6,0.7,15.5,0.8z"/>
<path class="st13" d="M8.6,18.9c-0.2,0-0.4,0-0.5-0.1l-1.8-0.9c-0.1-0.1-0.2-0.1-0.3,0l-1.8,0.9c-0.2,0.1-0.3,0.1-0.5,0.1
	c-0.6,0-1.1-0.5-1.1-1.1c0-0.1,0-0.1,0-0.2l0.3-2c0-0.1,0-0.2-0.1-0.3l-1.5-1.4c-0.4-0.4-0.4-1.2,0-1.6c0.2-0.2,0.4-0.3,0.6-0.3
	l2-0.3c0.1,0,0.2-0.1,0.3-0.2l0.9-1.8c0.3-0.6,1-0.8,1.5-0.5C6.8,9.2,7,9.4,7.1,9.6L8,11.4c0.1,0.1,0.2,0.2,0.3,0.2l2,0.3
	c0.6,0.1,1,0.7,1,1.3c0,0.2-0.1,0.5-0.3,0.6l-1.4,1.4c-0.1,0.1-0.1,0.2-0.1,0.3l0.3,2c0.1,0.6-0.3,1.2-0.9,1.3
	C8.7,18.9,8.7,18.9,8.6,18.9z"/>
<path class="st14" d="M5.4,9.7l-0.9,1.8C4.4,11.8,4.2,11.9,4,12l-2,0.3c-0.4,0.1-0.7,0.4-0.6,0.8c0,0.2,0.1,0.3,0.2,0.4L3,14.9
	c0.2,0.2,0.3,0.4,0.2,0.7l-0.3,2c-0.1,0.4,0.2,0.8,0.6,0.9c0.2,0,0.4,0,0.5-0.1l1.8-0.9c0.2-0.1,0.5-0.1,0.7,0l1.8,0.9
	c0.4,0.2,0.8,0.1,1-0.3c0.1-0.1,0.1-0.3,0.1-0.5l-0.3-2c0-0.2,0-0.5,0.2-0.7l1.4-1.4c0.3-0.3,0.3-0.8,0-1.1
	c-0.1-0.1-0.3-0.2-0.4-0.2l-2-0.3c-0.2,0-0.5-0.2-0.6-0.4L6.8,9.7c-0.2-0.4-0.6-0.5-1-0.3C5.6,9.5,5.5,9.6,5.4,9.7z"/>
<linearGradient id="SVGID_9_" gradientUnits="userSpaceOnUse" x1="6.14" y1="29.72" x2="6.14" y2="40.98" gradientTransform="matrix(1 0 0 -1 0 49.2)">
	<stop  offset="0" style="stop-color:#000000;stop-opacity:0.39"/>
	<stop  offset="1" style="stop-color:#000000;stop-opacity:0"/>
</linearGradient>
<path class="st17" d="M5.4,9.7l-0.9,1.8C4.4,11.8,4.2,11.9,4,12l-2,0.3c-0.4,0.1-0.7,0.4-0.6,0.8c0,0.2,0.1,0.3,0.2,0.4L3,14.9
	c0.2,0.2,0.3,0.4,0.2,0.7l-0.3,2c-0.1,0.4,0.2,0.8,0.6,0.9c0.2,0,0.4,0,0.5-0.1l1.8-0.9c0.2-0.1,0.5-0.1,0.7,0l1.8,0.9
	c0.4,0.2,0.8,0.1,1-0.3c0.1-0.1,0.1-0.3,0.1-0.5l-0.3-2c0-0.2,0-0.5,0.2-0.7l1.4-1.4c0.3-0.3,0.3-0.8,0-1.1
	c-0.1-0.1-0.3-0.2-0.4-0.2l-2-0.3c-0.2,0-0.5-0.2-0.6-0.4L6.8,9.7c-0.2-0.4-0.6-0.5-1-0.3C5.6,9.5,5.5,9.6,5.4,9.7z"/>
<path class="st13" d="M6.9,31.1c-0.2,0-0.3,0-0.4-0.1L5,30.2H4.9H4.8L3.4,31c-0.1,0.1-0.3,0.1-0.5,0.1c-0.6,0-1-0.5-1-1
	c0,0,0-0.1,0-0.1l0.3-1.6c0-0.1,0-0.1-0.1-0.2l-1.1-1.1c-0.4-0.4-0.3-1,0.1-1.4c0.1-0.1,0.3-0.2,0.4-0.2l1.6-0.2
	c0.1,0,0.1,0,0.2-0.1l0.7-1.4c0.3-0.5,0.9-0.6,1.4-0.4c0.2,0.1,0.3,0.2,0.4,0.4l0.7,1.4c0,0.1,0.1,0.1,0.2,0.1l1.6,0.2
	c0.5,0.1,0.9,0.7,0.8,1.2c0,0.2-0.1,0.3-0.2,0.4l-1.1,1.1c0,0-0.1,0.1-0.1,0.2L7.8,30C7.9,30.5,7.5,31,6.9,31.1
	C6.9,31.1,6.9,31.1,6.9,31.1L6.9,31.1z"/>
<path class="st14" d="M4.4,23.9l-0.7,1.4c-0.1,0.2-0.2,0.3-0.4,0.3l-1.6,0.2c-0.3,0.1-0.5,0.4-0.5,0.7c0,0.1,0.1,0.2,0.2,0.3
	l1.1,1.1c0.1,0.1,0.2,0.3,0.2,0.5L2.4,30c-0.1,0.3,0.2,0.6,0.5,0.7c0.1,0,0.3,0,0.4-0.1l1.4-0.7c0.2-0.1,0.4-0.1,0.6,0l1.4,0.7
	c0.3,0.1,0.6,0,0.8-0.3c0.1-0.1,0.1-0.2,0.1-0.3l-0.3-1.6c0-0.2,0-0.4,0.2-0.5l1.1-1.1c0.2-0.2,0.2-0.6,0-0.8
	c-0.1-0.1-0.2-0.1-0.3-0.2l-1.6-0.2c-0.2,0-0.4-0.1-0.4-0.3l-0.7-1.4c-0.1-0.3-0.5-0.4-0.8-0.3C4.6,23.7,4.5,23.8,4.4,23.9z"/>
<linearGradient id="SVGID_10_" gradientUnits="userSpaceOnUse" x1="4.93" y1="17.94" x2="4.93" y2="26.32" gradientTransform="matrix(1 0 0 -1 0 49.2)">
	<stop  offset="0" style="stop-color:#000000;stop-opacity:0.39"/>
	<stop  offset="1" style="stop-color:#000000;stop-opacity:0"/>
</linearGradient>
<path class="st18" d="M4.4,23.9l-0.7,1.4c-0.1,0.2-0.2,0.3-0.4,0.3l-1.6,0.2c-0.3,0.1-0.5,0.4-0.5,0.7c0,0.1,0.1,0.2,0.2,0.3
	l1.1,1.1c0.1,0.1,0.2,0.3,0.2,0.5L2.4,30c-0.1,0.3,0.2,0.6,0.5,0.7c0.1,0,0.3,0,0.4-0.1l1.4-0.7c0.2-0.1,0.4-0.1,0.6,0l1.4,0.7
	c0.3,0.1,0.6,0,0.8-0.3c0.1-0.1,0.1-0.2,0.1-0.3l-0.3-1.6c0-0.2,0-0.4,0.2-0.5l1.1-1.1c0.2-0.2,0.2-0.6,0-0.8
	c-0.1-0.1-0.2-0.1-0.3-0.2l-1.6-0.2c-0.2,0-0.4-0.1-0.4-0.3l-0.7-1.4c-0.1-0.3-0.5-0.4-0.8-0.3C4.6,23.7,4.5,23.8,4.4,23.9z"/>
<path class="st13" d="M8.5,40.4c-0.1,0-0.2,0-0.4-0.1l-1-0.5l-1,0.5c-0.1,0.1-0.2,0.1-0.4,0.1c-0.4,0-0.8-0.4-0.8-0.8
	c0,0,0-0.1,0-0.1l0.2-1.1l-0.8-0.8c-0.3-0.3-0.3-0.8,0-1.1c0.1-0.1,0.3-0.2,0.4-0.2l1.1-0.2l0.5-1c0.2-0.4,0.7-0.5,1-0.4
	c0.2,0.1,0.3,0.2,0.4,0.4l0.5,1l1.1,0.2c0.4,0.1,0.7,0.5,0.7,0.9c0,0.2-0.1,0.3-0.2,0.4L9,38.4l0.2,1.1C9.3,39.9,9,40.3,8.5,40.4
	C8.5,40.4,8.5,40.4,8.5,40.4L8.5,40.4z"/>
<path class="st14" d="M6.8,35.3l-0.5,1c-0.1,0.1-0.2,0.2-0.3,0.2l-1.1,0.2c-0.2,0-0.4,0.2-0.3,0.4c0,0.1,0.1,0.2,0.1,0.2l0.8,0.8
	c0.1,0.1,0.1,0.2,0.1,0.4l-0.2,1.1c0,0.2,0.2,0.4,0.4,0.4c0.1,0,0.1,0,0.2,0l1-0.5c0.1-0.1,0.3-0.1,0.4,0l1,0.5
	c0.2,0.1,0.4,0,0.5-0.2c0-0.1,0.1-0.2,0-0.3l-0.3-1.1c0-0.1,0-0.3,0.1-0.4l0.8-0.8c0.2-0.2,0.2-0.4,0-0.6c-0.1-0.1-0.1-0.1-0.2-0.1
	l-1.1-0.2c-0.1,0-0.2-0.1-0.3-0.2l-0.5-1C7.4,35.1,7.2,35,7,35.1C6.9,35.2,6.8,35.3,6.8,35.3z"/>
<linearGradient id="SVGID_11_" gradientUnits="userSpaceOnUse" x1="7.155" y1="8.69" x2="7.155" y2="14.48" gradientTransform="matrix(1 0 0 -1 0 49.2)">
	<stop  offset="0" style="stop-color:#000000;stop-opacity:0.39"/>
	<stop  offset="1" style="stop-color:#000000;stop-opacity:0"/>
</linearGradient>
<path class="st19" d="M6.8,35.3l-0.5,1c-0.1,0.1-0.2,0.2-0.3,0.2l-1.1,0.2c-0.2,0-0.4,0.2-0.3,0.4c0,0.1,0.1,0.2,0.1,0.2l0.8,0.8
	c0.1,0.1,0.1,0.2,0.1,0.4l-0.2,1.1c0,0.2,0.2,0.4,0.4,0.4c0.1,0,0.1,0,0.2,0l1-0.5c0.1-0.1,0.3-0.1,0.4,0l1,0.5
	c0.2,0.1,0.4,0,0.5-0.2c0-0.1,0.1-0.2,0-0.3l-0.3-1.1c0-0.1,0-0.3,0.1-0.4l0.8-0.8c0.2-0.2,0.2-0.4,0-0.6c-0.1-0.1-0.1-0.1-0.2-0.1
	l-1.1-0.2c-0.1,0-0.2-0.1-0.3-0.2l-0.5-1C7.4,35.1,7.2,35,7,35.1C6.9,35.2,6.8,35.3,6.8,35.3z"/>
<path class="st13" d="M13.3,45.3c-0.1,0-0.2,0-0.3-0.1l-0.8-0.4l-0.8,0.4c-0.1,0.1-0.2,0.1-0.3,0.1c-0.4,0-0.7-0.3-0.7-0.7
	c0,0,0-0.1,0-0.1l0.2-0.9l-0.7-0.6c-0.3-0.3-0.3-0.7,0-1c0.1-0.1,0.3-0.2,0.4-0.2l0.9-0.1l0.4-0.8c0.2-0.4,0.6-0.5,1-0.3
	c0.1,0.1,0.3,0.2,0.3,0.3l0.4,0.8l0.9,0.1c0.4,0.1,0.7,0.4,0.6,0.8c0,0.2-0.1,0.3-0.2,0.4l-0.7,0.7l0.2,0.9c0.1,0.4-0.2,0.8-0.6,0.8
	C13.4,45.3,13.4,45.3,13.3,45.3L13.3,45.3z"/>
<path class="st14" d="M11.9,40.9l-0.4,0.8c-0.1,0.1-0.1,0.2-0.3,0.2l-0.9,0.1c-0.2,0-0.3,0.2-0.3,0.4c0,0.1,0,0.1,0.1,0.2l0.7,0.7
	c0.1,0.1,0.1,0.2,0.1,0.3l-0.2,0.9c0,0.2,0.1,0.4,0.3,0.4c0.1,0,0.1,0,0.2,0l0.8-0.4c0.1-0.1,0.2-0.1,0.3,0l0.8,0.4
	c0.2,0.1,0.4,0,0.5-0.2c0-0.1,0-0.1,0-0.2l-0.2-0.9c0-0.1,0-0.2,0.1-0.3l0.7-0.7c0.1-0.1,0.1-0.4,0-0.5c-0.1,0-0.1-0.1-0.2-0.1
	L13.1,42c-0.1,0-0.2-0.1-0.3-0.2L12.5,41c-0.1-0.2-0.3-0.3-0.5-0.2C12,40.8,11.9,40.9,11.9,40.9z"/>
<linearGradient id="SVGID_12_" gradientUnits="userSpaceOnUse" x1="12.17" y1="3.97" x2="12.17" y2="8.72" gradientTransform="matrix(1 0 0 -1 0 49.2)">
	<stop  offset="0" style="stop-color:#000000;stop-opacity:0.39"/>
	<stop  offset="1" style="stop-color:#000000;stop-opacity:0"/>
</linearGradient>
<path class="st20" d="M11.9,40.9l-0.4,0.8c-0.1,0.1-0.1,0.2-0.3,0.2l-0.9,0.1c-0.2,0-0.3,0.2-0.3,0.4c0,0.1,0,0.1,0.1,0.2l0.7,0.7
	c0.1,0.1,0.1,0.2,0.1,0.3l-0.2,0.9c0,0.2,0.1,0.4,0.3,0.4c0.1,0,0.1,0,0.2,0l0.8-0.4c0.1-0.1,0.2-0.1,0.3,0l0.8,0.4
	c0.2,0.1,0.4,0,0.5-0.2c0-0.1,0-0.1,0-0.2l-0.2-0.9c0-0.1,0-0.2,0.1-0.3l0.7-0.7c0.1-0.1,0.1-0.4,0-0.5c-0.1,0-0.1-0.1-0.2-0.1
	L13.1,42c-0.1,0-0.2-0.1-0.3-0.2L12.5,41c-0.1-0.2-0.3-0.3-0.5-0.2C12,40.8,11.9,40.9,11.9,40.9z"/>
<linearGradient id="SVGID_13_" gradientUnits="userSpaceOnUse" x1="-1068.0802" y1="6.5798" x2="-1075.0103" y2="12.8298" gradientTransform="matrix(-1 0 0 -1 -1033 49.2)">
	<stop  offset="0" style="stop-color:#363838"/>
	<stop  offset="2.000000e-02" style="stop-color:#2E3030"/>
	<stop  offset="8.000000e-02" style="stop-color:#1A1B1B"/>
	<stop  offset="0.14" style="stop-color:#0B0C0C"/>
	<stop  offset="0.22" style="stop-color:#030303"/>
	<stop  offset="0.34" style="stop-color:#000000"/>
	<stop  offset="0.74" style="stop-color:#242525"/>
	<stop  offset="1" style="stop-color:#363838"/>
</linearGradient>
<polygon class="st21" points="28.2,34.4 39.4,46.6 46.8,46.6 46.8,43 34,29.1 "/>
<linearGradient id="SVGID_14_" gradientUnits="userSpaceOnUse" x1="-765.1072" y1="542.1144" x2="-765.1072" y2="549.3344" gradientTransform="matrix(-0.68 -0.73 0.73 -0.68 -892.026 -161.104)">
	<stop  offset="0" style="stop-color:#F3F1F0"/>
	<stop  offset="0.51" style="stop-color:#BDBFBF"/>
	<stop  offset="0.52" style="stop-color:#C1C3C2"/>
	<stop  offset="0.62" style="stop-color:#D7D7D7"/>
	<stop  offset="0.72" style="stop-color:#E7E6E5"/>
	<stop  offset="0.84" style="stop-color:#F0EEED"/>
	<stop  offset="1" style="stop-color:#F3F1F0"/>
</linearGradient>
<polygon class="st22" points="19.2,23.7 28.4,34.2 33.7,29.3 23.9,19.3 "/>
<path class="st5" d="M25.8,6.2l3-0.4c0.4-0.1,0.7-0.3,0.9-0.6L31,2.4c0.3-0.6,1-0.8,1.5-0.5c0.2,0.1,0.4,0.3,0.5,0.5l1.3,2.7
	c0.2,0.3,0.5,0.6,0.8,0.6l3,0.4c0.2,0,0.5,0.2,0.6,0.3c0.4-0.5,0.3-1.2-0.2-1.6c-0.1-0.1-0.3-0.2-0.5-0.2l-3-0.4
	c-0.4-0.1-0.7-0.3-0.8-0.6L32.9,1c-0.3-0.6-1-0.8-1.5-0.5C31.2,0.6,31,0.8,30.9,1l-1.4,2.7c-0.2,0.3-0.5,0.6-0.9,0.6l-3,0.4
	c-0.6,0.1-1.1,0.6-1,1.2c0,0.3,0.1,0.5,0.3,0.7C25.2,6.4,25.5,6.3,25.8,6.2z"/>
<path class="st4" d="M27.2,8.8L25,6.7l0,0c-0.3,0.5-0.3,1.1,0.1,1.5l2.2,2.1c0,0,0.1,0.1,0.1,0.1l0.1-0.6
	C27.6,9.5,27.5,9.1,27.2,8.8z"/>
<path class="st4" d="M35.1,14l-2.7-1.4c-0.3-0.2-0.7-0.2-1,0L28.7,14c-0.5,0.3-1.1,0.1-1.4-0.3l-0.1,0.6c-0.1,0.6,0.3,1.2,0.9,1.3
	c0.2,0,0.5,0,0.7-0.1l2.7-1.4c0.3-0.2,0.7-0.2,1.1,0l2.7,1.4c0.6,0.3,1.2,0.1,1.5-0.5c0.1-0.2,0.2-0.5,0.1-0.7l-0.2-0.9
	c-0.2,0.6-0.8,0.9-1.4,0.7C35.2,14.1,35.2,14.1,35.1,14z"/>
<path class="st4" d="M38.9,8.2c0.4-0.4,0.4-1.2,0-1.6c0,0,0,0,0,0c0,0.1-0.1,0.1-0.1,0.2l-2.2,2.1c-0.3,0.3-0.4,0.6-0.3,1l0.2,0.9
	c0.1-0.2,0.2-0.3,0.3-0.5L38.9,8.2z"/>
<path class="st5" d="M14,4.8c0.3,0,0.5-0.2,0.6-0.5l1-2c0.2-0.4,0.7-0.6,1.1-0.4c0.2,0.1,0.3,0.2,0.4,0.4l1,2
	c0.1,0.2,0.4,0.4,0.6,0.5L21,5.1c0.1,0,0.2,0,0.3,0.1l0.1-0.1c0.3-0.3,0.3-0.9,0-1.2c-0.1-0.1-0.3-0.2-0.5-0.2l-2.3-0.3
	c-0.3,0-0.5-0.2-0.6-0.5l-1-2c-0.2-0.4-0.7-0.6-1.1-0.4c-0.2,0.1-0.3,0.2-0.4,0.4l-1,2c-0.1,0.2-0.4,0.4-0.6,0.5l-2.3,0.3
	c-0.5,0.1-0.8,0.5-0.7,1c0,0.2,0.1,0.3,0.2,0.5l0.2,0.2c0.1-0.1,0.3-0.2,0.4-0.2L14,4.8z"/>
<path class="st4" d="M12.8,6.7l-1.5-1.4c-0.4,0.3-0.4,0.8-0.2,1.2c0,0,0.1,0.1,0.1,0.1l1.6,1.6l0,0L13,7.5C13.1,7.2,13,6.9,12.8,6.7
	z"/>
<path class="st4" d="M21.5,6.6c0.3-0.3,0.3-0.9,0-1.2c-0.1-0.1-0.1-0.1-0.2-0.2l-1.5,1.5c-0.2,0.2-0.3,0.5-0.2,0.8l0.2,1
	c0-0.1,0.1-0.2,0.2-0.3L21.5,6.6z"/>
<path class="st4" d="M18.7,10.6l-2-1.1c-0.2-0.1-0.5-0.1-0.8,0l-2,1.1c-0.3,0.2-0.7,0.1-1-0.2l-0.1,0.7c-0.1,0.5,0.3,0.9,0.8,0.9
	c0.2,0,0.3,0,0.5-0.1l2-1c0.2-0.1,0.5-0.1,0.8,0l2,1.1c0.4,0.2,0.9,0,1.1-0.4c0.1-0.2,0.1-0.3,0.1-0.5l-0.2-1
	C19.6,10.6,19.2,10.8,18.7,10.6C18.7,10.6,18.7,10.6,18.7,10.6z"/>
<path class="st5" d="M4.1,13.4c0.2,0,0.4-0.2,0.6-0.4l0.9-1.8c0.2-0.4,0.6-0.5,1-0.3c0.2,0.1,0.3,0.2,0.3,0.3L7.8,13
	c0.1,0.2,0.3,0.4,0.6,0.4l2,0.3h0.1l0.2-0.2c0.3-0.3,0.3-0.8,0-1.1c-0.1-0.1-0.3-0.2-0.4-0.2l-2-0.3c-0.2,0-0.5-0.2-0.6-0.4L6.8,9.7
	c-0.2-0.4-0.6-0.5-1-0.3C5.6,9.5,5.5,9.6,5.4,9.7l-0.9,1.8C4.4,11.8,4.2,11.9,4,12l-2,0.3c-0.4,0.1-0.7,0.4-0.6,0.8
	c0,0.2,0.1,0.3,0.2,0.4l0.3,0.3c0.1,0,0.2-0.1,0.3-0.1L4.1,13.4z"/>
<path class="st4" d="M3,14.9l-1.2-1.1c-0.4,0.2-0.5,0.7-0.3,1c0,0.1,0.1,0.1,0.2,0.2l1.4,1.4l0.1-0.8C3.3,15.4,3.2,15.1,3,14.9z"/>
<path class="st4" d="M8.2,18.4l-1.8-0.9c-0.2-0.1-0.5-0.1-0.7,0L4,18.4c-0.3,0.1-0.6,0.1-0.8-0.1L3,19c-0.1,0.4,0.2,0.8,0.6,0.9
	c0.2,0,0.3,0,0.5-0.1l1.8-0.9c0.2-0.1,0.5-0.1,0.7,0l1.8,0.9c0.4,0.2,0.8,0,1-0.3c0.1-0.1,0.1-0.3,0.1-0.5l-0.2-1
	C9.1,18.4,8.7,18.6,8.2,18.4C8.3,18.4,8.3,18.4,8.2,18.4z"/>
<path class="st4" d="M10.8,15c0.3-0.3,0.3-0.8,0-1.1c-0.1-0.1-0.2-0.2-0.3-0.2l-1.2,1.2C9,15.1,9,15.4,9,15.6l0.2,1
	c0-0.1,0.1-0.2,0.2-0.2L10.8,15z"/>
<path class="st5" d="M3.8,26.7l0.7-1.4C4.7,25,5,24.9,5.3,25.1c0.1,0.1,0.2,0.1,0.3,0.3l0.7,1.4C6.4,26.9,6.5,27,6.7,27l1.3,0.2
	l0.4-0.4c0.2-0.2,0.2-0.6,0-0.8c-0.1-0.1-0.2-0.1-0.3-0.2l-1.6-0.2c-0.2,0-0.4-0.1-0.4-0.3l-0.7-1.4c-0.1-0.3-0.5-0.4-0.8-0.3
	c-0.1,0.1-0.2,0.1-0.3,0.3l-0.7,1.4c-0.1,0.2-0.2,0.3-0.4,0.3l-1.6,0.2c-0.3,0.1-0.5,0.4-0.5,0.7c0,0.1,0.1,0.2,0.2,0.3l0.5,0.4
	l1.5-0.2C3.6,27,3.7,26.9,3.8,26.7z"/>
<path class="st4" d="M2.5,27.9l-0.7-0.7l0,0c-0.3,0.1-0.5,0.4-0.5,0.7c0,0.1,0.1,0.2,0.2,0.3l1,1l0.1-0.8
	C2.7,28.3,2.6,28.1,2.5,27.9z"/>
<path class="st4" d="M6.6,30.6l-1.4-0.7c-0.2-0.1-0.4-0.1-0.6,0l-1.4,0.7c-0.2,0.1-0.4,0.1-0.6,0l-0.2,0.9c-0.1,0.3,0.2,0.6,0.5,0.7
	c0.1,0,0.3,0,0.4-0.1l1.4-0.7c0.2-0.1,0.4-0.1,0.6,0l1.4,0.7c0.3,0.1,0.6,0,0.8-0.3c0.1-0.1,0.1-0.2,0.1-0.4l-0.2-1.1
	C7.2,30.7,6.9,30.8,6.6,30.6z"/>
<path class="st4" d="M8.6,28.3c0.2-0.2,0.2-0.6,0-0.8c-0.1-0.1-0.2-0.1-0.3-0.2H8.1L7.4,28c-0.1,0.1-0.2,0.3-0.2,0.5l0.2,1.1
	c0-0.1,0.1-0.1,0.1-0.1L8.6,28.3z"/>
<path class="st5" d="M6.4,37.8l0.5-1c0.1-0.2,0.3-0.3,0.5-0.2c0.1,0,0.1,0.1,0.2,0.2l0.5,1C8.2,37.9,8.3,38,8.4,38l0.5,0.1l0.7-0.7
	c0.2-0.2,0.2-0.4,0-0.6c-0.1-0.1-0.1-0.1-0.2-0.1l-1.1-0.2c-0.1,0-0.2-0.1-0.3-0.2l-0.5-1C7.4,35.1,7.2,35,7,35.1
	c-0.1,0-0.1,0.1-0.2,0.2l-0.5,1c-0.1,0.1-0.2,0.2-0.3,0.2l-1.1,0.2c-0.2,0-0.4,0.2-0.3,0.4c0,0.1,0.1,0.2,0.1,0.2l0.7,0.7L6.1,38
	C6.3,38,6.4,37.9,6.4,37.8z"/>
<path class="st4" d="M8.7,38.5l0.2,1.1c0,0,0,0.1,0,0.1c0,0,0-0.1,0.1-0.1l0.8-0.8c0.2-0.2,0.2-0.4,0-0.6c-0.1-0.1-0.1-0.1-0.2-0.1
	l-0.6-0.1l-0.1,0.1C8.7,38.2,8.7,38.4,8.7,38.5z"/>
<path class="st4" d="M8.3,40l-1-0.5c-0.1-0.1-0.3-0.1-0.4,0L6,40c-0.1,0-0.2,0-0.3,0l-0.2,1c0,0.2,0.1,0.4,0.3,0.5
	c0.1,0,0.2,0,0.3,0l1-0.5c0.1-0.1,0.3-0.1,0.4,0l1,0.5c0.2,0.1,0.4,0,0.5-0.3c0-0.1,0-0.1,0-0.2l-0.2-1.1c0,0,0-0.1,0-0.1
	C8.7,40,8.5,40.1,8.3,40C8.3,40,8.3,40,8.3,40z"/>
<path class="st4" d="M5.5,38.1L5.5,38.1l-0.5,0c-0.2,0-0.4,0.2-0.3,0.4c0,0.1,0.1,0.2,0.1,0.2l0.6,0.6l0.2-0.9
	C5.6,38.4,5.6,38.2,5.5,38.1z"/>
<path class="st5" d="M11.6,43.2l0.4-0.8c0.1-0.2,0.3-0.2,0.5-0.1c0.1,0,0.1,0.1,0.1,0.1l0.4,0.8c0.1,0.1,0.1,0.2,0.3,0.2h0.3
	c0,0,0-0.1,0.1-0.1l0.7-0.7c0.1-0.1,0.1-0.4,0-0.5c-0.1,0-0.1-0.1-0.2-0.1l-0.9,0c-0.1,0-0.2-0.1-0.3-0.2L12.5,41
	c-0.1-0.2-0.3-0.2-0.5-0.1c-0.1,0-0.1,0.1-0.1,0.1l-0.4,0.8c-0.1,0.1-0.1,0.2-0.3,0.2l-0.9,0.1c-0.2,0-0.3,0.2-0.3,0.4
	c0,0.1,0,0.1,0.1,0.2l0.7,0.7c0,0,0.1,0.1,0.1,0.1l0.5-0.1C11.4,43.4,11.5,43.3,11.6,43.2z"/>
<path class="st4" d="M14.4,44.1c0.1-0.1,0.1-0.4,0-0.5c-0.1,0-0.1-0.1-0.2-0.1l-0.7-0.1c0,0.1,0,0.1,0,0.2l0.2,0.9
	c0,0.2-0.1,0.4-0.3,0.4c-0.1,0-0.1,0-0.2,0l-0.8-0.4c-0.1-0.1-0.2-0.1-0.3,0l-0.8,0.4c-0.1,0-0.2,0-0.2,0c0,0,0,0.1,0,0.1l-0.2,1
	c0,0.2,0.1,0.4,0.3,0.4c0.1,0,0.1,0,0.2,0l0.8-0.4c0.1-0.1,0.2-0.1,0.3,0l0.8,0.4c0.2,0.1,0.4,0,0.5-0.2c0-0.1,0-0.1,0-0.2l-0.2-0.9
	c0-0.1,0-0.2,0.1-0.3L14.4,44.1z"/>
<path class="st4" d="M10.8,43.6c0-0.1,0-0.1,0-0.2l-0.4,0.1c-0.2,0-0.3,0.2-0.3,0.4c0,0.1,0,0.1,0.1,0.2l0.5,0.5c0,0,0,0,0-0.1
	L10.8,43.6z"/>
<polygon class="st5" points="46.8,44.4 46.8,43 34,29.1 28.2,34.4 29,35.3 34.1,30.6 "/>
<polygon class="st4" points="46.8,44.4 46.8,46.6 39.4,46.6 29,35.3 28.3,35.9 39.5,48 46.9,48 46.9,44.5 "/>
<polygon class="st5" points="33,30 33.7,29.3 23.9,19.3 19.2,23.7 19.9,24.5 24,20.7 "/>
<polygon class="st4" points="33,30 28.4,34.2 19.9,24.5 19.3,25.1 28.5,35.7 33.8,30.8 "/>
</svg>
