<?xml version="1.0" encoding="utf-8"?>
<!-- Generator: Adobe Illustrator 21.0.0, SVG Export Plug-In . SVG Version: 6.00 Build 0)  -->
<svg version="1.1" id="katman_1" xmlns="http://www.w3.org/2000/svg" xmlns:xlink="http://www.w3.org/1999/xlink" x="0px" y="0px"
	 viewBox="0 0 24 19.6" style="enable-background:new 0 0 24 19.6;" xml:space="preserve">
<style type="text/css">
	.st0{opacity:0.7;fill:#080828;enable-background:new    ;}
	.st1{fill:url(#SVGID_1_);}
	.st2{fill:url(#SVGID_2_);}
	.st3{fill:url(#SVGID_3_);}
	.st4{fill:url(#SVGID_4_);}
	.st5{fill:url(#SVGID_5_);}
	.st6{fill:url(#SVGID_6_);}
	.st7{opacity:0.1;fill:#FFFFFF;enable-background:new    ;}
	.st8{fill:url(#SVGID_7_);}
	.st9{fill:url(#SVGID_8_);}
	.st10{opacity:0.1;enable-background:new    ;}
	.st11{fill:url(#SVGID_9_);}
</style>
<title>mail-unread_3</title>
<path class="st0" d="M23.9,13.1C23.8,10.5,23.7,8,23.8,5c0-0.3-0.2-0.6-0.6-0.6c0,0,0,0-0.1,0c-0.4,0-0.6,0.3-0.7,0.6c0,0,0,0,0,0
	c-0.1,3.1,0,5.6,0.1,8.2c0,0.9,0.1,1.9,0.1,2.9h-0.9L20.9,18h-0.5l0.9-1.9h-1.4L18.9,18h-0.5l0.9-1.9h-1.4L16.9,18h-0.6l0.9-1.9
	h-1.4L14.9,18h-0.6l0.9-1.9h-1.4L12.9,18h-0.6l0.9-1.9h-1.4L11,18h-0.6l0.9-2H9.9L9,18H8.4l0.9-2H7.9L7,18H6.4l0.9-2H5.9L5,18H4.4
	l0.9-2H3.9L3,18H2.5l0.9-2H2l-0.7,1.4V1.4c0.8,0.1,1.6,0.1,2.6,0.1h2h2h4.7c2.5,0,4.8,0,7,0h0.6h2l-0.2,0.4l-0.3,0.5
	c-0.8,1-1.5,2.2-2.3,3.5l-0.4,0.6c-1,1.8-2.2,3.5-3.7,5c-0.4,0.3-0.8,0.6-1.2,0.8l-0.1,0.1c-0.6,0.4-1.3,0.5-2,0.5
	c-0.3,0-0.7,0-1-0.1c-0.3-0.1-0.6-0.2-0.9-0.4c-0.3-0.2-0.5-0.4-0.8-0.6C9.2,11.5,9,11.3,8.8,11c-0.2-0.3-0.3-0.6-0.4-0.9
	c-0.2-0.7-0.2-1.3,0-2c0.1-0.3,0.2-0.6,0.4-0.9C9,6.9,9.2,6.7,9.4,6.4C9.7,6.2,9.9,6,10.2,5.8c0.3-0.2,0.6-0.3,0.9-0.4
	c0.3-0.1,0.7-0.1,1-0.1c0.5,0,1,0.1,1.4,0.3c0.4,0.2,0.8,0.5,1.1,0.8c0.3,0.3,0.5,0.7,0.7,1.2c0.1,0.5,0.2,1,0.1,1.5
	c0,0.2-0.1,0.4-0.2,0.6c-0.1,0.2-0.2,0.3-0.3,0.4c-0.1,0.1-0.3,0.2-0.5,0.3l-0.1,0.1V9.6c0-0.2,0-0.4,0-0.5c0-0.1,0-0.3,0-0.4
	c0-0.1-0.1-0.2-0.1-0.3c0-0.1-0.1-0.2-0.1-0.3c-0.1-0.2-0.2-0.4-0.4-0.6c-0.2-0.2-0.4-0.3-0.6-0.4c-0.4-0.2-0.9-0.4-1.3-0.4
	c-0.7,0-1.3,0.2-1.8,0.7C9.5,7.9,9.3,8.5,9.3,9.2c0,0.2,0,0.4,0.1,0.6c0.1,0.6,0.5,1.2,1.1,1.6c0.1,0.1,0.2,0.1,0.3,0.2l0.3,0.1
	c0.2,0.1,0.5,0.1,0.8,0.1h0.3l0.3-0.1l0.4-0.1v0.1H14h0.3h0.2h0.2h0.1c0.3-0.1,0.5-0.2,0.7-0.3c0.2-0.1,0.4-0.3,0.6-0.5
	c0.2-0.2,0.3-0.5,0.5-0.7c0.1-0.3,0.2-0.6,0.3-0.9c0.2-0.9,0-1.8-0.4-2.6c-0.2-0.4-0.4-0.7-0.7-1.1c-0.3-0.3-0.6-0.6-1-0.8
	c-0.4-0.2-0.8-0.4-1.2-0.5C13.1,4.2,12.6,4,12.1,4c-0.5,0-0.9,0.1-1.4,0.2c-0.4,0.1-0.9,0.3-1.2,0.5C8.7,5.1,8.1,5.8,7.6,6.5
	C7.4,6.9,7.2,7.3,7.1,7.7c-0.2,0.9-0.2,1.8,0,2.7c0.1,0.4,0.3,0.8,0.5,1.2c0.5,0.8,1.1,1.4,1.9,1.8c0.8,0.5,1.7,0.7,2.6,0.7
	c0.4,0,0.7,0,1.1-0.1c0.3-0.1,0.7-0.2,1-0.3c1.1-0.5,2-1.3,2.8-2.2c1.1-1.4,2.1-2.8,3-4.3l0.2-0.4c0.9-1.3,1.7-2.7,2.3-3.8L23,2.5
	c0.3-0.5,0.5-1,0.9-1.5c0.1-0.2,0.1-0.5,0-0.7C23.8,0.1,23.5,0,23.3,0l0,0c-1.7,0.1-3.5,0.1-5,0.1h-6.7c-2.9,0-5.6,0-7.9,0H2.4
	c-0.6,0-1.1,0-1.7-0.1H0.6C0.5,0,0.3,0.1,0.2,0.2C0.1,0.3,0,0.5,0,0.7v18c0,0.4,0.3,0.6,0.6,0.6c1.4,0,2.9,0.1,4.7,0.1
	c2,0,3.9,0,5.8,0l0,0c1.9,0,3.9,0,5.8,0c2.4,0,4.5,0,6.4,0.1l0,0c0.2,0,0.3-0.1,0.4-0.2c0.1-0.1,0.2-0.3,0.2-0.5
	C24,16.7,23.9,14.9,23.9,13.1z M12.8,10l-0.1,0.1c-0.1,0.1-0.3,0.2-0.4,0.2c-0.1,0-0.3,0.1-0.4,0.1c-0.3,0-0.6-0.1-0.8-0.3
	c-0.2-0.2-0.3-0.5-0.3-0.8c0-0.3,0.1-0.6,0.3-0.8c0.4-0.4,1-0.4,1.4,0c0,0,0,0,0,0c0.2,0.2,0.3,0.5,0.3,0.9L12.8,10z M22.3,18.1
	l0.4-0.9c0,0.3,0,0.6,0,0.9L22.3,18.1z"/>
<linearGradient id="SVGID_1_" gradientUnits="userSpaceOnUse" x1="3.08" y1="2.4" x2="5.06" y2="2.4" gradientTransform="matrix(1 0 0 -1 0 19.73)">
	<stop  offset="0.25" style="stop-color:#CC2A31"/>
	<stop  offset="0.49" style="stop-color:#C92930"/>
	<stop  offset="0.67" style="stop-color:#C0272F"/>
	<stop  offset="0.82" style="stop-color:#B0242C"/>
	<stop  offset="0.96" style="stop-color:#9A1F28"/>
	<stop  offset="0.99" style="stop-color:#931D27"/>
</linearGradient>
<polygon class="st1" points="4.1,18.4 3.1,18.4 4.1,16.3 5.1,16.3 "/>
<linearGradient id="SVGID_2_" gradientUnits="userSpaceOnUse" x1="7.04" y1="2.4" x2="9.02" y2="2.4" gradientTransform="matrix(1 0 0 -1 0 19.73)">
	<stop  offset="0.25" style="stop-color:#CC2A31"/>
	<stop  offset="0.49" style="stop-color:#C92930"/>
	<stop  offset="0.67" style="stop-color:#C0272F"/>
	<stop  offset="0.82" style="stop-color:#B0242C"/>
	<stop  offset="0.96" style="stop-color:#9A1F28"/>
	<stop  offset="0.99" style="stop-color:#931D27"/>
</linearGradient>
<polygon class="st2" points="8,18.4 7,18.4 8,16.3 9,16.3 "/>
<linearGradient id="SVGID_3_" gradientUnits="userSpaceOnUse" x1="11" y1="2.4" x2="12.98" y2="2.4" gradientTransform="matrix(1 0 0 -1 0 19.73)">
	<stop  offset="0.25" style="stop-color:#CC2A31"/>
	<stop  offset="0.49" style="stop-color:#C92930"/>
	<stop  offset="0.67" style="stop-color:#C0272F"/>
	<stop  offset="0.82" style="stop-color:#B0242C"/>
	<stop  offset="0.96" style="stop-color:#9A1F28"/>
	<stop  offset="0.99" style="stop-color:#931D27"/>
</linearGradient>
<polygon class="st3" points="12,18.4 11,18.4 12,16.3 13,16.3 "/>
<linearGradient id="SVGID_4_" gradientUnits="userSpaceOnUse" x1="14.97" y1="2.4" x2="16.95" y2="2.4" gradientTransform="matrix(1 0 0 -1 0 19.73)">
	<stop  offset="0.25" style="stop-color:#CC2A31"/>
	<stop  offset="0.49" style="stop-color:#C92930"/>
	<stop  offset="0.67" style="stop-color:#C0272F"/>
	<stop  offset="0.82" style="stop-color:#B0242C"/>
	<stop  offset="0.96" style="stop-color:#9A1F28"/>
	<stop  offset="0.99" style="stop-color:#931D27"/>
</linearGradient>
<polygon class="st4" points="16,18.4 15,18.4 16,16.3 17,16.3 "/>
<linearGradient id="SVGID_5_" gradientUnits="userSpaceOnUse" x1="18.93" y1="2.4" x2="20.91" y2="2.4" gradientTransform="matrix(1 0 0 -1 0 19.73)">
	<stop  offset="0.25" style="stop-color:#CC2A31"/>
	<stop  offset="0.49" style="stop-color:#C92930"/>
	<stop  offset="0.67" style="stop-color:#C0272F"/>
	<stop  offset="0.82" style="stop-color:#B0242C"/>
	<stop  offset="0.96" style="stop-color:#9A1F28"/>
	<stop  offset="0.99" style="stop-color:#931D27"/>
</linearGradient>
<polygon class="st5" points="19.9,18.4 18.9,18.4 19.9,16.3 20.9,16.3 "/>
<linearGradient id="SVGID_6_" gradientUnits="userSpaceOnUse" x1="12" y1="0.54" x2="12" y2="19.5128" gradientTransform="matrix(1 0 0 -1 0 19.73)">
	<stop  offset="0" style="stop-color:#2D5778"/>
	<stop  offset="1" style="stop-color:#1A97D4"/>
</linearGradient>
<path class="st6" d="M23.7,13.2c-0.1-2.6-0.2-5.1-0.1-8.2c0-0.2-0.2-0.4-0.4-0.4c0,0,0,0,0,0c-0.2,0-0.5,0.2-0.5,0.4c0,0,0,0,0,0
	c-0.1,3.1,0,5.5,0.1,8.1c0,1,0.1,2.1,0.1,3.1h-1l-0.9,2h-3l0.9-1.9h-1L17,18.2h-3l0.9-1.9H14l-0.9,1.9h-1.9h-1l0.9-2H10l-0.9,2h-3
	l0.9-2H6l-0.9,2h-3l0.9-2H2l-0.9,2h0v-17c1.6,0.1,3.2,0.2,4.8,0.1c0.7,0,1.4,0,2.1,0c4.5,0,8.2,0,11.5,0h0.6c0.8,0,1.6,0,2.4,0
	c-0.1,0.2-0.3,0.5-0.4,0.7l-0.3,0.5c-0.6,1.1-1.4,2.3-2.2,3.6l-0.4,0.6c-1,1.8-2.3,3.5-3.7,5.1c-0.4,0.3-0.8,0.6-1.3,0.9l-0.1,0.1
	c-0.6,0.4-1.4,0.6-2.1,0.5c-0.4,0-0.7,0-1.1-0.1c-0.3-0.1-0.7-0.2-1-0.4c-0.3-0.2-0.6-0.4-0.8-0.6c-0.2-0.2-0.5-0.5-0.6-0.8
	c-0.2-0.3-0.3-0.6-0.4-0.9C8,9.6,8,8.8,8.2,8.1c0.1-0.3,0.2-0.6,0.4-0.9C8.8,6.9,9,6.6,9.2,6.4C9.5,6.2,9.8,6,10.1,5.8
	c0.3-0.2,0.7-0.3,1-0.4c0.3-0.1,0.7-0.1,1.1-0.1c0.5,0,1,0.1,1.5,0.3c0.4,0.2,0.8,0.5,1.1,0.8c0.3,0.4,0.6,0.8,0.7,1.2
	c0.2,0.5,0.2,1,0.2,1.5c0,0.2-0.1,0.4-0.2,0.6c-0.1,0.2-0.2,0.3-0.4,0.5c-0.2,0.1-0.3,0.2-0.5,0.3c-0.1,0.1-0.3,0.1-0.4,0.1V9.6
	c0-0.2,0-0.4,0-0.5c0-0.1,0-0.3,0-0.4c0-0.1-0.1-0.2-0.1-0.3c0-0.1-0.1-0.2-0.1-0.3c-0.1-0.2-0.2-0.4-0.4-0.5
	c-0.1-0.2-0.3-0.3-0.5-0.4c-0.4-0.2-0.8-0.3-1.2-0.3c-0.6,0-1.3,0.2-1.7,0.7C9.6,8,9.4,8.6,9.4,9.2c0,0.2,0,0.4,0.1,0.6
	c0.1,0.6,0.5,1.1,1,1.4l0.3,0.2l0.3,0.1c0.3,0.1,0.7,0.1,1,0.1l0.3-0.1c0.2-0.1,0.4-0.1,0.6-0.2v0.2h1h0.2h0.2h0.2h0.1
	c0.2-0.1,0.5-0.2,0.7-0.3c0.2-0.1,0.4-0.3,0.6-0.5c0.2-0.2,0.3-0.4,0.4-0.7c0.1-0.3,0.2-0.5,0.3-0.8c0.2-0.8,0-1.7-0.4-2.5
	c-0.2-0.4-0.4-0.7-0.7-1c-0.3-0.3-0.6-0.6-1-0.8c-0.4-0.2-0.8-0.4-1.2-0.5C12.1,4.1,10.8,4.3,9.6,5C8.8,5.4,8.2,6,7.8,6.8
	C7.6,7.1,7.4,7.5,7.3,7.9C7,8.8,7,9.7,7.3,10.6c0.1,0.4,0.3,0.8,0.5,1.2c0.4,0.7,1.1,1.3,1.8,1.8c1.4,0.8,3.1,0.9,4.5,0.3
	c1.1-0.5,2-1.2,2.8-2.1c1.1-1.4,2.1-2.8,3-4.3L20.1,7c0.9-1.5,1.7-2.9,2.3-4l0.4-0.6c0.3-0.5,0.6-1,0.9-1.5c0.1-0.1,0.1-0.3,0-0.5
	c-0.1-0.1-0.2-0.2-0.4-0.2c-2.1,0.1-4.3,0.1-6.5,0.1h-2c-3.1,0-7.1,0-11.2,0H2.8c-0.7,0-1.4,0-2.1-0.1c-0.1,0-0.2,0-0.3,0.1
	C0.3,0.4,0.2,0.5,0.2,0.7v18c0,0.2,0.2,0.4,0.4,0.5c3.5,0.1,7.1,0,10.5,0c4,0,8.1-0.1,12.2,0.1l0,0c0.1,0,0.2,0,0.3-0.1
	c0.1-0.1,0.1-0.2,0.1-0.3C23.8,16.7,23.7,14.9,23.7,13.2z M13,10.1l-0.2,0.1c-0.2,0.1-0.3,0.2-0.5,0.3c-0.2,0.1-0.3,0.1-0.5,0.1
	c-0.3,0-0.7-0.1-0.9-0.4c-0.3-0.3-0.4-0.6-0.4-1c0-0.4,0.1-0.7,0.4-1c0.5-0.5,1.2-0.5,1.7,0c0,0,0,0,0,0c0.2,0.3,0.4,0.6,0.3,1
	L13,10.1z M22,18.2l0.9-1.9c0,0.6,0,1.3,0,2L22,18.2z"/>
<polygon class="st7" points="4.1,16.3 3.1,18.4 3.3,18.4 4.1,16.7 4.9,16.7 5.1,16.3 "/>
<polygon class="st7" points="8,16.3 7,18.4 7.2,18.4 8,16.7 8.8,16.7 9,16.3 "/>
<polygon class="st7" points="12,16.3 11,18.4 11.2,18.4 12,16.7 12.8,16.7 13,16.3 "/>
<polygon class="st7" points="16,16.3 15,18.4 15.1,18.4 16,16.7 16.8,16.7 17,16.3 "/>
<polygon class="st7" points="20.7,16.7 20.9,16.3 19.9,16.3 18.9,18.4 19.1,18.4 19.9,16.7 "/>
<path class="st7" d="M10.9,10.6c0.2,0.3,0.6,0.4,0.9,0.4c0.2,0,0.3,0,0.5-0.1c0.2-0.1,0.3-0.2,0.5-0.3l0.2-0.1v-0.4l-0.2,0.1
	c-0.2,0.1-0.3,0.2-0.5,0.3c-0.2,0.1-0.3,0.1-0.5,0.1c-0.3,0-0.7-0.1-0.9-0.4c-0.2-0.2-0.3-0.5-0.3-0.8c0,0.1,0,0.1,0,0.2
	C10.6,10,10.7,10.3,10.9,10.6z"/>
<path class="st7" d="M22,18.6h0.9c0-0.1,0-0.3,0-0.4h-0.8L22,18.6z"/>
<path class="st7" d="M2.1,16.3l-0.9,2H1.1v0.4h0.1l0.9-2h0.8l0.2-0.4H2.1z"/>
<path class="st7" d="M6.1,16.3l-0.9,2H2.3l-0.2,0.4h3l0.9-2h0.8L7,16.3H6.1z"/>
<path class="st7" d="M7.8,7c0.4-0.7,1.1-1.3,1.8-1.8c1.2-0.7,2.6-0.8,3.9-0.5c0.4,0.1,0.8,0.3,1.2,0.5c0.4,0.2,0.7,0.5,1,0.8
	c0.3,0.3,0.5,0.6,0.7,1c0.2,0.4,0.3,0.8,0.4,1.2c0,0.1,0,0.2,0,0.4c0-0.3,0-0.5,0-0.8c-0.1-0.4-0.2-0.8-0.4-1.2
	c-0.2-0.4-0.4-0.7-0.7-1c-0.3-0.3-0.6-0.6-1-0.8c-0.4-0.2-0.8-0.4-1.2-0.5C12.2,4,10.8,4.2,9.6,4.8c-0.7,0.4-1.4,1-1.8,1.8
	C7.6,7,7.4,7.4,7.3,7.8C7.2,8.2,7.1,8.7,7.1,9.1c0,0.1,0,0.1,0,0.2c0-0.4,0.1-0.7,0.2-1.1C7.4,7.8,7.6,7.4,7.8,7z"/>
<path class="st7" d="M11.8,7.2c0.4,0,0.8,0.1,1.2,0.3c0.2,0.1,0.4,0.3,0.5,0.4c0.1,0.2,0.3,0.3,0.4,0.5c0,0.1,0.1,0.2,0.1,0.3
	c0,0.1,0.1,0.2,0.1,0.3c0,0.1,0,0.3,0,0.4c0,0.1,0,0.3,0,0.5V9.6c0-0.2,0-0.4,0-0.5c0-0.1,0-0.3,0-0.4c0-0.1,0-0.2-0.1-0.3
	c0-0.1-0.1-0.2-0.1-0.3c-0.1-0.2-0.2-0.4-0.4-0.5c-0.1-0.2-0.3-0.3-0.5-0.4c-0.4-0.2-0.8-0.3-1.2-0.3c-0.6,0-1.3,0.2-1.7,0.7
	C9.6,8,9.4,8.6,9.4,9.2c0,0.1,0,0.2,0,0.2c0-0.6,0.2-1.2,0.7-1.6C10.5,7.4,11.1,7.2,11.8,7.2z"/>
<path class="st7" d="M21.8,2.4c-0.6,1.1-1.4,2.3-2.2,3.6l-0.4,0.6c-1,1.8-2.3,3.5-3.7,5c-0.4,0.3-0.8,0.6-1.3,0.9l-0.1,0.1
	c-0.6,0.4-1.4,0.6-2.1,0.5c-0.4,0-0.7,0-1.1-0.1c-0.3-0.1-0.7-0.2-1-0.4c-0.3-0.2-0.6-0.4-0.8-0.6c-0.2-0.2-0.5-0.5-0.6-0.8
	c-0.2-0.3-0.3-0.6-0.4-0.9C8.1,9.9,8.1,9.6,8.1,9.3c0,0.1,0,0.1,0,0.2c0,0.3,0,0.7,0.1,1c0.1,0.3,0.2,0.6,0.4,0.9
	C8.8,11.7,9,12,9.3,12.2c0.2,0.2,0.5,0.4,0.8,0.6c0.3,0.2,0.7,0.3,1,0.4c0.3,0.1,0.7,0.1,1.1,0.1c0.7,0,1.4-0.2,2.1-0.5l0.1-0.1
	c0.4-0.2,0.9-0.5,1.2-0.8c1.4-1.5,2.7-3.2,3.7-5l0.4-0.6c0.8-1.2,1.5-2.5,2.2-3.6l0.3-0.5c0.1-0.2,0.2-0.5,0.4-0.7h-0.2l-0.2,0.3
	L21.8,2.4z"/>
<path class="st7" d="M15.5,9.7c-0.1,0.2-0.2,0.3-0.4,0.5c-0.2,0.1-0.3,0.2-0.5,0.3c-0.1,0.1-0.3,0.1-0.4,0.1V11
	c0.1,0,0.3-0.1,0.4-0.1c0.2-0.1,0.4-0.2,0.5-0.3c0.2-0.1,0.3-0.3,0.4-0.5c0.1-0.2,0.2-0.4,0.2-0.6c0-0.2,0-0.4,0-0.6
	c0,0.1,0,0.1,0,0.2C15.6,9.3,15.6,9.5,15.5,9.7z"/>
<path class="st7" d="M0.7,0.6c0.7,0.1,1.4,0.1,2.1,0.1h0.8c4.1,0.1,8.1,0,11.2,0h2c2.1,0,4.3,0,6.5-0.1c0.2,0,0.3,0.1,0.4,0.2l0,0
	c0.1-0.1,0.1-0.3,0-0.4c-0.1-0.1-0.2-0.2-0.4-0.2c-2.1,0.1-4.3,0.1-6.5,0.1h-2c-3.1,0-7.1,0-11.2,0H2.8c-0.7,0-1.4,0-2.1-0.1
	c-0.1,0-0.2,0-0.3,0.1C0.3,0.4,0.2,0.5,0.2,0.7V1c0-0.1,0.1-0.2,0.2-0.3C0.4,0.6,0.6,0.6,0.7,0.6z"/>
<path class="st7" d="M14,16.3l-0.9,1.9h-1.9h-0.9l-0.2,0.4h1h1.9l0.9-1.9h0.8l0.2-0.4H14z"/>
<path class="st7" d="M17.9,16.3L17,18.2h-2.8L14,18.6h3l0.9-1.9h0.8l0.2-0.4L17.9,16.3z"/>
<path class="st7" d="M23.2,4.5c-0.2,0-0.5,0.2-0.5,0.4c0,0,0,0,0,0c0,1.2,0,2.3,0,3.3c0-0.9,0-1.9,0-2.9c0-0.2,0.2-0.4,0.5-0.4
	c0,0,0,0,0,0c0.2,0,0.4,0.2,0.4,0.4c0-0.1,0-0.2,0-0.3C23.6,4.7,23.4,4.5,23.2,4.5C23.2,4.5,23.2,4.5,23.2,4.5z"/>
<path class="st7" d="M21,18.2h-2.8L18,18.6h3l0.9-2h0.8l0.1-0.3v-0.1h-1L21,18.2z"/>
<linearGradient id="SVGID_7_" gradientUnits="userSpaceOnUse" x1="23.685" y1="0.98" x2="23.685" y2="11.43" gradientTransform="matrix(1 0 0 -1 0 19.73)">
	<stop  offset="0" style="stop-color:#2D5778"/>
	<stop  offset="1" style="stop-color:#1A97D4"/>
</linearGradient>
<path class="st8" d="M23.7,13.2c0-1.6-0.1-3.2-0.1-4.9c0,1.8,0.1,3.5,0.1,5.2s0.1,3.3,0.1,5.2l0,0C23.8,16.7,23.7,14.9,23.7,13.2z"
	/>
<path class="st7" d="M10,16.3l-0.9,2H6.3l-0.2,0.4h3l0.9-2h0.8l0.2-0.4H10z"/>
<linearGradient id="SVGID_8_" gradientUnits="userSpaceOnUse" x1="22.76" y1="3.46" x2="22.76" y2="11.44" gradientTransform="matrix(1 0 0 -1 0 19.73)">
	<stop  offset="0" style="stop-color:#2D5778"/>
	<stop  offset="1" style="stop-color:#1A97D4"/>
</linearGradient>
<path class="st9" d="M22.8,13.5c0,0.9,0.1,1.8,0.1,2.8l0,0c0-1.1-0.1-2.1-0.1-3.1c0-1.6-0.1-3.2-0.1-4.8
	C22.7,10.1,22.7,11.8,22.8,13.5z"/>
<path class="st10" d="M16.4,10c-0.1,0.2-0.3,0.5-0.4,0.7c-0.2,0.2-0.4,0.4-0.6,0.5c-0.2,0.1-0.4,0.2-0.7,0.3h-0.1h-0.2h-0.2H14h-1
	v-0.2c-0.2,0.1-0.4,0.2-0.6,0.2l-0.3,0.1c-0.3,0-0.7,0-1-0.1l-0.3-0.1l-0.3-0.2c-0.5-0.3-0.9-0.8-1-1.4c0-0.1,0-0.2-0.1-0.4
	c0,0.1,0,0.1,0,0.1c0,0.2,0,0.4,0.1,0.6c0.1,0.6,0.5,1.1,1,1.4l0.3,0.2l0.3,0.1c0.3,0.1,0.7,0.1,1,0.1l0.3-0.1
	c0.2-0.1,0.4-0.1,0.6-0.2V12h1h0.2h0.2h0.2h0.1c0.2-0.1,0.5-0.2,0.7-0.3c0.2-0.2,0.4-0.4,0.6-0.7c0.2-0.2,0.3-0.4,0.4-0.7
	c0.1-0.3,0.2-0.5,0.3-0.8c0.1-0.3,0.1-0.6,0.1-0.9c0,0.2,0,0.4-0.1,0.5C16.6,9.4,16.5,9.7,16.4,10z"/>
<linearGradient id="SVGID_9_" gradientUnits="userSpaceOnUse" x1="23.6007" y1="11.43" x2="23.6007" y2="14.42" gradientTransform="matrix(1 0 0 -1 0 19.73)">
	<stop  offset="0" style="stop-color:#2D5778"/>
	<stop  offset="1" style="stop-color:#1A97D4"/>
</linearGradient>
<path class="st11" d="M23.6,5.3c0,1,0,2,0,3C23.6,7.4,23.6,6.4,23.6,5.3C23.6,5.4,23.6,5.3,23.6,5.3z"/>
<path class="st10" d="M22.8,2.4L22.4,3c-0.6,1-1.4,2.4-2.3,3.8l-0.2,0.4c-0.9,1.5-1.9,2.9-3,4.3c-0.8,0.9-1.7,1.6-2.8,2.1
	c-1.5,0.6-3.2,0.5-4.5-0.3c-0.7-0.4-1.4-1-1.8-1.8c-0.2-0.4-0.4-0.8-0.5-1.2C7.2,10,7.1,9.6,7.1,9.3c0,0.1,0,0.1,0,0.2
	c0,0.4,0.1,0.9,0.2,1.3c0.1,0.4,0.3,0.9,0.5,1.2c0.4,0.7,1.1,1.3,1.8,1.8c1.4,0.8,3.1,0.9,4.5,0.3c1.1-0.5,2-1.2,2.8-2.1
	c1.1-1.4,2.1-2.8,3-4.3l0.2-0.4c0.9-1.3,1.7-2.7,2.3-3.8l0.4-0.6c0.3-0.5,0.6-1,0.9-1.5c0.1-0.1,0.1-0.3,0-0.4v0.1
	C23.4,1.4,23.1,1.9,22.8,2.4z"/>
<path class="st10" d="M8.6,7.5C8.8,7.2,9,6.9,9.3,6.7c0.2-0.2,0.5-0.4,0.8-0.6c0.3-0.2,0.7-0.3,1-0.4c0.3-0.1,0.7-0.1,1.1-0.1
	c0.5,0,1,0.1,1.5,0.3c0.4,0.2,0.8,0.5,1.1,0.8c0.3,0.4,0.6,0.8,0.7,1.2c0.1,0.3,0.2,0.7,0.2,1c0-0.5,0-0.9-0.2-1.4
	c-0.1-0.5-0.4-0.9-0.7-1.2c-0.3-0.4-0.7-0.6-1.1-0.8c-0.5-0.2-1-0.3-1.5-0.3c-0.4,0-0.7,0-1.1,0.1c-0.3,0.1-0.7,0.2-1,0.4
	C9.8,5.9,9.5,6.1,9.3,6.3C9,6.6,8.8,6.8,8.6,7.1C8.5,7.4,8.3,7.7,8.2,8C8.1,8.4,8.1,8.7,8.1,9.1c0,0.1,0,0.1,0,0.2
	c0-0.3,0.1-0.6,0.1-0.9C8.3,8.1,8.5,7.8,8.6,7.5z"/>
<path class="st10" d="M20.1,1.2h-0.6c-3.3,0-7,0-11.5,0c-0.7,0-1.4,0-2.1,0c-1.6,0.1-3.2,0.1-4.8,0v0.4c1.6,0.1,3.2,0.2,4.8,0.1
	c0.7,0,1.4,0,2.1,0c4.5,0,8.2,0,11.5,0h0.6c0.7,0,1.4,0,2.1,0l0.2-0.4C21.7,1.2,20.9,1.2,20.1,1.2z"/>
<path class="st10" d="M23.7,19.1c-0.1,0.1-0.2,0.1-0.3,0.1l0,0c-4.1-0.2-8.2-0.1-12.2-0.1c-3.4,0-7,0.1-10.5,0
	c-0.2,0-0.4-0.2-0.4-0.5v0.4c0,0.2,0.2,0.4,0.4,0.5c3.5,0.1,7.1,0,10.5,0c4,0,8.1-0.1,12.2,0.1l0,0c0.1,0,0.2,0,0.3-0.1
	c0.1-0.1,0.1-0.2,0.1-0.3c0-0.1,0-0.2,0-0.4C23.8,18.9,23.7,19,23.7,19.1z"/>
<path class="st10" d="M11.8,8.3c0.3,0,0.6,0.1,0.9,0.4c0.2,0.3,0.4,0.6,0.3,1V9.2c0-0.4-0.1-0.7-0.3-1c-0.5-0.5-1.2-0.5-1.7,0
	c0,0,0,0,0,0c-0.2,0.3-0.4,0.6-0.4,1c0,0.1,0,0.1,0,0.2c0-0.3,0.1-0.5,0.3-0.8C11.1,8.4,11.5,8.3,11.8,8.3z"/>
</svg>
