<?xml version="1.0" encoding="utf-8"?>
<!-- Generator: Adobe Illustrator 21.0.0, SVG Export Plug-In . SVG Version: 6.00 Build 0)  -->
<svg version="1.1" id="katman_1" xmlns="http://www.w3.org/2000/svg" xmlns:xlink="http://www.w3.org/1999/xlink" x="0px" y="0px"
	 viewBox="0 0 47.8 48" style="enable-background:new 0 0 47.8 48;" xml:space="preserve">
<style type="text/css">
	.st0{opacity:0.5;fill:#1A1A1A;enable-background:new    ;}
	.st1{fill:url(#SVGID_1_);}
	.st2{fill:url(#SVGID_2_);}
	.st3{opacity:0.5;fill:#20396E;enable-background:new    ;}
	.st4{fill:url(#SVGID_3_);}
	.st5{fill:url(#SVGID_4_);}
	.st6{fill:url(#SVGID_5_);}
</style>
<title>notification-network-wired_1</title>
<path class="st0" d="M33.3,39.7c-0.2,0-0.4,0-0.5-0.1L13.2,29.5c-0.5-0.3-0.8-0.9-0.5-1.5c0,0,0,0,0,0l1.1-2.1
	c0.3-0.5,0.9-0.8,1.5-0.5l19.6,10.1c0.5,0.3,0.8,0.9,0.5,1.5c0,0,0,0,0,0l-1.1,2.1C34.1,39.5,33.7,39.7,33.3,39.7z"/>
<linearGradient id="SVGID_1_" gradientUnits="userSpaceOnUse" x1="43.5969" y1="-0.1569" x2="66.9569" y2="-0.1569" gradientTransform="matrix(0.9574 -2.533640e-02 2.419563e-02 -0.9881 -28.7059 33.7471)">
	<stop  offset="0" style="stop-color:#E7E6E6"/>
	<stop  offset="0.22" style="stop-color:#DFDFDF"/>
	<stop  offset="0.55" style="stop-color:#CACACA"/>
	<stop  offset="0.95" style="stop-color:#A8A9A9"/>
	<stop  offset="1" style="stop-color:#A3A4A4"/>
</linearGradient>
<path class="st1" d="M13.1,28l0.8-1.7c0.3-0.5,0.9-0.7,1.3-0.4l19.2,9.8c0.5,0.3,0.7,0.9,0.4,1.3l-0.8,1.7c-0.3,0.5-0.9,0.7-1.3,0.4
	l-19.2-9.8C13.1,29,12.9,28.4,13.1,28z"/>
<path class="st0" d="M14.7,23c-0.4,0-0.8-0.2-1-0.6l-1-2.1c-0.3-0.6,0-1.2,0.5-1.5L33.6,9c0.1-0.1,0.3-0.1,0.4-0.1
	c0.4,0,0.8,0.2,1,0.6l1,2.2c0.3,0.6,0,1.2-0.5,1.5l-20.3,9.8C15,23,14.9,23,14.7,23L14.7,23z"/>
<linearGradient id="SVGID_2_" gradientUnits="userSpaceOnUse" x1="79.6564" y1="57.6895" x2="108.4064" y2="71.6095" gradientTransform="matrix(0.9073 4.053589e-02 -3.887310e-02 -0.9801 -56.6 74.594)">
	<stop  offset="0" style="stop-color:#E7E6E6"/>
	<stop  offset="0.22" style="stop-color:#DFDFDF"/>
	<stop  offset="0.55" style="stop-color:#CACACA"/>
	<stop  offset="0.95" style="stop-color:#A8A9A9"/>
	<stop  offset="1" style="stop-color:#A3A4A4"/>
</linearGradient>
<path class="st2" d="M13.9,22l-0.8-1.7c-0.2-0.5,0-1.1,0.5-1.3l19.9-9.6c0.5-0.2,1.1,0,1.3,0.5l0.8,1.7c0.2,0.5,0,1.1-0.5,1.3
	l-19.9,9.6C14.8,22.7,14.2,22.5,13.9,22z"/>
<circle class="st3" cx="39.5" cy="8.1" r="8.1"/>
<radialGradient id="SVGID_3_" cx="39.54" cy="41.91" r="7.72" gradientTransform="matrix(1 0 0 -1 0 50)" gradientUnits="userSpaceOnUse">
	<stop  offset="0" style="stop-color:#2A6D94"/>
	<stop  offset="1" style="stop-color:#2D5778"/>
</radialGradient>
<circle class="st4" cx="39.5" cy="8.1" r="7.7"/>
<circle class="st3" cx="8.1" cy="24.1" r="8.1"/>
<radialGradient id="SVGID_4_" cx="8.09" cy="25.91" r="7.72" gradientTransform="matrix(1 0 0 -1 0 50)" gradientUnits="userSpaceOnUse">
	<stop  offset="0" style="stop-color:#2A6D94"/>
	<stop  offset="1" style="stop-color:#2D5778"/>
</radialGradient>
<circle class="st5" cx="8.1" cy="24.1" r="7.7"/>
<circle class="st3" cx="39.7" cy="39.9" r="8.1"/>
<radialGradient id="SVGID_5_" cx="39.72" cy="10.09" r="7.72" gradientTransform="matrix(1 0 0 -1 0 50)" gradientUnits="userSpaceOnUse">
	<stop  offset="0" style="stop-color:#2A6D94"/>
	<stop  offset="1" style="stop-color:#2D5778"/>
</radialGradient>
<circle class="st6" cx="39.7" cy="39.9" r="7.7"/>
</svg>
