<?xml version="1.0" encoding="utf-8"?>
<!-- Generator: Adobe Illustrator 21.0.0, SVG Export Plug-In . SVG Version: 6.00 Build 0)  -->
<svg version="1.1" id="katman_1" xmlns="http://www.w3.org/2000/svg" xmlns:xlink="http://www.w3.org/1999/xlink" x="0px" y="0px"
	 viewBox="0 0 21.5 22" style="enable-background:new 0 0 21.5 22;" xml:space="preserve">
<style type="text/css">
	.st0{opacity:0.7;fill:#333333;enable-background:new    ;}
	.st1{fill:#1A1A1A;}
	.st2{fill:url(#SVGID_1_);}
	.st3{opacity:0.5;fill:#FFFFFF;enable-background:new    ;}
	.st4{fill:url(#SVGID_2_);}
	.st5{fill:url(#SVGID_3_);}
	.st6{fill:url(#SVGID_4_);}
	.st7{fill:url(#SVGID_5_);}
	.st8{fill:url(#SVGID_6_);}
	.st9{fill:url(#SVGID_7_);}
	.st10{fill:url(#SVGID_8_);}
	.st11{fill:url(#SVGID_9_);}
	.st12{fill:url(#SVGID_10_);}
	.st13{fill:url(#SVGID_11_);}
	.st14{fill:url(#SVGID_12_);}
	.st15{fill:#58595B;}
	.st16{opacity:0.2;fill:#FFFFFF;enable-background:new    ;}
	.st17{opacity:0.1;fill:#FFFFFF;enable-background:new    ;}
	.st18{opacity:0.2;fill:#010101;enable-background:new    ;}
	.st19{fill:#FF0000;}
	.st20{fill:url(#SVGID_13_);}
	.st21{fill:url(#SVGID_14_);}
	.st22{fill:#00FFFF;}
	.st23{opacity:0.2;fill:#383838;enable-background:new    ;}
</style>
<title>Varlık 11</title>
<path class="st0" d="M4.2,21.6L4.3,20H3.7l0.1-1.7H1.2c-0.4,0-0.8-0.3-0.9-0.7v-0.1c-0.1-0.1-0.1-0.2-0.2-0.3c0,0-0.1-1.7-0.1-2.2
	c0-1,0-3.7,0-4.5l0,0c0,0,0-0.1,0-0.1c0,0,0-0.1,0-0.1c0-0.4,0.1-1.5,0.1-1.9C0.2,8,0.3,7.2,0.4,6.8c0-0.1,0.1-0.2,0.3-0.2h3.6
	L4.1,1.8h0.7V0h11.9v1.8h0.7l-0.1,4.7h3.6c0.1,0,0.3,0.1,0.3,0.2c0.1,0.4,0.2,1.2,0.3,1.6c0,0.3,0.1,1.4,0.1,1.9c0,0,0,0.1,0,0.1
	c0,0,0,0.1,0,0.1c0,0,0,3.3,0,4.5c0,0.4,0,2.3,0,2.3c0,0.1,0,0.2-0.1,0.2c0,0,0,0.1,0,0.1c-0.1,0.4-0.5,0.7-0.9,0.7h-2.7l0,1.7h-0.5
	l0.1,1.5L4.2,21.6z"/>
<path class="st1" d="M21.1,17.4L21.1,17.4c0,0.4-0.3,0.7-0.7,0.7H1.2c-0.4,0-0.7-0.3-0.7-0.7l0,0l0,0H21.1L21.1,17.4z"/>
<linearGradient id="SVGID_1_" gradientUnits="userSpaceOnUse" x1="10.775" y1="3.43" x2="10.775" y2="4.52" gradientTransform="matrix(1 0 0 -1 0 21.73)">
	<stop  offset="5.000000e-02" style="stop-color:#0F0F0F"/>
	<stop  offset="0.31" style="stop-color:#161616"/>
	<stop  offset="0.7" style="stop-color:#2B2B2B"/>
	<stop  offset="1" style="stop-color:#404040"/>
</linearGradient>
<path class="st2" d="M0.4,17.4h20.6l0,0l0,0c0,0.4-0.3,0.7-0.7,0.7c0,0,0,0,0,0H1.1C0.8,18.1,0.4,17.8,0.4,17.4L0.4,17.4L0.4,17.4
	L0.4,17.4z"/>
<path class="st3" d="M0.4,17.4L0.4,17.4c0,0.1,0,0.2,0.1,0.3H21c0.1-0.1,0.1-0.2,0.1-0.3H0.4z"/>
<polygon class="st1" points="4.5,7.2 4.2,1.9 17.2,1.9 17,7.2 "/>
<path class="st1" d="M0.3,10.3c-0.1,0-0.1-0.1-0.1-0.1c0,0,0,0,0,0c0-0.4,0-1.5,0.1-1.9C0.4,7.9,0.5,7,0.6,6.7
	c0-0.1,0.1-0.1,0.1-0.1h3.6c0.1,0,0.1,0.1,0.1,0.1c0,0,0,0,0,0c0,0.3-0.2,1.2-0.2,1.5s0,1.5,0,1.9c0,0.1-0.1,0.1-0.1,0.1L0.3,10.3z"
	/>
<path class="st1" d="M17.4,10.3c-0.1,0-0.1-0.1-0.1-0.1v0c0-0.3,0-1.5,0-1.9c0-0.4-0.2-1.2-0.2-1.5c0-0.1,0-0.1,0.1-0.1c0,0,0,0,0,0
	h3.6c0.1,0,0.1,0,0.1,0.1C21,7,21.1,7.9,21.2,8.3c0,0.3,0.1,1.5,0.1,1.9c0,0.1,0,0.1-0.1,0.1c0,0,0,0,0,0L17.4,10.3z"/>
<path class="st1" d="M0.6,17.5c-0.2,0-0.3-0.1-0.4-0.3c0,0,0,0,0,0c0,0-0.1-1.7-0.1-2.3c0-1.1,0-4.5,0-4.6c0-0.1,0.1-0.1,0.1-0.1
	h20.8c0.1,0,0.1,0.1,0.1,0.1v0c0,0,0,3.3,0,4.5c0,0.4,0,2.3,0,2.3c0,0.2-0.1,0.3-0.3,0.3c0,0,0,0,0,0L0.6,17.5z"/>
<linearGradient id="SVGID_2_" gradientUnits="userSpaceOnUse" x1="4.27" y1="-358.225" x2="17.15" y2="-358.225" gradientTransform="matrix(1 0 0 1 0 362.77)">
	<stop  offset="0" style="stop-color:#E7E6E6"/>
	<stop  offset="9.000000e-02" style="stop-color:#A3A4A4"/>
	<stop  offset="0.92" style="stop-color:#A3A4A4"/>
	<stop  offset="1" style="stop-color:#E7E6E6"/>
</linearGradient>
<polygon class="st4" points="17.1,1.9 4.3,1.9 4.5,7.2 17,7.2 "/>
<linearGradient id="SVGID_3_" gradientUnits="userSpaceOnUse" x1="4.52" y1="-358.235" x2="16.91" y2="-358.235" gradientTransform="matrix(1 0 0 1 0 362.77)">
	<stop  offset="0" style="stop-color:#A3A4A4"/>
	<stop  offset="3.000000e-02" style="stop-color:#B1B1B1"/>
	<stop  offset="0.1" style="stop-color:#D5D5D5"/>
	<stop  offset="0.12" style="stop-color:#E7E6E6"/>
	<stop  offset="0.89" style="stop-color:#E7E6E6"/>
	<stop  offset="1" style="stop-color:#A3A4A4"/>
</linearGradient>
<polygon class="st5" points="4.5,1.9 4.7,7.2 16.8,7.2 16.9,1.9 "/>
<rect x="4.9" y="0.1" class="st1" width="11.6" height="7.1"/>
<linearGradient id="SVGID_4_" gradientUnits="userSpaceOnUse" x1="10.69" y1="14.57" x2="10.69" y2="22.23" gradientTransform="matrix(1 0 0 -1 0 21.73)">
	<stop  offset="0" style="stop-color:#A3A4A4"/>
	<stop  offset="1.000000e-02" style="stop-color:#A6A7A7"/>
	<stop  offset="0.14" style="stop-color:#BFC0C0"/>
	<stop  offset="0.28" style="stop-color:#D3D3D4"/>
	<stop  offset="0.44" style="stop-color:#E1E1E2"/>
	<stop  offset="0.64" style="stop-color:#E9E9EA"/>
	<stop  offset="1" style="stop-color:#EBEBEC"/>
</linearGradient>
<rect x="4.9" y="0.1" class="st6" width="11.5" height="7"/>
<rect x="3.3" y="7.1" class="st1" width="15" height="3.2"/>
<linearGradient id="SVGID_5_" gradientUnits="userSpaceOnUse" x1="10.7572" y1="11.59" x2="10.7572" y2="14.49" gradientTransform="matrix(1 0 0 -1 0 21.73)">
	<stop  offset="5.000000e-02" style="stop-color:#0F0F0F"/>
	<stop  offset="0.19" style="stop-color:#131313"/>
	<stop  offset="0.32" style="stop-color:#1E1E1E"/>
	<stop  offset="0.45" style="stop-color:#313131"/>
	<stop  offset="0.53" style="stop-color:#404040"/>
	<stop  offset="0.61" style="stop-color:#2F2F2F"/>
	<stop  offset="0.73" style="stop-color:#1D1D1D"/>
	<stop  offset="0.85" style="stop-color:#121212"/>
	<stop  offset="1" style="stop-color:#0F0F0F"/>
</linearGradient>
<path class="st7" d="M17.1,10.3H4.4c0,0-0.1-1.6,0-2.2c0-0.3,0.1-0.7,0.2-1c0,0,9.8,0.1,12.3,0C17.2,8.2,17.2,9.2,17.1,10.3z"/>
<linearGradient id="SVGID_6_" gradientUnits="userSpaceOnUse" x1="2.3153" y1="11.47" x2="2.3153" y2="15.0835" gradientTransform="matrix(1 0 0 -1 0 21.73)">
	<stop  offset="0" style="stop-color:#B1B3B6"/>
	<stop  offset="0.16" style="stop-color:#B4B6B9"/>
	<stop  offset="0.28" style="stop-color:#BDBFC1"/>
	<stop  offset="0.39" style="stop-color:#CDCECF"/>
	<stop  offset="0.49" style="stop-color:#E4E3E3"/>
	<stop  offset="0.5" style="stop-color:#E7E6E6"/>
	<stop  offset="0.55" style="stop-color:#DFDFDF"/>
	<stop  offset="0.72" style="stop-color:#C6C7C9"/>
	<stop  offset="0.88" style="stop-color:#B6B8BB"/>
	<stop  offset="1" style="stop-color:#B1B3B6"/>
</linearGradient>
<path class="st8" d="M4.1,10.2H0.3c-0.1,0-0.1,0-0.1-0.1l0,0c0-0.4,0-1.5,0.1-1.9C0.4,7.9,0.5,7,0.6,6.7c0,0,0.1-0.1,0.1-0.1h3.6
	c0.1,0,0.1,0,0.1,0.1c0,0,0,0,0,0c0,0.3-0.2,1.2-0.2,1.5c0,0.3,0,1.5,0,1.9C4.3,10.2,4.2,10.2,4.1,10.2C4.1,10.2,4.1,10.2,4.1,10.2z
	"/>
<linearGradient id="SVGID_7_" gradientUnits="userSpaceOnUse" x1="19.1447" y1="11.38" x2="19.1447" y2="15.12" gradientTransform="matrix(1 0 0 -1 0 21.73)">
	<stop  offset="0" style="stop-color:#B1B3B6"/>
	<stop  offset="0.16" style="stop-color:#B4B6B9"/>
	<stop  offset="0.28" style="stop-color:#BDBFC1"/>
	<stop  offset="0.39" style="stop-color:#CDCECF"/>
	<stop  offset="0.49" style="stop-color:#E4E3E3"/>
	<stop  offset="0.5" style="stop-color:#E7E6E6"/>
	<stop  offset="0.55" style="stop-color:#DFDFDF"/>
	<stop  offset="0.72" style="stop-color:#C6C7C9"/>
	<stop  offset="0.88" style="stop-color:#B6B8BB"/>
	<stop  offset="1" style="stop-color:#B1B3B6"/>
</linearGradient>
<path class="st9" d="M17.4,10.2h3.8c0.1,0,0.1,0,0.1-0.1v0c0-0.4,0-1.5-0.1-1.9c-0.1-0.4-0.2-1.3-0.3-1.5c0,0-0.1-0.1-0.1-0.1h-3.6
	c-0.1,0-0.1,0-0.1,0.1c0,0,0,0,0,0c0,0.3,0.2,1.2,0.2,1.5c0,0.3,0,1.5,0,1.9C17.2,10.2,17.3,10.2,17.4,10.2
	C17.3,10.2,17.3,10.2,17.4,10.2z"/>
<linearGradient id="SVGID_8_" gradientUnits="userSpaceOnUse" x1="10.72" y1="4.52" x2="10.72" y2="14.39" gradientTransform="matrix(1 0 0 -1 0 21.73)">
	<stop  offset="0" style="stop-color:#818486"/>
	<stop  offset="0.18" style="stop-color:#8D9091"/>
	<stop  offset="0.51" style="stop-color:#ADAEAF"/>
	<stop  offset="0.95" style="stop-color:#E1E0E0"/>
	<stop  offset="1" style="stop-color:#E7E6E6"/>
</linearGradient>
<path class="st10" d="M20.9,17.4H0.6c-0.2,0-0.3-0.1-0.3-0.2c0,0,0,0,0,0c0,0-0.1-1.7-0.1-2.3c0-1.1,0-4.6,0-4.6
	c0-0.1,0-0.1,0.1-0.1c0,0,0,0,0,0h20.8c0.1,0,0.1,0,0.1,0.1v0c0,0,0,3.2,0,4.5c0,0.5,0,2.3,0,2.3c0,0.1-0.1,0.3-0.3,0.3
	C20.9,17.5,20.9,17.4,20.9,17.4z"/>
<linearGradient id="SVGID_9_" gradientUnits="userSpaceOnUse" x1="3.9" y1="4.505" x2="17.57" y2="4.505" gradientTransform="matrix(1 0 0 -1 0 21.73)">
	<stop  offset="0" style="stop-color:#E7E6E6"/>
	<stop  offset="9.000000e-02" style="stop-color:#A3A4A4"/>
	<stop  offset="0.92" style="stop-color:#A3A4A4"/>
	<stop  offset="1" style="stop-color:#E7E6E6"/>
</linearGradient>
<polygon class="st11" points="17.6,19.8 3.9,19.8 4.1,14.6 17.4,14.6 "/>
<linearGradient id="SVGID_10_" gradientUnits="userSpaceOnUse" x1="4.16" y1="4.62" x2="17.31" y2="4.62" gradientTransform="matrix(1 0 0 -1 0 21.73)">
	<stop  offset="0" style="stop-color:#A3A4A4"/>
	<stop  offset="3.000000e-02" style="stop-color:#B1B1B1"/>
	<stop  offset="0.1" style="stop-color:#D5D5D5"/>
	<stop  offset="0.12" style="stop-color:#E7E6E6"/>
	<stop  offset="0.89" style="stop-color:#E7E6E6"/>
	<stop  offset="1" style="stop-color:#A3A4A4"/>
</linearGradient>
<polygon class="st12" points="4.2,19.6 4.4,14.6 17.2,14.6 17.3,19.6 "/>
<linearGradient id="SVGID_11_" gradientUnits="userSpaceOnUse" x1="10.76" y1="0.4" x2="10.76" y2="7.16" gradientTransform="matrix(1 0 0 -1 0 21.73)">
	<stop  offset="0" style="stop-color:#E7E6E6"/>
	<stop  offset="1" style="stop-color:#E9E3E2"/>
</linearGradient>
<polygon class="st13" points="17.2,21.3 4.3,21.3 4.9,14.6 16.6,14.6 "/>
<path class="st1" d="M17.5,14.6H4v-0.8c0-0.9,0.7-1.5,1.5-1.5h10.4c0.9,0,1.5,0.7,1.5,1.5V14.6z"/>
<linearGradient id="SVGID_12_" gradientUnits="userSpaceOnUse" x1="10.735" y1="9.87" x2="10.735" y2="6.79" gradientTransform="matrix(1 0 0 -1 0 21.73)">
	<stop  offset="0" style="stop-color:#404040"/>
	<stop  offset="0.37" style="stop-color:#252525"/>
	<stop  offset="0.7" style="stop-color:#151515"/>
	<stop  offset="0.95" style="stop-color:#0F0F0F"/>
</linearGradient>
<path class="st14" d="M4.1,14.6h13.3v-0.7c0-0.8-0.7-1.5-1.5-1.5H5.5c-0.8,0-1.5,0.7-1.5,1.5V14.6z"/>
<rect x="6.2" y="15.4" class="st15" width="9.2" height="0.3"/>
<rect x="6.1" y="16.2" class="st15" width="9.4" height="0.3"/>
<rect x="6" y="16.9" class="st15" width="9.6" height="0.3"/>
<rect x="5.9" y="17.7" class="st15" width="9.8" height="0.3"/>
<rect x="5.8" y="18.5" class="st15" width="10" height="0.3"/>
<rect x="5.7" y="19.3" class="st15" width="10.2" height="0.3"/>
<rect x="5.6" y="20.1" class="st15" width="10.4" height="0.3"/>
<rect x="0.2" y="10.2" class="st1" width="21" height="0.1"/>
<path class="st16" d="M0.2,11.3V11c0-0.1,0-0.1,0.1-0.1c0,0,0,0,0,0h20.8c0.1,0,0.1,0,0.1,0.1v0v0.2l0,0c0-0.5,0-0.9,0-0.9
	c0-0.1,0-0.1-0.1-0.1l0,0H0.3c-0.1,0-0.1,0-0.1,0.1l0,0C0.2,10.3,0.2,10.7,0.2,11.3L0.2,11.3z"/>
<path class="st17" d="M15.9,12.4H5.6c-0.8,0-1.5,0.7-1.5,1.5l0,0v0.7C4,13.7,4.7,13,5.5,13c0,0,0,0,0,0h10.4c0.8,0,1.5,0.7,1.5,1.5
	v-0.7C17.4,13,16.7,12.3,15.9,12.4z"/>
<path class="st16" d="M0.2,9.3c0-0.1,0-0.3,0-0.3c0-0.3,0.2-1.3,0.3-1.5c0-0.1,0.1-0.1,0.1-0.1h3.7c0,0,0.1,0,0.1,0V7.1l0,0V6.6
	c0,0-0.1,0-0.1,0H0.7c-0.1,0-0.1,0-0.1,0.1C0.5,7,0.3,7.9,0.3,8.3C0.2,8.6,0.3,8.9,0.2,9.3L0.2,9.3z"/>
<path class="st16" d="M17.1,7.3h3.6c0.1,0,0.1,0,0.1,0.1c0.1,0.3,0.2,1.2,0.3,1.5c0,0.1,0,0.2,0,0.3l0,0c0-0.4,0-0.8-0.1-1
	S21,7,20.9,6.7c0-0.1-0.1-0.1-0.1-0.1h-3.6c0,0-0.1,0-0.1,0V7v0.1l0,0L17.1,7.3L17.1,7.3C17.1,7.3,17.1,7.3,17.1,7.3z"/>
<polygon class="st16" points="16.9,1.9 16.5,1.9 16.5,2.6 16.9,2.6 17.1,2.6 17.2,1.9 "/>
<rect x="4.9" y="0.1" class="st16" width="11.6" height="0.7"/>
<polygon class="st16" points="4.9,2.6 4.9,1.9 4.5,1.9 4.2,1.9 4.3,2.6 4.5,2.6 "/>
<polygon class="st18" points="4.3,22 17.2,22 17.1,21.3 4.4,21.3 "/>
<path class="st16" d="M4.4,7.1V6.8V7V7.1z"/>
<path class="st16" d="M17,6.9v0.2l0,0V7V6.9z"/>
<polygon class="st18" points="17.1,20.5 17.6,20.5 17.5,19.8 17,19.8 "/>
<path class="st18" d="M21.2,17.2L21.2,17.2c0,0.1,0,0.1-0.1,0.2c0,0.1,0,0.1,0,0.2l0,0c-0.1,0.3-0.4,0.6-0.7,0.6h-2.9v0.7h2.9
	c0.3,0,0.6-0.2,0.7-0.6l0,0c0-0.1,0-0.1,0-0.2c0,0,0.1-0.1,0.1-0.2L21.2,17.2L21.2,17.2z"/>
<polygon class="st18" points="3.9,19.8 3.9,20.5 4.4,20.5 4.5,19.8 "/>
<path class="st18" d="M0.4,17.5L0.4,17.5c0,0,0-0.1,0-0.1c-0.1,0-0.1-0.1-0.2-0.2l0,0v0.7c0,0.1,0.1,0.2,0.2,0.2c0,0,0,0.1,0,0.1
	l0,0c0.1,0.3,0.4,0.6,0.7,0.6H4v-0.7H1.2C0.8,18.1,0.5,17.9,0.4,17.5z"/>
<circle class="st19" cx="19.4" cy="12.1" r="0.4"/>
<ellipse class="st1" cx="19.4" cy="10.2" rx="0.7" ry="1.1"/>
<radialGradient id="SVGID_13_" cx="29.0196" cy="6.3726" r="0.98" gradientTransform="matrix(0.92 0 0 -0.92 -7.18 16.1116)" gradientUnits="userSpaceOnUse">
	<stop  offset="0" style="stop-color:#404040"/>
	<stop  offset="0.38" style="stop-color:#2F2F2F"/>
	<stop  offset="0.95" style="stop-color:#0F0F0F"/>
</radialGradient>
<ellipse class="st20" cx="19.4" cy="10.2" rx="0.7" ry="1.1"/>
<ellipse class="st1" cx="19.4" cy="10.2" rx="0.4" ry="0.7"/>
<radialGradient id="SVGID_14_" cx="29.0196" cy="33.8542" r="0.4" gradientTransform="matrix(0.92 0 0 -1.59 -7.18 64.0207)" gradientUnits="userSpaceOnUse">
	<stop  offset="0" style="stop-color:#EBEBEC"/>
	<stop  offset="0.22" style="stop-color:#E7E7E8"/>
	<stop  offset="0.47" style="stop-color:#D9DADA"/>
	<stop  offset="0.72" style="stop-color:#C3C4C4"/>
	<stop  offset="0.99" style="stop-color:#A5A6A6"/>
	<stop  offset="1" style="stop-color:#A3A4A4"/>
</radialGradient>
<ellipse class="st21" cx="19.4" cy="10.2" rx="0.4" ry="0.6"/>
<path class="st16" d="M19.4,12c0.1,0,0.3,0.1,0.3,0.2c0-0.1,0-0.1,0-0.2c0-0.2-0.2-0.4-0.4-0.4S19,11.8,19,12c0,0.1,0,0.1,0,0.2
	C19.1,12,19.3,12,19.4,12z"/>
<path class="st18" d="M19.4,12.4c-0.1,0-0.3-0.1-0.3-0.2c0,0.1,0,0.1,0,0.2c0,0.2,0.2,0.4,0.4,0.4s0.4-0.2,0.4-0.4
	c0-0.1,0-0.1,0-0.2C19.8,12.4,19.6,12.5,19.4,12.4z"/>
<path class="st16" d="M19.4,9.5c0.3,0,0.6,0.4,0.7,0.9c0-0.1,0-0.1,0-0.2c0-0.6-0.3-1.1-0.7-1.1s-0.7,0.5-0.7,1.1c0,0.1,0,0.1,0,0.2
	C18.8,9.9,19.1,9.5,19.4,9.5z"/>
<path class="st18" d="M19.4,11.3c-0.3,0-0.6-0.4-0.7-0.9c0,0.1,0,0.1,0,0.2c0,0.6,0.3,1.1,0.7,1.1s0.7-0.5,0.7-1.1
	c0-0.1,0-0.1,0-0.2C20.1,10.9,19.8,11.3,19.4,11.3z"/>
<path class="st16" d="M19.4,9.9c0.2,0,0.3,0.2,0.4,0.5c0-0.1,0-0.1,0-0.2c0-0.3-0.2-0.6-0.4-0.6S19,9.9,19,10.2c0,0.1,0,0.1,0,0.2
	C19.1,10.1,19.3,9.9,19.4,9.9z"/>
<circle class="st22" cx="19.4" cy="13.1" r="0.4"/>
<path class="st16" d="M19.4,13c0.1,0,0.3,0.1,0.3,0.2c0-0.1,0-0.1,0-0.2c0-0.2-0.2-0.4-0.4-0.4S19,12.8,19,13c0,0.1,0,0.1,0,0.2
	C19.1,13,19.3,13,19.4,13z"/>
<path class="st18" d="M19.4,13.5c-0.1,0-0.3-0.1-0.3-0.2c0,0.1,0,0.1,0,0.2c0,0.2,0.2,0.4,0.4,0.4s0.4-0.2,0.4-0.4l0,0
	c0-0.1,0-0.1,0-0.2C19.8,13.4,19.6,13.5,19.4,13.5z"/>
<polygon class="st23" points="16.8,17 16.6,14.6 4.9,14.6 4.7,17 "/>
</svg>
