<?xml version="1.0" encoding="utf-8"?>
<!-- Generator: Adobe Illustrator 21.0.0, SVG Export Plug-In . SVG Version: 6.00 Build 0)  -->
<svg version="1.1" id="katman_1" xmlns="http://www.w3.org/2000/svg" xmlns:xlink="http://www.w3.org/1999/xlink" x="0px" y="0px"
	 viewBox="0 0 16 16" style="enable-background:new 0 0 16 16;" xml:space="preserve">
<style type="text/css">
	.st0{fill:#2C2F33;}
	.st1{fill:#E7E9EC;}
</style>
<title>Varlık 17</title>
<g id="_Grup_">
	<g id="_Grup_2">
		<path id="_Yol_" class="st0" d="M4.5,11.1L4.5,11.1L4.5,11.1L4.5,11.1z"/>
		<path id="_Yol_2" class="st0" d="M4.7,11.1L4.7,11.1L4.7,11.1C4.6,11.1,4.7,11,4.7,11.1C4.6,11.1,4.7,11.1,4.7,11.1z"/>
		<path id="_Yol_3" class="st0" d="M4.8,10.9C4.8,10.9,4.8,10.9,4.8,10.9L4.8,10.9z"/>
		<path id="_Yol_4" class="st0" d="M8.1,9.5C8.1,9.5,8,9.5,8.1,9.5C8,9.5,8,9.5,8.1,9.5z"/>
		<path id="_Yol_5" class="st0" d="M8,9.5L8,9.5z"/>
		<path id="_Yol_6" class="st0" d="M6.8,9.6C6.7,9.7,6.7,9.7,6.7,9.7H6.6c-0.1,0.1,0,0.1-0.1,0.1S6.4,9.8,6.3,9.8c0,0,0,0,0-0.1
			c0-0.1-0.1,0.1-0.1,0.1l0,0C6,10,5.7,10.1,5.6,10.3l0,0c-0.3,0.1-0.5,0.3-0.7,0.5c0.1-0.1,0.4-0.1,0.5-0.3c0.1,0,0.1-0.1,0.1-0.1
			c0.2-0.1,0.3-0.2,0.4-0.3c0,0,0,0,0.1,0l-0.1,0.2h0.1c0,0.1-0.1,0.1-0.1,0.1c0.1-0.1,0.3-0.2,0.4-0.3c-0.1,0-0.1,0.1-0.2,0.1
			c-0.1,0-0.1,0-0.1,0c0.1-0.1,0.3-0.2,0.5-0.3c0.1,0,0.1-0.1,0.1-0.1s0,0,0,0.1c0,0.1,0-0.1,0.1-0.1V10c0-0.1,0.1-0.1,0.2-0.1
			c0.1-0.1,0,0.1-0.1,0.1c0.1,0,0.1-0.1,0.1-0.1l0,0c0-0.1,0.1-0.1,0.1,0c0.1,0.1-0.1-0.1,0-0.1s0,0,0,0s0-0.1,0.1-0.1
			c0.1,0,0,0.1,0,0.1h0.1c0.1-0.1,0,0,0-0.1c0-0.1,0,0.1,0.1,0.1c0.1,0.1,0,0.1-0.1,0.1l0.1-0.1c0,0,0.1,0,0.1,0.1
			c0.1-0.1,0.3-0.1,0.4-0.2H7.6h0.1c0,0,0-0.1,0.1-0.1c0.1,0,0.1,0,0.2-0.1l0,0C8,9.6,8,9.5,8.1,9.5c0.1,0,0,0,0,0.1
			c0,0.1,0.1,0,0.1,0v0.1c0.1,0,0.1-0.1,0.1,0c0.1-0.1,0.2-0.1,0.3-0.2l0,0c0-0.1,0.2-0.1,0.2-0.1l0,0l0.1-0.1
			C8.8,9.2,8.9,9.2,9,9.2C9,9.1,9,9.1,9.2,9.1c0.4-0.1,0.8-0.3,1.1-0.5c0.1,0,0.1-0.1,0.2-0.1c-0.1,0-0.1,0-0.2,0.1
			c-0.1,0-0.1,0-0.1-0.1h0.1c-0.1,0.1-0.1,0-0.1,0.1V8.5c0,0-0.1,0-0.1,0v0.1c-0.1,0-0.1,0-0.1,0l0,0c0,0-0.2,0.1-0.1,0
			c0.1-0.1,0,0.1-0.1,0.1l0,0c-0.1,0-0.1,0.1-0.1,0.1V8.6c-0.2,0.1,0,0.1-0.2,0.2l0,0L9.2,8.9H9.2C9.1,8.9,8.9,8.9,8.8,9.1
			c-0.1,0.1-0.1,0-0.2,0.1l0,0c-0.1,0-0.3,0.1-0.4,0c-0.1-0.1,0,0,0,0C8.2,9.2,8.1,9.2,8.1,9.2c-0.1,0,0.1,0,0,0
			C8,9.2,8,9.3,7.9,9.3c0,0,0,0,0.1-0.1C7.8,9.3,7.7,9.4,7.5,9.5L6.9,9.7l0,0c-0.1,0-0.1,0.1-0.3,0.1L6.8,9.6z"/>
		<path id="_Yol_7" class="st0" d="M5.8,10.5L5.8,10.5L5.8,10.5C5.9,10.4,5.9,10.4,5.8,10.5z"/>
		<polygon id="_Yol_8" class="st0" points="5.8,10.3 5.8,10.4 5.9,10.3 		"/>
		<polygon id="_Yol_9" class="st0" points="6.9,9.9 6.9,9.9 6.7,10 		"/>
		<path id="_Yol_10" class="st0" d="M8.1,9.5C8.1,9.5,8,9.5,8.1,9.5L8.1,9.5L8.1,9.5z"/>
		<path id="_Yol_11" class="st0" d="M8.8,9.3C8.8,9.2,8.9,9.3,8.8,9.3C8.8,9.1,8.8,9.3,8.8,9.3z"/>
		<path id="_Yol_12" class="st0" d="M9,9.1C8.9,9.1,8.9,9.1,9,9.1C9,9.1,8.9,9.1,9,9.1z"/>
	</g>
	<g id="_Grup_3">
		<path id="_Yol_13" class="st0" d="M4.9,11.8L4.9,11.8L4.9,11.8L4.9,11.8z"/>
		<path id="_Yol_14" class="st0" d="M5,11.8L5,11.8L5,11.8C5,11.8,5,11.7,5,11.8C5,11.7,5,11.7,5,11.8z"/>
		<path id="_Yol_15" class="st0" d="M5.2,11.6C5.2,11.6,5.2,11.6,5.2,11.6C5.2,11.6,5.2,11.6,5.2,11.6z"/>
		<path id="_Yol_16" class="st0" d="M8.6,10L8.6,10C8.5,10,8.5,10.1,8.6,10z"/>
		<path id="_Yol_17" class="st0" d="M8.5,10L8.5,10z"/>
		<path id="_Yol_18" class="st0" d="M7.3,10.2c-0.1,0.1-0.1,0.1-0.1,0.1H7.1c-0.1,0.1,0,0.1-0.1,0.1c-0.1,0-0.1,0.1-0.2,0.1
			c0,0,0,0,0-0.1s-0.1,0.1-0.1,0.1l0,0c-0.2,0.1-0.5,0.3-0.7,0.5l0,0c-0.3,0.1-0.5,0.3-0.7,0.5c0.2-0.1,0.3-0.2,0.5-0.3
			c0.1,0,0.1-0.1,0.1-0.1c0.2-0.1,0.3-0.2,0.5-0.3c0,0,0,0,0.1,0l-0.1,0.1l0.1-0.1c0,0-0.1,0.1-0.1,0.1c0.1-0.1,0.3-0.2,0.4-0.3
			c-0.1,0-0.1,0.1-0.2,0.1c-0.1,0-0.1,0-0.1,0c0.1-0.1,0.3-0.2,0.5-0.3c0.1,0,0.1-0.1,0.1-0.1s0,0,0,0.1s0-0.1,0.1-0.1v0.1
			C7.1,10.3,7.3,10.3,7.3,10.2C7.4,10.1,7.3,10.3,7.3,10.2c0.1,0.1,0.1,0,0.1,0v0.1c0-0.1,0.1-0.1,0.1-0.1c0.1,0-0.1-0.1,0-0.1
			c0.1,0,0,0,0,0s0-0.1,0.1-0.1s0,0.1,0,0.1h0.1c0.1-0.1,0,0,0-0.1s0.1,0.1,0.1,0.1c-0.1,0.1-0.1,0.1-0.2,0.1l0.1-0.1
			c0,0,0.1,0,0.1,0.1c0.1-0.1,0.3-0.1,0.4-0.2H8.1h0.1c0,0,0-0.1,0.1-0.1s0.1,0,0.2-0.1l0,0c0.1,0,0.1-0.1,0.1-0.1c0.1,0,0,0,0,0.1
			c0,0.1,0.1,0,0.1,0V10c0.1,0,0.1-0.1,0.1,0C8.8,9.9,8.9,9.9,9,9.9l0,0C9,9.8,9.2,9.8,9.2,9.7l0,0l0.1-0.1c0.1-0.1,0.1-0.1,0.3-0.1
			c0-0.1,0.1-0.1,0.2-0.1c0.4-0.1,0.9-0.3,1.2-0.4C11,9.1,11,9,11.1,8.9c-0.1,0-0.1,0-0.2,0.1c-0.1,0-0.1,0-0.1-0.1h0.1
			c-0.1,0.1-0.1,0-0.1,0.1V8.9c0,0.1-0.1,0-0.1,0V9c-0.1,0-0.1,0-0.1,0l0,0c0,0-0.2,0.1-0.1,0l-0.1,0.1l0,0c-0.1,0-0.1,0.1-0.1,0.1
			s0,0,0.1-0.1c-0.2,0.1,0,0.1-0.2,0.2l0,0L9.9,9.3H9.8C9.8,9.4,9.6,9.4,9.4,9.5c-0.1,0.1-0.1,0-0.2,0.1l0,0c-0.1,0-0.3,0.1-0.4,0
			c-0.1-0.1,0,0,0,0C8.7,9.6,8.7,9.6,8.6,9.6c-0.1,0,0.1,0,0,0c-0.1,0-0.1,0.1-0.3,0.1c0,0,0,0,0.1-0.1C8.3,9.7,8.2,9.8,8.1,9.9
			C7.9,9.9,7.7,10,7.4,10.1l0,0c-0.1,0-0.2,0.1-0.3,0.1L7.3,10.2z"/>
		<path id="_Yol_19" class="st0" d="M6.3,11.1L6.3,11.1L6.3,11.1C6.3,11.1,6.3,11.1,6.3,11.1z"/>
		<path id="_Yol_20" class="st0" d="M6.3,11L6.3,11L6.3,11z"/>
		<polygon id="_Yol_21" class="st0" points="7.4,10.5 7.3,10.5 7.2,10.6 		"/>
		<path id="_Yol_22" class="st0" d="M8.6,10.1C8.6,10.1,8.5,10.1,8.6,10.1L8.6,10.1L8.6,10.1z"/>
		<path id="_Yol_23" class="st0" d="M9.4,9.9C9.4,9.8,9.4,9.9,9.4,9.9C9.3,9.7,9.4,9.9,9.4,9.9z"/>
		<path id="_Yol_24" class="st0" d="M9.5,9.7L9.5,9.7C9.5,9.8,9.5,9.7,9.5,9.7z"/>
	</g>
	<g id="_Grup_4">
		<path id="_Yol_25" class="st0" d="M5.6,12.4L5.6,12.4L5.6,12.4L5.6,12.4z"/>
		<path id="_Yol_26" class="st0" d="M5.7,12.3L5.7,12.3L5.7,12.3C5.7,12.3,5.7,12.2,5.7,12.3C5.6,12.2,5.7,12.2,5.7,12.3z"/>
		<path id="_Yol_27" class="st0" d="M5.8,12.2C5.9,12.2,5.8,12.1,5.8,12.2C5.8,12.1,5.8,12.2,5.8,12.2z"/>
		<path id="_Yol_28" class="st0" d="M8.9,10.8L8.9,10.8C8.8,10.8,8.8,10.8,8.9,10.8z"/>
		<path id="_Yol_29" class="st0" d="M8.8,10.8L8.8,10.8z"/>
		<path id="_Yol_30" class="st0" d="M7.7,10.9c-0.1,0-0.1,0.1-0.1,0.1H7.5c-0.1,0,0,0.1-0.1,0.1c-0.1,0-0.1,0.1-0.2,0.1
			c0,0,0,0,0-0.1c0-0.1,0,0.1-0.1,0.2l0,0c-0.2,0.1-0.5,0.3-0.7,0.4l0,0c-0.3,0.1-0.5,0.3-0.6,0.5C6.1,12,6.3,12,6.4,11.8
			c0.1,0,0.1-0.1,0.1-0.1c0.2-0.1,0.3-0.1,0.4-0.3c0,0,0,0,0.1,0l-0.1,0.1h0.1l-0.1,0.1c0.1-0.1,0.3-0.1,0.4-0.3
			c-0.1,0-0.1,0.1-0.2,0.1s-0.1,0-0.1,0c0.1-0.1,0.3-0.2,0.5-0.3c0.1,0,0.1-0.1,0.1,0c0.1,0.1,0,0,0,0.1c0,0.1,0-0.1,0.1-0.1v0.1
			c0-0.1,0.1-0.1,0.1-0.1s0,0.1-0.1,0.1c0.1,0,0.1-0.1,0.1-0.1v0c0-0.1,0.1,0,0.1,0c0.1,0-0.1,0,0-0.1c0.1-0.1,0,0,0,0
			s0-0.1,0.1-0.1c0,0,0,0,0,0.1H8c0.1-0.1,0,0,0-0.1s0.1,0.1,0.1,0.1s-0.1,0.1-0.1,0.1l0.1-0.1c0,0,0.1,0,0.1,0.1
			c0.1-0.1,0.3-0.1,0.3-0.2H8.4h0.1V11c0.1,0,0.1,0,0.2,0l0,0c0.1,0,0.1-0.1,0.1-0.1c0.1,0,0,0,0,0.1s0.1,0,0.1,0v0.1
			c0.1,0,0.1-0.1,0.1,0C9,11,9.1,10.9,9.2,10.9l0,0c0-0.1,0.1-0.1,0.2-0.1l0,0l0.1-0.1c0.1-0.1,0.1-0.1,0.2-0.1
			c0-0.1,0.1-0.1,0.1-0.1c0.3-0.1,0.7-0.3,1-0.5c0.1,0,0.1-0.1,0.1-0.1c-0.1,0-0.1,0.1-0.1,0.1c-0.1,0-0.1,0-0.1,0h0.1
			c-0.1,0.1-0.1,0-0.1,0.1V9.9c0,0.1-0.1,0.1-0.1,0.1V10c-0.1,0-0.1,0-0.1,0l0,0c0,0-0.2,0.1-0.1,0c0.1-0.1,0,0.1-0.1,0.1l0,0
			c-0.1,0-0.1,0.1-0.1,0.1v-0.1c-0.2,0.1,0,0.1-0.1,0.2l0,0v0.1H9.9c0,0.1-0.2,0.1-0.3,0.2c-0.1,0.1-0.1,0-0.2,0.1l0,0
			c-0.1,0-0.3,0.1-0.4,0c-0.1-0.1,0,0,0,0c-0.1,0.1-0.1,0.1-0.2,0.1c-0.1,0,0.1,0,0,0c-0.1,0-0.1,0.1-0.2,0.1c0,0,0,0,0.1-0.1
			c-0.1,0.1-0.3,0.1-0.4,0.2C8.2,10.8,8,10.9,7.7,10.9L7.7,10.9c0,0-0.1,0.1-0.2,0.1L7.7,10.9z"/>
		<path id="_Yol_31" class="st0" d="M6.8,11.7L6.8,11.7L6.8,11.7C6.9,11.6,6.9,11.7,6.8,11.7z"/>
		<path id="_Yol_32" class="st0" d="M6.8,11.6L6.8,11.6L6.8,11.6z"/>
		<polygon id="_Yol_33" class="st0" points="7.9,11.2 7.8,11.2 7.7,11.3 		"/>
		<path id="_Yol_34" class="st0" d="M8.9,10.9C8.9,10.9,8.8,10.9,8.9,10.9L8.9,10.9L8.9,10.9z"/>
		<path id="_Yol_35" class="st0" d="M9.6,10.7C9.6,10.6,9.7,10.7,9.6,10.7C9.6,10.5,9.6,10.6,9.6,10.7z"/>
		<path id="_Yol_36" class="st0" d="M9.8,10.5C9.7,10.5,9.7,10.5,9.8,10.5L9.8,10.5z"/>
	</g>
</g>
<path class="st1" d="M3.8,16.3L3.8,16.3L3.8,16.3z"/>
<polygon class="st0" points="7.8,5 7.8,1.2 3.8,0.3 3.8,5 "/>
<polygon class="st0" points="11.9,5 11.9,0.3 7.9,1.2 7.9,5 "/>
<polygon class="st0" points="15.1,5 13,3.3 12.1,0.7 12.1,5 "/>
<g>
	<polygon class="st0" points="0.3,5.3 1.3,10.3 2.5,7.3 1.7,5.3 	"/>
	<polygon class="st0" points="2.7,3.3 0.4,5.2 1.9,5.2 2.6,7.1 3.4,5 3.6,5 3.6,0.7 	"/>
</g>
<path class="st0" d="M3.8,15.8l-0.1-0.1l-2-1.8l0,0L1.2,11l0,0l2.4-5.8h12v0.1l-1.7,10.4h-10V15.8z M3.8,15.5h9.9l1.7-10.2H3.8
	L1.4,11l0.5,2.7L3.8,15.5z"/>
<path class="st0" d="M4,15.7H2.1l-0.4-2.1L4,15.7z M2.3,15.6h1.3L2,14.1L2.3,15.6z"/>
</svg>
