<?xml version="1.0" encoding="utf-8"?>
<!-- Generator: Adobe Illustrator 21.0.0, SVG Export Plug-In . SVG Version: 6.00 Build 0)  -->
<svg version="1.1" id="katman_1" xmlns="http://www.w3.org/2000/svg" xmlns:xlink="http://www.w3.org/1999/xlink" x="0px" y="0px"
	 viewBox="0 0 14.9 16" style="enable-background:new 0 0 14.9 16;" xml:space="preserve">
<style type="text/css">
	.st0{opacity:0.2;fill:#010101;enable-background:new    ;}
	.st1{fill:#7A3E1C;}
	.st2{fill:url(#SVGID_1_);}
	.st3{fill:url(#SVGID_2_);}
	.st4{fill:url(#SVGID_3_);}
	.st5{opacity:0.1;fill:#010101;enable-background:new    ;}
	.st6{opacity:0.1;fill:#FFFFFF;enable-background:new    ;}
	.st7{opacity:0.5;fill:#20396E;enable-background:new    ;}
	.st8{fill:url(#SVGID_4_);}
</style>
<title>folder-new_5</title>
<polygon class="st0" points="13.7,12.9 14.9,10.9 14.6,10.9 13.7,12.4 "/>
<path class="st1" d="M14.8,1.4c0-0.2-0.1-0.4-0.3-0.4c0,0,0,0,0,0H9V0.4C9,0.2,8.8,0,8.6,0h-4C4.4,0,4.3,0.2,4.3,0.4c0,0,0,0,0,0V1
	h-1C3.1,1,2.9,1.2,2.9,1.4v0v1.2L2.6,2.4C2.2,2.3,1.8,2.1,1.4,2.1c-0.3,0-0.8,0.5-1,0.7C0.2,3,0.1,3.2,0,3.5
	c-0.1,0.3,0.3,1.1,0.5,1.4l0.3,0.4L0.1,6.4c0,0.1-0.1,0.1-0.1,0.2v2.6c0,0.1,0,0.2,0.1,0.2l1.4,1.4l0.7,1.5c0.1,0.1,0.2,0.2,0.3,0.2
	h11h0.1l1-1.6v-0.1L14.8,1.4z"/>
<linearGradient id="SVGID_1_" gradientUnits="userSpaceOnUse" x1="8.895" y1="4.87" x2="8.895" y2="16.32" gradientTransform="matrix(1 0 0 -1 0 15.73)">
	<stop  offset="0" style="stop-color:#7A3E1C;stop-opacity:0.8"/>
	<stop  offset="1" style="stop-color:#C96F29"/>
</linearGradient>
<path class="st2" d="M8.9,1.1V0.4c0-0.1-0.1-0.2-0.2-0.2h-4c-0.1,0-0.2,0.1-0.2,0.2v0.7c0,0,0,0.1-0.1,0.1h-1
	c-0.1,0-0.2,0.1-0.2,0.2v9.5h11.6V1.4c0-0.1-0.1-0.2-0.2-0.2L8.9,1.1C8.9,1.1,8.9,1.1,8.9,1.1z"/>
<linearGradient id="SVGID_2_" gradientUnits="userSpaceOnUse" x1="15.3296" y1="3.0295" x2="13.5896" y2="4.6195" gradientTransform="matrix(1 0 0 -1 0 15.73)">
	<stop  offset="0" style="stop-color:#C96F29"/>
	<stop  offset="1" style="stop-color:#7A3E1C;stop-opacity:0.8"/>
</linearGradient>
<polygon class="st3" points="13.7,12.5 14.7,10.9 13.1,10.9 "/>
<linearGradient id="SVGID_3_" gradientUnits="userSpaceOnUse" x1="6.895" y1="3.38" x2="6.895" y2="13.56" gradientTransform="matrix(1 0 0 -1 0 15.73)">
	<stop  offset="0" style="stop-color:#DD932D"/>
	<stop  offset="6.000000e-02" style="stop-color:#FAAE42"/>
	<stop  offset="7.000000e-02" style="stop-color:#F9B045"/>
	<stop  offset="0.14" style="stop-color:#F8C863"/>
	<stop  offset="0.22" style="stop-color:#F8D87A"/>
	<stop  offset="0.3" style="stop-color:#F7E58B"/>
	<stop  offset="0.39" style="stop-color:#F7ED96"/>
	<stop  offset="0.5" style="stop-color:#F7F199"/>
	<stop  offset="1" style="stop-color:#FEDEB1"/>
</linearGradient>
<path class="st4" d="M13.4,2H4.5C4.2,2.3,4,2.6,3.7,3H3.6L2.8,2.7L2.5,2.5C2.2,2.4,1.8,2.2,1.4,2.2c-0.2,0-0.7,0.4-0.9,0.6
	C0.4,3,0.2,3.3,0.1,3.5C0.2,4,0.4,4.4,0.6,4.8l0.3,0.4L0.2,6.5c0,0,0,0.1,0,0.1v2.6c0,0.1,0,0.1,0.1,0.2l1.4,1.4l0,0l0.7,1.5
	c0,0.1,0.1,0.1,0.2,0.1h11.1V2.2C13.7,2.1,13.5,2,13.4,2z"/>
<path class="st5" d="M13.8,1.6H4.9C4.8,1.7,4.7,1.9,4.6,2h8.9c0.1,0,0.2,0.1,0.2,0.2v10.2l0.4-0.6v-10C14.1,1.7,13.9,1.6,13.8,1.6
	C13.8,1.6,13.8,1.6,13.8,1.6z"/>
<path class="st6" d="M4.7,0.6h4c0.1,0,0.2,0.1,0.2,0.2V0.4c0-0.1-0.1-0.3-0.2-0.3c0,0,0,0,0,0h-4c-0.1,0-0.2,0.1-0.2,0.2v0.5
	C4.4,0.7,4.5,0.6,4.7,0.6z"/>
<path class="st6" d="M3.3,1.6h1c0,0,0.1,0,0.1-0.1V1.1c0,0,0,0.1-0.1,0.1h-1c-0.1,0-0.2,0.1-0.2,0.2v0.5C3.1,1.7,3.2,1.6,3.3,1.6z"
	/>
<path class="st6" d="M14.4,1.1H8.9c0,0-0.1,0-0.1-0.1c0,0,0,0,0,0v0.5c0,0,0,0.1,0.1,0.1l0,0h5.5c0.1,0,0.2,0.1,0.2,0.2V1.4
	C14.7,1.2,14.6,1.1,14.4,1.1z"/>
<path class="st6" d="M13.4,2H4.5C4.2,2.3,4,2.6,3.7,3H3.6L2.8,2.7L2.5,2.5C2.2,2.4,1.8,2.2,1.4,2.2c-0.2,0-0.7,0.4-0.9,0.6
	C0.4,3,0.2,3.3,0.1,3.5c0,0.1,0,0.2,0,0.3c0.1-0.2,0.2-0.4,0.4-0.6c0.2-0.2,0.7-0.7,0.9-0.6C1.8,2.7,2.2,2.8,2.5,3l0.3,0.1l0.8,0.3
	h0.1c0.2-0.4,0.5-0.7,0.8-1h8.9c0.1,0,0.2,0.1,0.2,0.2V2.2C13.6,2.1,13.5,2,13.4,2z"/>
<path class="st0" d="M2.3,12.3l-0.7-1.5l0,0L0.3,9.4c0,0-0.1-0.1-0.1-0.2v0.5c0,0.1,0,0.1,0.1,0.2l1.4,1.4l0,0l0.7,1.5
	c0,0.1,0.1,0.1,0.2,0.1h11.1v-0.5H2.6C2.5,12.4,2.4,12.4,2.3,12.3z"/>
<path class="st7" d="M9.3,15.6c-0.3,0-0.6-0.2-0.6-0.5c0,0,0,0,0-0.1v-2.4H6.3c-0.3,0-0.6-0.2-0.6-0.6l0,0V10c0-0.3,0.2-0.6,0.5-0.6
	h0h2.4V7.1c0-0.3,0.2-0.6,0.6-0.6l0,0h2c0.3,0,0.6,0.2,0.6,0.5v0v2.4h2.4c0.3,0,0.6,0.2,0.6,0.6l0,0v2c0,0.3-0.2,0.6-0.6,0.6l0,0
	h-2.4V15c0,0.3-0.2,0.6-0.6,0.6l0,0L9.3,15.6z"/>
<linearGradient id="SVGID_4_" gradientUnits="userSpaceOnUse" x1="10.255" y1="-3.04" x2="10.255" y2="8.07" gradientTransform="matrix(1 0 0 -1 0 15.73)">
	<stop  offset="0.16" style="stop-color:#41A4DC"/>
	<stop  offset="0.65" style="stop-color:#42B4E7"/>
	<stop  offset="1" style="stop-color:#A7DEEF"/>
</linearGradient>
<path class="st8" d="M14.3,9.6h-2.5V7.1c0-0.3-0.2-0.5-0.5-0.5h-2C9,6.6,8.8,6.8,8.8,7.1v2.5H6.3C6,9.6,5.8,9.8,5.8,10v2
	c0,0.3,0.2,0.5,0.5,0.5h2.5V15c0,0.3,0.2,0.5,0.5,0.5h2c0.3,0,0.5-0.2,0.5-0.5v-2.4h2.5c0.3,0,0.5-0.2,0.5-0.5V10
	C14.7,9.8,14.5,9.6,14.3,9.6z"/>
<path class="st6" d="M9.3,7h2c0.3,0,0.5,0.2,0.5,0.5V7.1c0-0.3-0.2-0.5-0.5-0.5h-2C9,6.6,8.8,6.8,8.8,7.1v0.5C8.7,7.3,8.9,7,9.3,7
	C9.2,7,9.2,7,9.3,7z"/>
<path class="st6" d="M6.3,10h2.5V9.6H6.3C6,9.6,5.8,9.8,5.8,10v0.5C5.8,10.2,6,10,6.3,10C6.3,10,6.3,10,6.3,10z"/>
<path class="st6" d="M14.3,9.6h-2.5V10h2.5c0.3,0,0.5,0.2,0.5,0.5V10C14.7,9.7,14.5,9.5,14.3,9.6z"/>
<path class="st0" d="M8.8,12.6H6.3c-0.3,0-0.5-0.2-0.5-0.5v0.5C5.8,12.8,6,13,6.3,13h2.5V12.6z"/>
<path class="st0" d="M11.3,15.5h-2c-0.3,0-0.5-0.2-0.5-0.5c0,0,0,0,0-0.1v0.5C8.8,15.7,9,16,9.3,16h2c0.3,0,0.5-0.2,0.5-0.5V15
	C11.8,15.3,11.6,15.5,11.3,15.5C11.3,15.5,11.3,15.5,11.3,15.5z"/>
<path class="st0" d="M14.3,12.6h-2.5V13h2.5c0.3,0,0.5-0.2,0.5-0.5V12C14.8,12.3,14.6,12.5,14.3,12.6C14.3,12.6,14.3,12.6,14.3,12.6
	z"/>
</svg>
