<?xml version="1.0" encoding="utf-8"?>
<!-- Generator: Adobe Illustrator 21.0.0, SVG Export Plug-In . SVG Version: 6.00 Build 0)  -->
<svg version="1.1" id="katman_1" xmlns="http://www.w3.org/2000/svg" xmlns:xlink="http://www.w3.org/1999/xlink" x="0px" y="0px"
	 viewBox="0 0 64 63.2" style="enable-background:new 0 0 64 63.2;" xml:space="preserve">
<style type="text/css">
	.st0{opacity:0.7;fill:#1A1A1A;enable-background:new    ;}
	.st1{fill:url(#SVGID_1_);}
	.st2{opacity:0.5;}
	.st3{fill:url(#SVGID_2_);}
	.st4{fill:url(#SVGID_3_);}
	.st5{fill:url(#SVGID_4_);}
	.st6{fill:url(#SVGID_5_);}
	.st7{fill:url(#SVGID_6_);}
	.st8{fill:url(#SVGID_7_);}
	.st9{fill:url(#SVGID_8_);}
	.st10{fill:url(#SVGID_9_);}
	.st11{fill:url(#SVGID_10_);}
	.st12{fill:url(#SVGID_11_);}
	.st13{fill:url(#SVGID_12_);}
	.st14{opacity:0.2;enable-background:new    ;}
	.st15{opacity:0.1;fill:#FFFFFF;enable-background:new    ;}
</style>
<title>network-server</title>
<path class="st0" d="M3.3,40.5h57.4c1.8,0,3.3,1.5,3.3,3.3v14.6c0,1.8-1.5,3.3-3.3,3.3H3.3c-1.8,0-3.3-1.5-3.3-3.3V43.8
	C0,42,1.5,40.5,3.3,40.5z"/>
<linearGradient id="SVGID_1_" gradientUnits="userSpaceOnUse" x1="32" y1="4.93" x2="32" y2="25.46" gradientTransform="matrix(1 0 0 -1 0 66)">
	<stop  offset="0" style="stop-color:#A3A4A4"/>
	<stop  offset="0.39" style="stop-color:#C3C4C4"/>
	<stop  offset="0.77" style="stop-color:#DDDDDD"/>
	<stop  offset="1" style="stop-color:#E7E6E6"/>
</linearGradient>
<path class="st1" d="M3.3,41h57.4c1.6,0,2.8,1.3,2.8,2.8v14.6c0,1.6-1.3,2.8-2.8,2.8H3.3c-1.6,0-2.8-1.3-2.8-2.8V43.8
	C0.5,42.3,1.7,41,3.3,41z"/>
<g class="st2">
	<path d="M18.5,56c-0.8,0-1.5-0.7-1.5-1.5c0-0.3,0.1-0.6,0.2-0.8l4.5-6.8c0.5-0.7,1.4-0.8,2.1-0.3c0.6,0.5,0.8,1.3,0.4,2l-4.5,6.8
		C19.5,55.8,19,56,18.5,56z"/>
</g>
<g class="st2">
	<path d="M11.7,56c-0.8,0-1.5-0.7-1.5-1.5c0-0.3,0.1-0.6,0.2-0.8l4.5-6.8c0.5-0.7,1.4-0.8,2.1-0.3c0.6,0.5,0.8,1.3,0.4,2L13,55.3
		C12.7,55.7,12.2,56,11.7,56z"/>
</g>
<g class="st2">
	<path d="M5,56c-0.8,0-1.5-0.7-1.5-1.5c0-0.3,0.1-0.6,0.2-0.8L8.3,47c0.5-0.7,1.4-0.8,2.1-0.3c0.6,0.5,0.8,1.3,0.4,2l-4.5,6.8
		C6,55.8,5.5,56,5,56z"/>
</g>
<g class="st2">
	<path d="M25.2,56c-0.8,0-1.5-0.6-1.5-1.5c0-0.3,0.1-0.6,0.3-0.9l4.5-6.8c0.5-0.7,1.4-0.9,2.1-0.4c0.7,0.5,0.9,1.4,0.4,2.1l0,0
		l-4.5,6.8C26.2,55.7,25.8,56,25.2,56z"/>
</g>
<radialGradient id="SVGID_2_" cx="41.56" cy="18.81" r="2.81" gradientTransform="matrix(1 0 0 -1 0 66)" gradientUnits="userSpaceOnUse">
	<stop  offset="0" style="stop-color:#6FC379"/>
	<stop  offset="0.23" style="stop-color:#6BC175"/>
	<stop  offset="0.47" style="stop-color:#5EBC6A"/>
	<stop  offset="0.71" style="stop-color:#49B456"/>
	<stop  offset="0.96" style="stop-color:#2CA93C"/>
	<stop  offset="1" style="stop-color:#27A737"/>
</radialGradient>
<circle class="st3" cx="41.6" cy="47.2" r="2.8"/>
<radialGradient id="SVGID_3_" cx="49.44" cy="18.81" r="2.81" gradientTransform="matrix(1 0 0 -1 0 66)" gradientUnits="userSpaceOnUse">
	<stop  offset="0" style="stop-color:#FCE182"/>
	<stop  offset="0.15" style="stop-color:#FCE07D"/>
	<stop  offset="0.33" style="stop-color:#FCDD6E"/>
	<stop  offset="0.53" style="stop-color:#FDD856"/>
	<stop  offset="0.74" style="stop-color:#FDD235"/>
	<stop  offset="0.96" style="stop-color:#FEC90A"/>
	<stop  offset="1" style="stop-color:#FEC700"/>
</radialGradient>
<circle class="st4" cx="49.4" cy="47.2" r="2.8"/>
<radialGradient id="SVGID_4_" cx="57.32" cy="18.81" r="2.81" gradientTransform="matrix(1 0 0 -1 0 66)" gradientUnits="userSpaceOnUse">
	<stop  offset="0" style="stop-color:#EE8961"/>
	<stop  offset="0.28" style="stop-color:#EE875E"/>
	<stop  offset="0.49" style="stop-color:#ED8055"/>
	<stop  offset="0.67" style="stop-color:#EC7545"/>
	<stop  offset="0.83" style="stop-color:#EA652F"/>
	<stop  offset="0.99" style="stop-color:#E85012"/>
	<stop  offset="1" style="stop-color:#E84E0F"/>
</radialGradient>
<circle class="st5" cx="57.3" cy="47.2" r="2.8"/>
<path class="st0" d="M3.3,20.2h57.4c1.8,0,3.3,1.5,3.3,3.3v14.6c0,1.8-1.5,3.3-3.3,3.3H3.3C1.5,41.5,0,40,0,38.2V23.6
	C0,21.7,1.5,20.2,3.3,20.2z"/>
<linearGradient id="SVGID_5_" gradientUnits="userSpaceOnUse" x1="32" y1="25.44" x2="32" y2="45.54" gradientTransform="matrix(1 0 0 -1 0 66)">
	<stop  offset="0" style="stop-color:#A3A4A4"/>
	<stop  offset="0.39" style="stop-color:#C3C4C4"/>
	<stop  offset="0.77" style="stop-color:#DDDDDD"/>
	<stop  offset="1" style="stop-color:#E7E6E6"/>
</linearGradient>
<path class="st6" d="M3.3,20.8h57.4c1.6,0,2.8,1.3,2.8,2.8v14.6c0,1.6-1.3,2.8-2.8,2.8H3.3c-1.6,0-2.8-1.3-2.8-2.8V23.6
	C0.5,22,1.7,20.8,3.3,20.8z"/>
<g class="st2">
	<path d="M18.5,35.7c-0.8,0-1.5-0.7-1.5-1.5c0-0.3,0.1-0.6,0.2-0.8l4.5-6.8c0.5-0.7,1.4-0.8,2.1-0.3c0.6,0.5,0.8,1.3,0.4,2l-4.5,6.8
		C19.5,35.5,19,35.7,18.5,35.7z"/>
</g>
<g class="st2">
	<path d="M11.7,35.7c-0.8,0-1.5-0.7-1.5-1.5c0-0.3,0.1-0.6,0.2-0.8l4.5-6.8c0.5-0.7,1.4-0.8,2.1-0.3c0.6,0.5,0.8,1.3,0.4,2L13,35.1
		C12.7,35.5,12.2,35.7,11.7,35.7z"/>
</g>
<g class="st2">
	<path d="M5,35.7c-0.8,0-1.5-0.7-1.5-1.5c0-0.3,0.1-0.6,0.2-0.8l4.5-6.8c0.5-0.7,1.4-0.8,2.1-0.3c0.6,0.5,0.8,1.3,0.4,2l-4.5,6.8
		C6,35.5,5.5,35.7,5,35.7z"/>
</g>
<g class="st2">
	<path d="M25.2,35.7c-0.8,0-1.5-0.6-1.5-1.5c0-0.3,0.1-0.6,0.2-0.8l4.5-6.8c0.5-0.7,1.4-0.9,2.1-0.4s0.9,1.4,0.4,2.1l-4.5,6.8
		C26.2,35.5,25.8,35.7,25.2,35.7z"/>
</g>
<radialGradient id="SVGID_6_" cx="41.56" cy="39.06" r="2.81" gradientTransform="matrix(1 0 0 -1 0 66)" gradientUnits="userSpaceOnUse">
	<stop  offset="0" style="stop-color:#6FC379"/>
	<stop  offset="0.23" style="stop-color:#6BC175"/>
	<stop  offset="0.47" style="stop-color:#5EBC6A"/>
	<stop  offset="0.71" style="stop-color:#49B456"/>
	<stop  offset="0.96" style="stop-color:#2CA93C"/>
	<stop  offset="1" style="stop-color:#27A737"/>
</radialGradient>
<circle class="st7" cx="41.6" cy="26.9" r="2.8"/>
<radialGradient id="SVGID_7_" cx="49.44" cy="39.06" r="2.81" gradientTransform="matrix(1 0 0 -1 0 66)" gradientUnits="userSpaceOnUse">
	<stop  offset="0" style="stop-color:#FCE182"/>
	<stop  offset="0.15" style="stop-color:#FCE07D"/>
	<stop  offset="0.33" style="stop-color:#FCDD6E"/>
	<stop  offset="0.53" style="stop-color:#FDD856"/>
	<stop  offset="0.74" style="stop-color:#FDD235"/>
	<stop  offset="0.96" style="stop-color:#FEC90A"/>
	<stop  offset="1" style="stop-color:#FEC700"/>
</radialGradient>
<circle class="st8" cx="49.4" cy="26.9" r="2.8"/>
<radialGradient id="SVGID_8_" cx="57.32" cy="39.06" r="2.81" gradientTransform="matrix(1 0 0 -1 0 66)" gradientUnits="userSpaceOnUse">
	<stop  offset="0" style="stop-color:#EE8961"/>
	<stop  offset="0.28" style="stop-color:#EE875E"/>
	<stop  offset="0.49" style="stop-color:#ED8055"/>
	<stop  offset="0.67" style="stop-color:#EC7545"/>
	<stop  offset="0.83" style="stop-color:#EA652F"/>
	<stop  offset="0.99" style="stop-color:#E85012"/>
	<stop  offset="1" style="stop-color:#E84E0F"/>
</radialGradient>
<circle class="st9" cx="57.3" cy="26.9" r="2.8"/>
<path class="st0" d="M3.3,0h57.4C62.5,0,64,1.5,64,3.3v14.6c0,1.8-1.5,3.3-3.3,3.3H3.3c-1.8,0-3.3-1.5-3.3-3.3V3.3
	C0,1.5,1.5,0,3.3,0z"/>
<linearGradient id="SVGID_9_" gradientUnits="userSpaceOnUse" x1="32" y1="45.3" x2="32" y2="67.54" gradientTransform="matrix(1 0 0 -1 0 66)">
	<stop  offset="0" style="stop-color:#A3A4A4"/>
	<stop  offset="0.39" style="stop-color:#C3C4C4"/>
	<stop  offset="0.77" style="stop-color:#DDDDDD"/>
	<stop  offset="1" style="stop-color:#E7E6E6"/>
</linearGradient>
<path class="st10" d="M3.3,0.5h57.4c1.6,0,2.8,1.3,2.8,2.8v14.6c0,1.6-1.3,2.8-2.8,2.8H3.3c-1.6,0-2.8-1.3-2.8-2.8V3.3
	C0.5,1.7,1.7,0.5,3.3,0.5z"/>
<g class="st2">
	<path d="M18.5,15.5c-0.8,0-1.5-0.7-1.5-1.5c0-0.3,0.1-0.6,0.2-0.8l4.5-6.8c0.5-0.7,1.4-0.8,2.1-0.3c0.6,0.5,0.8,1.3,0.4,2l-4.5,6.8
		C19.5,15.2,19,15.5,18.5,15.5z"/>
</g>
<g class="st2">
	<path d="M11.7,15.5c-0.8,0-1.5-0.7-1.5-1.5c0-0.3,0.1-0.6,0.2-0.8L15,6.4c0.4-0.7,1.3-0.9,2-0.5c0.7,0.4,0.9,1.3,0.5,2
		c0,0-0.1,0.1-0.1,0.1L13,14.8C12.7,15.2,12.2,15.5,11.7,15.5z"/>
</g>
<g class="st2">
	<path d="M5,15.5c-0.8,0-1.5-0.7-1.5-1.5c0-0.3,0.1-0.6,0.2-0.8l4.5-6.8c0.4-0.7,1.3-0.9,2-0.5c0.7,0.4,0.9,1.3,0.5,2
		c0,0-0.1,0.1-0.1,0.1l-4.5,6.8C6,15.2,5.5,15.5,5,15.5z"/>
</g>
<g class="st2">
	<path d="M25.2,15.5c-0.8,0-1.5-0.7-1.5-1.5c0-0.3,0.1-0.6,0.2-0.8l4.5-6.8C29,5.7,29.9,5.5,30.6,6c0.7,0.5,0.9,1.4,0.4,2.1
		l-4.5,6.8C26.2,15.2,25.8,15.5,25.2,15.5z"/>
</g>
<radialGradient id="SVGID_10_" cx="40.44" cy="59.32" r="2.81" gradientTransform="matrix(1 0 0 -1 0 66)" gradientUnits="userSpaceOnUse">
	<stop  offset="0" style="stop-color:#6FC379"/>
	<stop  offset="0.23" style="stop-color:#6BC175"/>
	<stop  offset="0.47" style="stop-color:#5EBC6A"/>
	<stop  offset="0.71" style="stop-color:#49B456"/>
	<stop  offset="0.96" style="stop-color:#2CA93C"/>
	<stop  offset="1" style="stop-color:#27A737"/>
</radialGradient>
<circle class="st11" cx="40.4" cy="6.7" r="2.8"/>
<radialGradient id="SVGID_11_" cx="49.44" cy="59.32" r="2.81" gradientTransform="matrix(1 0 0 -1 0 66)" gradientUnits="userSpaceOnUse">
	<stop  offset="0" style="stop-color:#FCE182"/>
	<stop  offset="0.15" style="stop-color:#FCE07D"/>
	<stop  offset="0.33" style="stop-color:#FCDD6E"/>
	<stop  offset="0.53" style="stop-color:#FDD856"/>
	<stop  offset="0.74" style="stop-color:#FDD235"/>
	<stop  offset="0.96" style="stop-color:#FEC90A"/>
	<stop  offset="1" style="stop-color:#FEC700"/>
</radialGradient>
<circle class="st12" cx="49.4" cy="6.7" r="2.8"/>
<radialGradient id="SVGID_12_" cx="57.32" cy="59.32" r="2.81" gradientTransform="matrix(1 0 0 -1 0 66)" gradientUnits="userSpaceOnUse">
	<stop  offset="0" style="stop-color:#EE8961"/>
	<stop  offset="0.28" style="stop-color:#EE875E"/>
	<stop  offset="0.49" style="stop-color:#ED8055"/>
	<stop  offset="0.67" style="stop-color:#EC7545"/>
	<stop  offset="0.83" style="stop-color:#EA652F"/>
	<stop  offset="0.99" style="stop-color:#E85012"/>
	<stop  offset="1" style="stop-color:#E84E0F"/>
</radialGradient>
<circle class="st13" cx="57.3" cy="6.7" r="2.8"/>
<path class="st14" d="M60.7,61.3H3.3c-1.6,0-2.8-1.2-2.8-2.8c0,0,0,0,0,0v2c0,1.6,1.3,2.8,2.8,2.8c0,0,0,0,0,0h57.4
	c1.6,0,2.8-1.3,2.8-2.8v0v-2C63.5,60,62.3,61.3,60.7,61.3C60.7,61.3,60.7,61.3,60.7,61.3z"/>
<path class="st15" d="M23.8,48.5c0.1,0.1,0.2,0.2,0.3,0.3l0.1-0.2c0.4-0.7,0.2-1.6-0.5-2c-0.7-0.4-1.5-0.2-2,0.4l-4.5,6.8
	c-0.4,0.6-0.3,1.3,0.1,1.8l4.4-6.6C22.2,48.2,23.1,48,23.8,48.5z"/>
<path class="st15" d="M17.1,48.5c0.1,0.1,0.2,0.2,0.3,0.3l0.1-0.2c0.5-0.7,0.3-1.6-0.4-2.1c-0.7-0.5-1.6-0.3-2.1,0.4l0,0l-4.5,6.8
	c-0.4,0.6-0.3,1.3,0.1,1.8l4.4-6.6C15.4,48.2,16.4,48,17.1,48.5C17.1,48.5,17.1,48.5,17.1,48.5z"/>
<path class="st15" d="M10.3,48.5c0.1,0.1,0.2,0.2,0.3,0.3l0.1-0.2c0.4-0.7,0.2-1.6-0.5-2c-0.7-0.4-1.5-0.2-2,0.4l-4.5,6.8
	c-0.4,0.6-0.3,1.3,0.1,1.8l4.4-6.6C8.7,48.2,9.6,48,10.3,48.5z"/>
<path class="st15" d="M30.6,48.5c0.1,0.1,0.2,0.2,0.3,0.3l0.1-0.2c0.4-0.7,0.2-1.6-0.5-2c-0.7-0.4-1.5-0.2-2,0.4L24,53.7
	c-0.4,0.6-0.3,1.3,0.1,1.8l4.4-6.6C28.9,48.2,29.9,48,30.6,48.5C30.6,48.5,30.6,48.5,30.6,48.5z"/>
<path class="st14" d="M24.1,48.8l-4.4,6.6c-0.4,0.7-1.3,0.9-2,0.4c-0.1-0.1-0.2-0.2-0.3-0.3l-0.1,0.2c-0.5,0.7-0.3,1.6,0.3,2.1
	c0.7,0.5,1.6,0.3,2.1-0.3c0,0,0.1-0.1,0.1-0.1l4.5-6.8C24.6,50,24.6,49.3,24.1,48.8z"/>
<path class="st14" d="M17.4,48.8L13,55.3c-0.4,0.7-1.3,0.9-2,0.4c-0.1-0.1-0.2-0.2-0.3-0.3l-0.1,0.2c-0.5,0.7-0.3,1.6,0.3,2.1
	c0.7,0.5,1.6,0.3,2.1-0.3c0,0,0.1-0.1,0.1-0.1l4.5-6.8C17.9,50,17.8,49.2,17.4,48.8z"/>
<path class="st14" d="M10.6,48.8l-4.4,6.6c-0.4,0.7-1.3,0.9-2,0.4c-0.1-0.1-0.2-0.2-0.3-0.3l-0.1,0.2c-0.5,0.7-0.3,1.6,0.3,2.1
	s1.6,0.3,2.1-0.3c0,0,0.1-0.1,0.1-0.1l4.5-6.8C11.1,50,11,49.3,10.6,48.8z"/>
<path class="st14" d="M26.5,55.3c-0.4,0.7-1.3,0.9-2,0.4c-0.1-0.1-0.2-0.2-0.3-0.3L24,55.7c-0.5,0.7-0.3,1.6,0.3,2.1
	c0.7,0.5,1.6,0.3,2.1-0.3c0,0,0.1-0.1,0.1-0.1l4.5-6.8c0.4-0.6,0.3-1.3-0.1-1.8L26.5,55.3z"/>
<path class="st15" d="M41.6,46.3c1.2,0,2.2,0.7,2.6,1.8c0.6-1.4-0.2-3.1-1.6-3.6c-1.4-0.6-3.1,0.2-3.6,1.6c-0.2,0.6-0.2,1.4,0,2
	C39.3,47.1,40.4,46.4,41.6,46.3z"/>
<path class="st14" d="M41.6,50c-1.2,0-2.2-0.7-2.6-1.8c-0.6,1.4,0.2,3.1,1.6,3.6c1.4,0.6,3.1-0.2,3.6-1.6c0.2-0.6,0.2-1.4,0-2
	C43.8,49.3,42.7,50,41.6,50z"/>
<path class="st15" d="M49.4,46.3c1.2,0,2.2,0.7,2.6,1.8c0.6-1.4-0.2-3.1-1.6-3.6c-1.4-0.6-3.1,0.2-3.6,1.6c-0.2,0.6-0.2,1.4,0,2
	C47.2,47.1,48.3,46.4,49.4,46.3z"/>
<path class="st14" d="M49.4,50c-1.2,0-2.2-0.7-2.6-1.8c-0.6,1.4,0.2,3.1,1.6,3.6c1.4,0.6,3.1-0.2,3.6-1.6c0.2-0.6,0.2-1.4,0-2
	C51.7,49.3,50.6,50,49.4,50z"/>
<path class="st15" d="M57.3,46.3c1.2,0,2.2,0.7,2.6,1.8c0.6-1.4-0.2-3.1-1.6-3.6c-1.4-0.6-3.1,0.2-3.6,1.6c-0.2,0.6-0.2,1.4,0,2
	C55.1,47.1,56.2,46.4,57.3,46.3z"/>
<path class="st14" d="M57.3,50c-1.2,0-2.2-0.7-2.6-1.8c-0.6,1.4,0.2,3.1,1.6,3.6c1.4,0.6,3.1-0.2,3.6-1.6c0.2-0.6,0.2-1.4,0-2
	C59.5,49.3,58.5,50,57.3,50z"/>
<path class="st14" d="M60.7,41H3.3c-1.6,0-2.8-1.2-2.8-2.8c0,0,0,0,0,0v2c0,1.6,1.3,2.8,2.8,2.8c0,0,0,0,0,0h57.4
	c1.6,0,2.8-1.3,2.8-2.8v0v-2C63.5,39.7,62.2,41,60.7,41L60.7,41z"/>
<path class="st15" d="M23.8,28.2c0.1,0.1,0.2,0.2,0.3,0.3l0.1-0.2c0.4-0.7,0.2-1.6-0.5-2c-0.7-0.4-1.5-0.2-2,0.4l-4.5,6.8
	c-0.4,0.6-0.3,1.3,0.1,1.8l4.4-6.6C22.2,28,23.1,27.8,23.8,28.2z"/>
<path class="st15" d="M17.1,28.2c0.1,0.1,0.2,0.2,0.3,0.3l0.1-0.2c0.5-0.7,0.3-1.6-0.4-2.1c-0.7-0.5-1.6-0.3-2.1,0.4l0,0l-4.5,6.8
	c-0.4,0.6-0.3,1.3,0.1,1.8l4.4-6.6C15.4,28,16.4,27.8,17.1,28.2C17.1,28.2,17.1,28.2,17.1,28.2z"/>
<path class="st15" d="M10.3,28.2c0.1,0.1,0.2,0.2,0.3,0.3l0.1-0.2c0.4-0.7,0.2-1.6-0.5-2c-0.7-0.4-1.5-0.2-2,0.4l-4.5,6.8
	c-0.4,0.6-0.3,1.3,0.1,1.8l4.4-6.6C8.7,28,9.6,27.8,10.3,28.2z"/>
<path class="st15" d="M30.6,28.2c0.1,0.1,0.2,0.2,0.3,0.3l0.1-0.2c0.4-0.7,0.2-1.6-0.5-2c-0.7-0.4-1.5-0.2-2,0.4L24,33.4
	c-0.4,0.6-0.3,1.3,0.1,1.8l4.4-6.6C28.9,28,29.9,27.8,30.6,28.2C30.6,28.2,30.6,28.2,30.6,28.2z"/>
<path class="st14" d="M24.1,28.5l-4.4,6.6c-0.4,0.7-1.3,0.9-2,0.4c-0.1-0.1-0.2-0.2-0.3-0.3l-0.1,0.2c-0.5,0.6-0.5,1.6,0.2,2.1
	s1.6,0.5,2.1-0.2c0.1-0.1,0.2-0.2,0.2-0.3l4.5-6.8C24.6,29.7,24.5,29,24.1,28.5z"/>
<path class="st14" d="M17.4,28.5L13,35.1c-0.4,0.7-1.3,0.9-2,0.4c-0.1-0.1-0.2-0.2-0.3-0.3l-0.1,0.2C10,36,10.1,37,10.7,37.5
	s1.6,0.5,2.1-0.2c0.1-0.1,0.2-0.2,0.2-0.3l4.5-6.8C17.8,29.7,17.8,29,17.4,28.5z"/>
<path class="st14" d="M10.6,28.5l-4.4,6.6c-0.4,0.7-1.3,0.9-2,0.4c-0.1-0.1-0.2-0.2-0.3-0.3l-0.1,0.2C3.2,36,3.3,37,3.9,37.5
	C4.5,38,5.5,37.9,6,37.3c0.1-0.1,0.2-0.2,0.2-0.3l4.5-6.8C11.1,29.7,11,29,10.6,28.5z"/>
<path class="st14" d="M26.5,35.1c-0.4,0.7-1.3,0.9-2,0.4c-0.1-0.1-0.2-0.2-0.3-0.3L24,35.4c-0.5,0.7-0.4,1.6,0.3,2.1
	c0.7,0.5,1.6,0.4,2.1-0.3c0-0.1,0.1-0.1,0.1-0.2l4.5-6.7c0.4-0.6,0.3-1.3-0.1-1.8L26.5,35.1z"/>
<path class="st15" d="M41.6,26.1c1.2,0,2.2,0.7,2.6,1.8c0.6-1.4-0.2-3.1-1.6-3.6c-1.4-0.6-3.1,0.2-3.6,1.6c-0.2,0.6-0.2,1.4,0,2
	C39.3,26.8,40.4,26.1,41.6,26.1z"/>
<path class="st14" d="M41.6,29.8c-1.2,0-2.2-0.7-2.6-1.8c-0.6,1.4,0.2,3.1,1.6,3.6c1.4,0.6,3.1-0.2,3.6-1.6c0.2-0.6,0.2-1.4,0-2
	C43.8,29,42.7,29.7,41.6,29.8z"/>
<path class="st15" d="M49.4,26.1c1.2,0,2.2,0.7,2.6,1.8c0.6-1.4-0.2-3.1-1.6-3.6c-1.4-0.6-3.1,0.2-3.6,1.6c-0.2,0.6-0.2,1.4,0,2
	C47.2,26.8,48.3,26.1,49.4,26.1z"/>
<path class="st14" d="M49.4,29.8c-1.2,0-2.2-0.7-2.6-1.8c-0.6,1.4,0.2,3.1,1.6,3.6c1.4,0.6,3.1-0.2,3.6-1.6c0.2-0.6,0.2-1.4,0-2
	C51.7,29,50.6,29.7,49.4,29.8z"/>
<path class="st15" d="M57.3,26.1c1.2,0,2.2,0.7,2.6,1.8c0.6-1.4-0.2-3.1-1.6-3.6c-1.4-0.6-3.1,0.2-3.6,1.6c-0.2,0.6-0.2,1.4,0,2
	C55.1,26.8,56.2,26.1,57.3,26.1z"/>
<path class="st14" d="M57.3,29.8c-1.2,0-2.2-0.7-2.6-1.8c-0.6,1.4,0.2,3.1,1.6,3.6c1.4,0.6,3.1-0.2,3.6-1.6c0.2-0.6,0.2-1.4,0-2
	C59.5,29,58.5,29.7,57.3,29.8z"/>
<path class="st15" d="M60.7,0.5H3.3c-1.6,0-2.8,1.2-2.8,2.8c0,0,0,0,0,0v2c0-1.6,1.2-2.8,2.8-2.8c0,0,0,0,0.1,0h57.4
	c1.6,0,2.8,1.3,2.8,2.8c0,0,0,0,0,0v-2C63.5,1.7,62.2,0.5,60.7,0.5z"/>
<path class="st14" d="M60.7,20.8H3.3c-1.6,0-2.8-1.2-2.8-2.8c0,0,0,0,0,0v2c0,1.6,1.3,2.8,2.8,2.8h57.4c1.6,0,2.8-1.3,2.8-2.8
	c0,0,0,0,0,0v-2C63.5,19.5,62.3,20.7,60.7,20.8C60.7,20.7,60.7,20.8,60.7,20.8z"/>
<path class="st15" d="M23.8,8c0.1,0.1,0.2,0.2,0.3,0.3l0.1-0.2c0.4-0.7,0.2-1.6-0.5-2c-0.7-0.4-1.5-0.2-2,0.4l-4.5,6.8
	c-0.4,0.6-0.3,1.3,0.1,1.8l4.4-6.6C22.2,7.7,23.1,7.6,23.8,8C23.8,8,23.8,8,23.8,8z"/>
<path class="st15" d="M17.1,8c0.1,0.1,0.2,0.2,0.3,0.3l0.1-0.2c0.5-0.7,0.3-1.6-0.4-2.1c-0.7-0.5-1.6-0.3-2.1,0.4l-4.5,6.8
	c-0.4,0.6-0.3,1.3,0.1,1.8L15,8.4C15.5,7.7,16.4,7.5,17.1,8C17.1,8,17.1,8,17.1,8z"/>
<path class="st15" d="M10.3,8c0.1,0.1,0.2,0.2,0.3,0.3l0.1-0.2C11.2,7.4,11,6.5,10.4,6S8.8,5.7,8.3,6.4c0,0,0,0,0,0l-4.5,6.8
	c-0.4,0.6-0.3,1.3,0.1,1.8l4.4-6.6C8.7,7.7,9.6,7.6,10.3,8z"/>
<path class="st15" d="M30.6,8c0.1,0.1,0.2,0.2,0.3,0.3L31,8.1c0.4-0.7,0.2-1.6-0.5-2c-0.7-0.4-1.5-0.2-2,0.4L24,13.2
	c-0.4,0.6-0.3,1.3,0.1,1.8l4.4-6.6C29,7.7,29.9,7.6,30.6,8C30.6,8,30.6,8,30.6,8z"/>
<path class="st14" d="M24.1,8.2l-4.4,6.6c-0.4,0.7-1.3,0.9-2,0.4c-0.1-0.1-0.2-0.2-0.3-0.3l-0.1,0.2c-0.5,0.7-0.3,1.6,0.3,2.1
	c0.7,0.5,1.6,0.3,2.1-0.3c0,0,0.1-0.1,0.1-0.1l4.5-6.8C24.6,9.5,24.5,8.7,24.1,8.2z"/>
<path class="st14" d="M17.4,8.2L13,14.8c-0.4,0.7-1.3,0.9-2,0.4c-0.1-0.1-0.2-0.2-0.3-0.3l-0.1,0.2c-0.5,0.7-0.3,1.6,0.3,2.1
	c0.7,0.5,1.6,0.3,2.1-0.3c0,0,0.1-0.1,0.1-0.1l4.5-6.8C17.8,9.4,17.8,8.7,17.4,8.2z"/>
<path class="st14" d="M10.6,8.2l-4.4,6.6c-0.4,0.7-1.3,0.9-2,0.5C4.1,15.2,4,15.1,3.9,15l-0.1,0.2c-0.5,0.7-0.3,1.6,0.3,2.1
	s1.6,0.3,2.1-0.3c0,0,0.1-0.1,0.1-0.1l4.5-6.8C11.1,9.5,11,8.7,10.6,8.2z"/>
<path class="st14" d="M26.5,14.8c-0.4,0.7-1.3,0.9-2,0.4c-0.1-0.1-0.2-0.2-0.3-0.3L24,15.1c-0.5,0.7-0.3,1.6,0.3,2.1
	c0.7,0.5,1.6,0.3,2.1-0.3c0,0,0.1-0.1,0.1-0.1L31,10c0.4-0.6,0.3-1.3-0.1-1.8L26.5,14.8z"/>
<path class="st15" d="M40.4,5.8c1.2,0,2.2,0.7,2.6,1.8c0.6-1.4-0.2-3.1-1.6-3.6c-1.4-0.6-3.1,0.2-3.6,1.6c-0.2,0.6-0.2,1.4,0,2
	C38.2,6.6,39.3,5.8,40.4,5.8z"/>
<path class="st14" d="M40.4,9.5c-1.2,0-2.2-0.7-2.6-1.8c-0.6,1.4,0.2,3.1,1.6,3.6c1.4,0.6,3.1-0.2,3.6-1.6c0.2-0.6,0.2-1.4,0-2
	C42.7,8.8,41.6,9.5,40.4,9.5z"/>
<path class="st15" d="M49.4,5.8c1.2,0,2.2,0.7,2.6,1.8c0.6-1.4-0.2-3.1-1.6-3.6c-1.4-0.6-3.1,0.2-3.6,1.6c-0.2,0.6-0.2,1.4,0,2
	C47.2,6.6,48.3,5.8,49.4,5.8z"/>
<path class="st14" d="M49.4,9.5c-1.2,0-2.2-0.7-2.6-1.8c-0.6,1.4,0.2,3.1,1.6,3.6c1.4,0.6,3.1-0.2,3.6-1.6c0.2-0.6,0.2-1.4,0-2
	C51.7,8.8,50.6,9.5,49.4,9.5z"/>
<path class="st15" d="M57.3,5.8c1.2,0,2.2,0.7,2.6,1.8c0.6-1.4-0.2-3.1-1.6-3.6c-1.4-0.6-3.1,0.2-3.6,1.6c-0.2,0.6-0.2,1.4,0,2
	C55.1,6.6,56.2,5.8,57.3,5.8z"/>
<path class="st14" d="M57.3,9.5c-1.2,0-2.2-0.7-2.6-1.8c-0.6,1.4,0.2,3.1,1.6,3.6c1.4,0.6,3.1-0.2,3.6-1.6c0.2-0.6,0.2-1.4,0-2
	C59.5,8.8,58.5,9.5,57.3,9.5z"/>
</svg>
