<?xml version="1.0" encoding="utf-8"?>
<!-- Generator: Adobe Illustrator 21.0.0, SVG Export Plug-In . SVG Version: 6.00 Build 0)  -->
<svg version="1.1" id="katman_1" xmlns="http://www.w3.org/2000/svg" xmlns:xlink="http://www.w3.org/1999/xlink" x="0px" y="0px"
	 viewBox="0 0 16 14.3" style="enable-background:new 0 0 16 14.3;" xml:space="preserve">
<style type="text/css">
	.st0{opacity:0.7;fill:#333333;enable-background:new    ;}
	.st1{fill:url(#SVGID_1_);}
	.st2{fill:url(#SVGID_2_);}
	.st3{fill:url(#SVGID_3_);}
	.st4{fill:url(#SVGID_4_);}
	.st5{opacity:0.1;fill:#FFFFFF;enable-background:new    ;}
	.st6{opacity:0.2;enable-background:new    ;}
	.st7{opacity:0.3;enable-background:new    ;}
</style>
<title>xfce4-notifyd_5</title>
<path class="st0" d="M8,14c-0.1,0-0.3-0.1-0.3-0.2l-1.8-3.1H0.4c-0.2,0-0.4-0.2-0.4-0.4c0,0,0,0,0,0V0.4C0,0.2,0.2,0,0.4,0h15.2
	C15.8,0,16,0.2,16,0.4c0,0,0,0,0,0v9.9c0,0.2-0.2,0.4-0.4,0.4l0,0h-5.5l-1.8,3.1C8.3,13.9,8.1,14,8,14z"/>
<linearGradient id="SVGID_1_" gradientUnits="userSpaceOnUse" x1="8.01" y1="-0.1013" x2="8.01" y2="13.6007" gradientTransform="matrix(1 0 0 -1 0 13.73)">
	<stop  offset="0" style="stop-color:#A3A4A4"/>
	<stop  offset="0.12" style="stop-color:#BBBBBB"/>
	<stop  offset="0.27" style="stop-color:#CFCECE"/>
	<stop  offset="0.43" style="stop-color:#DDDCDC"/>
	<stop  offset="0.64" style="stop-color:#E5E4E4"/>
	<stop  offset="1" style="stop-color:#E7E6E6"/>
</linearGradient>
<path class="st1" d="M15.6,0.1H0.4c-0.2,0-0.3,0.1-0.3,0.3c0,0,0,0,0,0v9.9c0,0.2,0.1,0.3,0.3,0.3c0,0,0,0,0,0h5.5
	c0,0,0.1,0,0.1,0.1l1.8,3.1c0.1,0.1,0.2,0.2,0.3,0.1c0,0,0.1-0.1,0.1-0.1l1.8-3.1c0,0,0.1-0.1,0.1-0.1h5.5c0.2,0,0.3-0.1,0.3-0.3
	l0,0V0.4C15.9,0.3,15.8,0.1,15.6,0.1C15.6,0.1,15.6,0.1,15.6,0.1z"/>
<linearGradient id="SVGID_2_" gradientUnits="userSpaceOnUse" x1="11.88" y1="9.77" x2="11.88" y2="7.96" gradientTransform="matrix(1 0 0 -1 0 13.73)">
	<stop  offset="0.25" style="stop-color:#CC2A31"/>
	<stop  offset="0.49" style="stop-color:#C92930"/>
	<stop  offset="0.67" style="stop-color:#C0272F"/>
	<stop  offset="0.82" style="stop-color:#B0242C"/>
	<stop  offset="0.96" style="stop-color:#9A1F28"/>
	<stop  offset="0.99" style="stop-color:#931D27"/>
</linearGradient>
<circle class="st2" cx="11.9" cy="4.9" r="0.9"/>
<linearGradient id="SVGID_3_" gradientUnits="userSpaceOnUse" x1="8" y1="9.77" x2="8" y2="7.96" gradientTransform="matrix(1 0 0 -1 0 13.73)">
	<stop  offset="0.25" style="stop-color:#CC2A31"/>
	<stop  offset="0.49" style="stop-color:#C92930"/>
	<stop  offset="0.67" style="stop-color:#C0272F"/>
	<stop  offset="0.82" style="stop-color:#B0242C"/>
	<stop  offset="0.96" style="stop-color:#9A1F28"/>
	<stop  offset="0.99" style="stop-color:#931D27"/>
</linearGradient>
<circle class="st3" cx="8" cy="4.9" r="0.9"/>
<linearGradient id="SVGID_4_" gradientUnits="userSpaceOnUse" x1="4.12" y1="9.77" x2="4.12" y2="7.96" gradientTransform="matrix(1 0 0 -1 0 13.73)">
	<stop  offset="0.25" style="stop-color:#CC2A31"/>
	<stop  offset="0.49" style="stop-color:#C92930"/>
	<stop  offset="0.67" style="stop-color:#C0272F"/>
	<stop  offset="0.82" style="stop-color:#B0242C"/>
	<stop  offset="0.96" style="stop-color:#9A1F28"/>
	<stop  offset="0.99" style="stop-color:#931D27"/>
</linearGradient>
<circle class="st4" cx="4.1" cy="4.9" r="0.9"/>
<path class="st5" d="M11.9,4.6c0.4,0,0.7,0.3,0.9,0.6c0-0.1,0-0.2,0-0.2c0-0.5-0.4-0.9-0.9-0.9C11.3,4.1,11,4.5,11,5
	c0,0.1,0,0.2,0,0.2C11.1,4.8,11.5,4.5,11.9,4.6z"/>
<path class="st6" d="M11.9,5.8c-0.4,0-0.8-0.2-0.9-0.6c0,0.1,0,0.2,0,0.2c0,0.5,0.4,0.9,0.9,0.9c0.5,0,0.9-0.4,0.9-0.9
	c0-0.1,0-0.2,0-0.2C12.7,5.6,12.3,5.9,11.9,5.8z"/>
<path class="st5" d="M8,4.6c0.4,0,0.7,0.3,0.9,0.6c0-0.1,0-0.2,0-0.2c0-0.5-0.4-0.9-0.9-0.9C7.5,4.1,7.1,4.5,7.1,5
	c0,0.1,0,0.2,0,0.2C7.2,4.8,7.6,4.5,8,4.6z"/>
<path class="st6" d="M8,5.8c-0.4,0-0.7-0.3-0.8-0.6c0,0.1,0,0.2,0,0.2c0,0.5,0.4,0.9,0.9,0.9s0.9-0.4,0.9-0.9c0-0.1,0-0.2,0-0.2
	C8.8,5.6,8.4,5.9,8,5.8z"/>
<path class="st5" d="M4.1,4.6c0.4,0,0.8,0.3,0.9,0.6C5,5.1,5,5,5,5c0-0.5-0.4-0.9-0.9-0.9S3.2,4.5,3.2,5c0,0.1,0,0.2,0,0.2
	C3.3,4.8,3.7,4.5,4.1,4.6z"/>
<path class="st6" d="M4.1,5.8c-0.4,0-0.7-0.3-0.8-0.6c0,0.1,0,0.2,0,0.2c0.1,0.5,0.6,0.8,1.1,0.7C4.7,6,4.9,5.8,5,5.5
	c0-0.1,0-0.2,0-0.2C4.9,5.6,4.5,5.8,4.1,5.8z"/>
<path class="st5" d="M15.6,0.1H0.4c-0.2,0-0.3,0.1-0.3,0.3c0,0,0,0,0,0v0.5c0-0.2,0.1-0.3,0.3-0.3l0,0h15.2c0.2,0,0.3,0.1,0.3,0.3
	c0,0,0,0,0,0V0.4C15.9,0.3,15.7,0.1,15.6,0.1z"/>
<path class="st7" d="M15.6,10.6h-5.5c0,0-0.1,0-0.1,0.1l-1.8,3c-0.1,0.1-0.2,0.2-0.3,0.1c0,0-0.1-0.1-0.1-0.1l-1.8-3
	c0,0-0.1-0.1-0.1-0.1H0.4c-0.2,0-0.3-0.1-0.3-0.3c0,0,0,0,0,0v0.5c0,0.2,0.1,0.3,0.3,0.3c0,0,0,0,0,0h5.5c0,0,0.1,0,0.1,0.1l1.8,3
	c0.1,0.1,0.2,0.2,0.3,0.1c0,0,0.1-0.1,0.1-0.1l1.8-3.1c0,0,0.1-0.1,0.1-0.1h5.5c0.2,0,0.3-0.1,0.3-0.3l0,0v-0.5
	C15.9,10.4,15.8,10.6,15.6,10.6C15.6,10.6,15.6,10.6,15.6,10.6z"/>
</svg>
