<?xml version="1.0" encoding="utf-8"?>
<!-- Generator: Adobe Illustrator 21.0.0, SVG Export Plug-In . SVG Version: 6.00 Build 0)  -->
<svg version="1.1" id="katman_1" xmlns="http://www.w3.org/2000/svg" xmlns:xlink="http://www.w3.org/1999/xlink" x="0px" y="0px"
	 viewBox="0 0 15.3 22" style="enable-background:new 0 0 15.3 22;" xml:space="preserve">
<style type="text/css">
	.st0{fill:url(#SVGID_1_);}
	.st1{opacity:0.2;fill:#1A1A1A;enable-background:new    ;}
	.st2{opacity:0.5;fill:#1A1A1A;enable-background:new    ;}
	.st3{fill:url(#SVGID_2_);}
	.st4{fill:url(#SVGID_3_);}
	.st5{fill:none;stroke:#1A1A1A;stroke-width:0.25;stroke-miterlimit:10;}
	.st6{fill:none;stroke:#999999;stroke-width:0.25;stroke-miterlimit:10;}
	.st7{fill:url(#SVGID_4_);}
	.st8{fill:url(#SVGID_5_);}
	.st9{fill:url(#SVGID_6_);}
	.st10{fill:url(#SVGID_7_);}
	.st11{fill:url(#SVGID_8_);}
	.st12{fill:url(#SVGID_9_);}
	.st13{fill:url(#SVGID_10_);}
	.st14{opacity:0.1;fill:#FFFFFF;enable-background:new    ;}
	.st15{opacity:0.1;enable-background:new    ;}
	.st16{fill:url(#SVGID_11_);}
	.st17{fill:url(#SVGID_12_);}
	.st18{fill:url(#SVGID_13_);}
</style>
<title>drive-removable-media_4</title>
<linearGradient id="SVGID_1_" gradientUnits="userSpaceOnUse" x1="7.665" y1="8.000038e-02" x2="7.665" y2="21.73" gradientTransform="matrix(1 0 0 -1 0 21.73)">
	<stop  offset="0" style="stop-color:#1A1A1A"/>
	<stop  offset="9.000000e-02" style="stop-color:#292929"/>
	<stop  offset="0.26" style="stop-color:#3E3E3E"/>
	<stop  offset="0.45" style="stop-color:#4D4D4D"/>
	<stop  offset="0.67" style="stop-color:#565656"/>
	<stop  offset="1" style="stop-color:#595959"/>
</linearGradient>
<path class="st0" d="M1.8,0h11.6c1,0,1.8,0.8,1.8,1.8v18c0,1-0.8,1.8-1.8,1.8H1.8c-1,0-1.8-0.8-1.8-1.8v-18C0,0.8,0.8,0,1.8,0z"/>
<path class="st1" d="M2.4,12.6c-1.3-1.3-2.1-3.1-2-5c0-4,3.3-7.2,7.3-7.2c4,0,7.3,3.2,7.3,7.2c0,0.9-0.2,1.8-0.5,2.6
	c0,0.2-0.2,0.3-0.3,0.3c-0.2,0-0.4-0.3-0.5-0.7c0-0.2,0-0.4,0.1-0.5C13.9,8.7,14,8.1,14,7.6c0-3.5-2.9-6.2-6.3-6.2
	c-2.1,0-4.1,1.1-5.3,2.8c0.5,1.2,1.1,2.4,1.9,3.6c0.6,0.9,1.1,1.9,1.5,2.8v0.1l-0.1,0.1c-0.3,0.2-1.1,0.7-1.9,1.1l-1.1,0.7l-0.1,0.1
	L2.4,12.6z"/>
<circle class="st2" cx="14.8" cy="11.4" r="0.5"/>
<linearGradient id="SVGID_2_" gradientUnits="userSpaceOnUse" x1="14.82" y1="9.9" x2="14.82" y2="10.67" gradientTransform="matrix(1 0 0 -1 0 21.73)">
	<stop  offset="0" style="stop-color:#909092"/>
	<stop  offset="0.33" style="stop-color:#E5E5E5"/>
	<stop  offset="0.64" style="stop-color:#FFFFFF"/>
	<stop  offset="0.97" style="stop-color:#D9D1D1"/>
	<stop  offset="1" style="stop-color:#E5E5E5"/>
</linearGradient>
<circle class="st3" cx="14.8" cy="11.4" r="0.4"/>
<circle class="st2" cx="0.6" cy="11.4" r="0.5"/>
<linearGradient id="SVGID_3_" gradientUnits="userSpaceOnUse" x1="0.62" y1="9.9" x2="0.62" y2="10.67" gradientTransform="matrix(1 0 0 -1 0 21.73)">
	<stop  offset="0" style="stop-color:#909092"/>
	<stop  offset="0.33" style="stop-color:#E5E5E5"/>
	<stop  offset="0.64" style="stop-color:#FFFFFF"/>
	<stop  offset="0.97" style="stop-color:#D9D1D1"/>
	<stop  offset="1" style="stop-color:#E5E5E5"/>
</linearGradient>
<circle class="st4" cx="0.6" cy="11.4" r="0.4"/>
<circle class="st5" cx="1" cy="13" r="0.3"/>
<circle class="st6" cx="1" cy="0.9" r="0.6"/>
<circle class="st2" cx="1" cy="0.9" r="0.5"/>
<linearGradient id="SVGID_4_" gradientUnits="userSpaceOnUse" x1="0.97" y1="20.46" x2="0.97" y2="21.24" gradientTransform="matrix(1 0 0 -1 0 21.73)">
	<stop  offset="0" style="stop-color:#909092"/>
	<stop  offset="0.33" style="stop-color:#E5E5E5"/>
	<stop  offset="0.64" style="stop-color:#FFFFFF"/>
	<stop  offset="0.97" style="stop-color:#D9D1D1"/>
	<stop  offset="1" style="stop-color:#E5E5E5"/>
</linearGradient>
<circle class="st7" cx="1" cy="0.9" r="0.4"/>
<circle class="st6" cx="14.5" cy="0.9" r="0.6"/>
<circle class="st2" cx="14.5" cy="0.9" r="0.5"/>
<linearGradient id="SVGID_5_" gradientUnits="userSpaceOnUse" x1="14.48" y1="20.46" x2="14.48" y2="21.24" gradientTransform="matrix(1 0 0 -1 0 21.73)">
	<stop  offset="0" style="stop-color:#909092"/>
	<stop  offset="0.33" style="stop-color:#E5E5E5"/>
	<stop  offset="0.64" style="stop-color:#FFFFFF"/>
	<stop  offset="0.97" style="stop-color:#D9D1D1"/>
	<stop  offset="1" style="stop-color:#E5E5E5"/>
</linearGradient>
<circle class="st8" cx="14.5" cy="0.9" r="0.4"/>
<linearGradient id="SVGID_6_" gradientUnits="userSpaceOnUse" x1="7.72" y1="9.27" x2="7.72" y2="21.1403" gradientTransform="matrix(1 0 0 -1 0 21.73)">
	<stop  offset="0" style="stop-color:#CCCCCC"/>
	<stop  offset="1" style="stop-color:#F7F7F7"/>
</linearGradient>
<path class="st9" d="M5.5,10.7c-0.3-1-3.1-5.4-3.4-6.5c1.2-1.9,3.3-3,5.5-3c3.6,0,6.5,2.8,6.5,6.4c0,0,0,0,0,0c0,0.6,0,1.1-0.2,1.7
	c-0.1,0.2-0.1,0.3-0.1,0.5c0,0.4,0.4,0.7,0.5,0.4c0.3-0.8,0.5-1.7,0.5-2.5c0-3.9-3.2-7-7.1-7c-3.9,0-7.1,3.1-7.1,7
	c0,1.8,0.7,3.6,2,4.9C2.9,12.2,5,11,5.5,10.7z"/>
<path class="st1" d="M13,21.3c-0.6,0-1-0.4-1-1H8.5c0,0.6-0.4,1-1,1H1.7l0.1-0.2c0-0.2,0-0.3,0-0.5c-0.1-0.3-0.3-0.5-0.6-0.6
	c-0.1,0-0.2,0-0.2,0H0.8H0.6v-5.8l0.1-0.1c0.2-0.1,4.1-2.4,5.2-3.1C6,11,6.1,10.7,6,10.5c-0.2-0.3-2.6-4.6-3.5-6.1L2.5,4.4l0.1-0.1
	c1.2-1.7,3.1-2.7,5.2-2.7c3.4,0,6.2,2.7,6.2,6.1c0,0.6-0.1,1.2-0.2,1.7v0.2c-0.1,2.8-0.2,3.4-0.2,3.5c0,0.3,0.2,0.5,0.5,0.5h0.4
	c0.2,0,0.4,0.2,0.4,0.4v6h-0.2h-0.1c-0.1,0-0.2,0-0.3,0.1c-0.3,0.1-0.5,0.4-0.6,0.7c0,0.1,0,0.3,0,0.4l0.1,0.2L13,21.3z"/>
<linearGradient id="SVGID_7_" gradientUnits="userSpaceOnUse" x1="7.715" y1="0.6" x2="7.715" y2="20.03" gradientTransform="matrix(1 0 0 -1 0 21.73)">
	<stop  offset="0" style="stop-color:#CCCCCC"/>
	<stop  offset="1" style="stop-color:#F7F7F7"/>
</linearGradient>
<path class="st10" d="M13,21.1c-0.5,0-0.9-0.4-0.9-0.9l0,0v-0.1H8.3v0.1c0,0.5-0.4,0.9-0.9,0.9h0H2c0.2-0.5-0.1-1.1-0.6-1.3
	c0,0-0.1,0-0.1,0c-0.1,0-0.2,0-0.3,0H0.8v-5.4c0.4-0.3,4.1-2.5,5.2-3.1c0.3-0.2,0.4-0.5,0.2-0.8C6,10.1,3,5,2.6,4.4
	c1.1-1.7,3-2.7,5-2.7c3.3,0,5.9,2.6,6,5.9c0,0.6-0.1,1.1-0.2,1.7l0,0c0,0.1-0.2,3.6-0.2,3.7c0,0.4,0.3,0.7,0.7,0.7h0.4
	c0.1,0,0.3,0.1,0.3,0.3l0,0v5.8h-0.2c-0.1,0-0.3,0-0.4,0.1c-0.3,0.1-0.6,0.4-0.7,0.8c0,0.2,0,0.3,0,0.5L13,21.1z"/>
<path d="M5.4,7.4"/>
<linearGradient id="SVGID_8_" gradientUnits="userSpaceOnUse" x1="7.9401" y1="17.37" x2="7.9401" y2="5.7" gradientTransform="matrix(1 0 0 -1 0 21.73)">
	<stop  offset="0" style="stop-color:#595959"/>
	<stop  offset="0.33" style="stop-color:#565656"/>
	<stop  offset="0.55" style="stop-color:#4D4D4D"/>
	<stop  offset="0.74" style="stop-color:#3E3E3E"/>
	<stop  offset="0.91" style="stop-color:#292929"/>
	<stop  offset="1" style="stop-color:#1A1A1A"/>
</linearGradient>
<path class="st11" d="M5.5,7.6V6.2h1.4v1.4H6.5v0.8c0,0.1,0,0.2,0.1,0.3l1,0.9v-4H7L7.9,4l0.9,1.6H8.2V11l1-0.9
	C9.3,10,9.3,9.9,9.4,9.8V8.4C9,8.2,8.9,7.8,9,7.4s0.6-0.5,1-0.3c0.4,0.2,0.5,0.6,0.3,1c-0.1,0.1-0.2,0.2-0.3,0.3v1.4
	c0,0.3-0.1,0.5-0.3,0.7l0,0l-0.1,0.1l-1.3,1.2c-0.1,0.1-0.1,0.2-0.1,0.3v2.5C8.9,14.8,9.2,15.4,9,16c-0.2,0.6-0.8,0.9-1.4,0.7
	s-0.9-0.8-0.7-1.4c0.1-0.3,0.4-0.6,0.7-0.7v-3.9c0-0.1,0-0.2-0.1-0.2L6.2,9.2C6,9,5.9,8.7,5.8,8.4V7.6H5.5z"/>
<circle class="st6" cx="14.5" cy="20.8" r="0.6"/>
<circle class="st2" cx="14.5" cy="20.8" r="0.5"/>
<linearGradient id="SVGID_9_" gradientUnits="userSpaceOnUse" x1="14.48" y1="0.54" x2="14.48" y2="1.32" gradientTransform="matrix(1 0 0 -1 0 21.73)">
	<stop  offset="0" style="stop-color:#909092"/>
	<stop  offset="0.33" style="stop-color:#E5E5E5"/>
	<stop  offset="0.64" style="stop-color:#FFFFFF"/>
	<stop  offset="0.97" style="stop-color:#D9D1D1"/>
	<stop  offset="1" style="stop-color:#E5E5E5"/>
</linearGradient>
<circle class="st12" cx="14.5" cy="20.8" r="0.4"/>
<circle class="st6" cx="1" cy="20.8" r="0.6"/>
<circle class="st2" cx="1" cy="20.8" r="0.5"/>
<linearGradient id="SVGID_10_" gradientUnits="userSpaceOnUse" x1="0.97" y1="0.54" x2="0.97" y2="1.32" gradientTransform="matrix(1 0 0 -1 0 21.73)">
	<stop  offset="0" style="stop-color:#909092"/>
	<stop  offset="0.33" style="stop-color:#E5E5E5"/>
	<stop  offset="0.64" style="stop-color:#FFFFFF"/>
	<stop  offset="0.97" style="stop-color:#D9D1D1"/>
	<stop  offset="1" style="stop-color:#E5E5E5"/>
</linearGradient>
<circle class="st13" cx="1" cy="20.8" r="0.4"/>
<path d="M5.4,7.4"/>
<path class="st14" d="M14.7,0h-14C0.3,0,0,0.3,0,0.7c0,0,0,0,0,0V1c0-0.4,0.3-0.7,0.6-0.7l0,0h14c0.4,0,0.6,0.3,0.6,0.7V0.7
	C15.3,0.3,15,0,14.7,0z"/>
<path class="st15" d="M14.7,21.7h-14C0.3,21.7,0,21.4,0,21v0.4C0,21.7,0.3,22,0.6,22h14c0.4,0,0.6-0.3,0.6-0.6V21
	C15.3,21.3,15,21.6,14.7,21.7z"/>
<path class="st14" d="M14.8,11.4c0.1,0,0.3,0.1,0.3,0.2c0-0.1,0-0.1,0-0.2c0-0.2-0.2-0.4-0.4-0.4c-0.2,0-0.4,0.2-0.4,0.4
	c0,0.1,0,0.1,0,0.2C14.5,11.5,14.6,11.4,14.8,11.4z"/>
<path class="st15" d="M14.8,11.8c-0.1,0-0.3-0.1-0.3-0.2c0,0.1,0,0.1,0,0.2c0,0.2,0.2,0.4,0.4,0.4s0.4-0.2,0.4-0.4c0,0,0,0,0,0
	c0-0.1,0-0.1,0-0.2C15.2,11.8,15,11.9,14.8,11.8z"/>
<path class="st14" d="M0.6,11.4c0.1,0,0.3,0.1,0.3,0.2c0-0.1,0-0.1,0-0.2c0-0.2-0.2-0.4-0.4-0.4s-0.4,0.2-0.4,0.4c0,0.1,0,0.1,0,0.2
	C0.3,11.5,0.4,11.4,0.6,11.4z"/>
<path class="st15" d="M0.6,11.8c-0.1,0-0.3-0.1-0.3-0.2c0,0.1,0,0.1,0,0.2c0,0.2,0.2,0.4,0.4,0.4c0.2,0,0.4-0.2,0.4-0.4c0,0,0,0,0,0
	c0-0.1,0-0.1,0-0.2C1,11.8,0.8,11.9,0.6,11.8z"/>
<path class="st14" d="M1,0.8c0.1,0,0.3,0.1,0.3,0.2c0-0.1,0-0.1,0-0.2c0-0.2-0.2-0.4-0.4-0.4S0.6,0.7,0.6,0.9c0,0.1,0,0.1,0,0.2
	C0.6,0.9,0.8,0.8,1,0.8z"/>
<path class="st15" d="M1,1.3c-0.1,0-0.3-0.1-0.3-0.2c0,0.1,0,0.1,0,0.2c0,0.2,0.2,0.4,0.4,0.4s0.4-0.2,0.4-0.4c0-0.1,0-0.1,0-0.2
	C1.4,1.2,1.2,1.3,1,1.3z"/>
<path class="st14" d="M14.5,0.8c0.1,0,0.3,0.1,0.3,0.2c0-0.1,0-0.1,0-0.2c0-0.2-0.2-0.4-0.4-0.4S14,0.7,14,0.9c0,0,0,0,0,0
	c0,0.1,0,0.1,0,0.2C14.1,0.9,14.3,0.8,14.5,0.8z"/>
<path class="st15" d="M14.5,1.3c-0.1,0-0.3-0.1-0.3-0.2c0,0.1,0,0.1,0,0.2c0,0.2,0.2,0.4,0.4,0.4s0.4-0.2,0.4-0.4c0,0,0,0,0,0
	c0-0.1,0-0.1,0-0.2C14.8,1.2,14.7,1.3,14.5,1.3z"/>
<path class="st15" d="M5.4,10.7l0.1-0.1c-0.3-1-2.8-4.8-3.3-6.2L2.2,4.5C2.4,5.6,4.8,9.4,5.4,10.7z"/>
<linearGradient id="SVGID_11_" gradientUnits="userSpaceOnUse" x1="14.0396" y1="11.81" x2="14.0396" y2="13.93" gradientTransform="matrix(1 0 0 -1 0 21.73)">
	<stop  offset="0" style="stop-color:#CCCCCC"/>
	<stop  offset="1" style="stop-color:#F7F7F7"/>
</linearGradient>
<path class="st16" d="M14.2,7.9c0,0,0-0.1,0-0.1c0,0.5-0.1,1-0.2,1.5c-0.1,0.2-0.1,0.3-0.1,0.5c0,0,0,0.1,0,0.1
	c0-0.1,0.1-0.2,0.1-0.3C14.1,9.1,14.2,8.5,14.2,7.9z"/>
<path class="st14" d="M7.7,0.9c3.8,0,7,3,7.1,6.8c0-0.1,0-0.1,0-0.2c0-3.9-3.2-7-7.1-7c-3.9,0-7.1,3.1-7.1,7c0,0.1,0,0.1,0,0.2
	C0.7,3.9,3.8,0.9,7.7,0.9z"/>
<path class="st15" d="M7.7,1.2c-2.2,0-4.3,1.1-5.5,3c0,0.1,0,0.2,0.1,0.2c1.2-1.8,3.3-2.9,5.4-2.9c3.5,0,6.4,2.8,6.5,6.3
	c0-0.1,0-0.1,0-0.2C14.2,4,11.2,1.2,7.7,1.2z"/>
<path class="st15" d="M0.6,7.8c0,0.1,0,0.1,0,0.2c0,1.8,0.7,3.6,2,4.9c0.4-0.2,2.5-1.5,3-1.8c0-0.1-0.1-0.2-0.1-0.3
	c-0.7,0.4-2.5,1.5-2.9,1.7C1.3,11.2,0.6,9.5,0.6,7.8z"/>
<path class="st15" d="M14.3,10.1c-0.1,0.3-0.4,0.1-0.4-0.2c0,0.1,0,0.1,0,0.2c0,0.4,0.4,0.7,0.5,0.4c0.3-0.8,0.5-1.7,0.5-2.5
	c0-0.1,0-0.1,0-0.2C14.8,8.6,14.6,9.4,14.3,10.1z"/>
<path class="st14" d="M5.9,11.2c-1,0.6-4.7,2.9-5.2,3.1v0.4c0.4-0.3,4.1-2.5,5.2-3.1c0.2-0.1,0.3-0.4,0.2-0.7
	C6.1,11,6,11.2,5.9,11.2z"/>
<linearGradient id="SVGID_12_" gradientUnits="userSpaceOnUse" x1="13.95" y1="7.44" x2="13.95" y2="8.64" gradientTransform="matrix(1 0 0 -1 0 21.73)">
	<stop  offset="0" style="stop-color:#CCCCCC"/>
	<stop  offset="1" style="stop-color:#F7F7F7"/>
</linearGradient>
<path class="st17" d="M14.4,13.7h-0.4c-0.3,0-0.6-0.3-0.7-0.6c0,0.1,0,0.2,0,0.2c0,0.4,0.3,0.7,0.7,0.7h0.4c0.1,0,0.3,0.1,0.3,0.3
	l0,0v-0.4C14.6,13.8,14.5,13.7,14.4,13.7C14.4,13.7,14.4,13.7,14.4,13.7z"/>
<path class="st14" d="M7.7,1.7c-2,0-3.9,1-5,2.7l0.1,0.2C3.9,3,5.8,2,7.7,2.1c3.2,0,5.9,2.5,6,5.7c0-0.1,0-0.1,0-0.2
	C13.6,4.3,10.9,1.7,7.7,1.7z"/>
<path class="st15" d="M14.1,19.8c-0.3,0.1-0.6,0.4-0.7,0.8c0,0.1,0,0.2,0,0.3c0.1-0.4,0.3-0.6,0.6-0.8c0.1,0,0.2-0.1,0.4-0.1h0.2
	v-0.4h-0.2C14.3,19.8,14.2,19.8,14.1,19.8z"/>
<path class="st15" d="M2,20.6c-0.1-0.4-0.3-0.7-0.7-0.8c-0.1,0-0.2,0-0.3,0H0.8v0.4H1c0.1,0,0.2,0,0.3,0c0.4,0.1,0.6,0.4,0.7,0.8
	l0,0C2,20.8,2,20.7,2,20.6z"/>
<path class="st15" d="M6.1,10.8c0,0,0,0.1,0,0.1c0.1-0.2,0.1-0.3,0-0.5C6,10.1,3.4,5.7,2.8,4.6L2.6,4.7C3,5.3,6,10.5,6.1,10.8z"/>
<linearGradient id="SVGID_13_" gradientUnits="userSpaceOnUse" x1="13.4591" y1="8.64" x2="13.4591" y2="13.93" gradientTransform="matrix(1 0 0 -1 0 21.73)">
	<stop  offset="0" style="stop-color:#CCCCCC"/>
	<stop  offset="1" style="stop-color:#F7F7F7"/>
</linearGradient>
<path class="st18" d="M13.4,9.6L13.4,9.6c0.2-0.5,0.2-1.1,0.2-1.7c0,0,0-0.1,0-0.2c0,0.5-0.1,1-0.2,1.5l0,0c0,0.1-0.2,3.6-0.2,3.7
	c0,0,0,0.1,0,0.1C13.2,12.3,13.4,9.7,13.4,9.6L13.4,9.6z"/>
<path class="st15" d="M12.1,20.3L12.1,20.3l-3.8-0.1v0.1c0,0.5-0.4,0.9-0.9,0.9h0H2c0,0.1,0,0.2,0,0.4h5.5c0.5,0,0.9-0.4,0.9-0.9
	l0,0v-0.1h3.8v0.1c0,0.5,0.4,0.9,0.9,0.9c0,0,0,0,0,0h0.5c0-0.1,0-0.2,0-0.4H13C12.5,21.1,12.1,20.8,12.1,20.3
	C12.1,20.3,12.1,20.3,12.1,20.3z"/>
<path d="M5.4,7.8"/>
<path class="st15" d="M6.6,9l1,0.9V9.6l-1-0.9C6.6,8.6,6.5,8.5,6.5,8.4v0.4C6.5,8.8,6.6,8.9,6.6,9z"/>
<rect x="5.5" y="6.2" class="st15" width="1.4" height="0.3"/>
<polygon class="st15" points="8.6,5.6 8.8,5.6 7.9,4 7,5.6 7.2,5.6 7.9,4.4 "/>
<path class="st15" d="M8.2,11.4l1-0.9c0.1-0.1,0.1-0.2,0.1-0.3V9.9c0,0.1,0,0.2-0.1,0.3l-1,0.9V11.4z"/>
<path class="st15" d="M7.6,14.9v-0.4c-0.5,0.1-0.8,0.6-0.8,1.1c0,0.1,0,0.1,0,0.2C6.9,15.4,7.2,15.1,7.6,14.9z"/>
<path class="st15" d="M9.6,7C9.3,7,8.9,7.3,8.9,7.7c0,0.1,0,0.1,0,0.2C9,7.5,9.4,7.3,9.8,7.4c0.3,0.1,0.5,0.3,0.5,0.5
	c0-0.1,0-0.1,0-0.2C10.3,7.3,10,7,9.6,7z"/>
<path class="st15" d="M8.2,14.6v0.4c0.4,0.1,0.7,0.5,0.8,0.9c0-0.1,0-0.1,0-0.2C9,15.2,8.7,14.7,8.2,14.6z"/>
<path class="st14" d="M9.7,10.6L9.7,10.6l-1.3,1.3c-0.1,0.1-0.1,0.2-0.1,0.3v0.4c0-0.1,0-0.2,0.1-0.3L9.6,11l0.1-0.1l0,0
	c0.2-0.2,0.3-0.5,0.3-0.7V9.8C10,10.1,9.9,10.4,9.7,10.6L9.7,10.6z"/>
<path class="st14" d="M7.6,11v-0.4c0-0.1,0-0.2-0.1-0.2L6.2,9.2C6,9,5.9,8.7,5.8,8.4v0.4C5.9,9,6,9.3,6.2,9.6l1.3,1.2
	C7.5,10.8,7.6,10.9,7.6,11z"/>
<path class="st14" d="M7.9,16.8c-0.6,0-1-0.4-1.1-0.9c0,0.1,0,0.1,0,0.2c0,0.6,0.4,1.1,1,1.2c0.6,0,1.1-0.4,1.2-1c0-0.1,0-0.2,0-0.3
	C8.9,16.4,8.5,16.8,7.9,16.8z"/>
<path class="st14" d="M14.5,20.8c0.1,0,0.3,0.1,0.3,0.2c0-0.1,0-0.1,0-0.2c0-0.2-0.2-0.4-0.4-0.4S14,20.6,14,20.8c0,0,0,0,0,0
	c0,0.1,0,0.1,0,0.2C14.1,20.8,14.3,20.7,14.5,20.8z"/>
<path class="st15" d="M14.5,21.2c-0.1,0-0.3-0.1-0.3-0.2c0,0.1,0,0.1,0,0.2c0,0.2,0.2,0.4,0.4,0.4s0.4-0.2,0.4-0.4c0,0,0,0,0,0
	c0-0.1,0-0.1,0-0.2C14.8,21.1,14.7,21.2,14.5,21.2z"/>
<path class="st14" d="M1,20.8c0.1,0,0.3,0.1,0.3,0.2c0-0.1,0-0.1,0-0.2c0-0.2-0.2-0.4-0.4-0.4s-0.4,0.2-0.4,0.4c0,0.1,0,0.1,0,0.2
	C0.6,20.8,0.8,20.7,1,20.8z"/>
<path class="st15" d="M1,21.2c-0.2,0-0.3-0.1-0.4-0.2c0,0.1,0,0.1,0,0.2c0,0.2,0.2,0.4,0.4,0.4s0.4-0.2,0.4-0.4c0-0.1,0-0.1,0-0.2
	C1.3,21.1,1.2,21.2,1,21.2z"/>
</svg>
