<?xml version="1.0" encoding="utf-8"?>
<!-- Generator: Adobe Illustrator 21.0.0, SVG Export Plug-In . SVG Version: 6.00 Build 0)  -->
<svg version="1.1" id="katman_1" xmlns="http://www.w3.org/2000/svg" xmlns:xlink="http://www.w3.org/1999/xlink" x="0px" y="0px"
	 viewBox="0 0 21.8 22" style="enable-background:new 0 0 21.8 22;" xml:space="preserve">
<style type="text/css">
	.st0{fill:url(#_Yol__1_);}
	.st1{fill:#FFFFFF;}
	.st2{opacity:0.5;fill:#20396E;enable-background:new    ;}
	.st3{fill:#EAF6FE;}
	.st4{fill:none;}
	.st5{opacity:0.1;fill:#FFFFFF;enable-background:new    ;}
	.st6{opacity:0.2;enable-background:new    ;}
</style>
<title>preferences-desktop_4</title>
<linearGradient id="_Yol__1_" gradientUnits="userSpaceOnUse" x1="10.85" y1="1.06" x2="10.85" y2="20.8" gradientTransform="matrix(1 0 0 -1 0 21.73)">
	<stop  offset="0" style="stop-color:#2D5778"/>
	<stop  offset="0.39" style="stop-color:#2D5A7C"/>
	<stop  offset="0.74" style="stop-color:#2B6286"/>
	<stop  offset="1" style="stop-color:#2A6D94"/>
</linearGradient>
<path id="_Yol_" class="st0" d="M1.4,20.1V1.4l0,0h19l0,0v18.7L1.4,20.1L1.4,20.1z"/>
<rect x="15.4" y="9.9" class="st1" width="1.5" height="10.3"/>
<rect x="15.4" y="1.2" class="st1" width="1.5" height="4.1"/>
<rect x="10.1" y="14.8" class="st1" width="1.5" height="5.4"/>
<rect x="10.1" y="1.3" class="st1" width="1.5" height="8.9"/>
<rect x="4.7" y="10.1" class="st1" width="1.5" height="10.1"/>
<rect x="4.7" y="1.4" class="st1" width="1.5" height="4.1"/>
<rect x="15.2" y="9.7" class="st2" width="1.8" height="10.7"/>
<rect x="15.4" y="9.9" class="st3" width="1.5" height="10.3"/>
<rect x="15.2" y="1" class="st2" width="1.8" height="4.5"/>
<rect x="15.4" y="1.2" class="st3" width="1.5" height="4.1"/>
<rect x="9.9" y="14.6" class="st2" width="1.8" height="5.7"/>
<rect x="10.1" y="14.8" class="st3" width="1.5" height="5.4"/>
<rect x="9.9" y="1.1" class="st2" width="1.8" height="9.3"/>
<rect x="10.1" y="1.3" class="st3" width="1.5" height="8.9"/>
<rect x="4.5" y="10" class="st2" width="1.8" height="10.4"/>
<rect x="4.7" y="10.1" class="st3" width="1.5" height="10.1"/>
<rect x="4.5" y="1.2" class="st2" width="1.8" height="4.5"/>
<rect x="4.7" y="1.4" class="st3" width="1.5" height="4.1"/>
<rect x="1" y="0.8" class="st4" width="19.8" height="19.8"/>
<rect x="1.4" y="20" class="st1" width="18.9" height="0.3"/>
<path class="st1" d="M21.1,0.2H0.6c-0.2,0-0.4,0.2-0.4,0.4v0.3c0-0.2,0.2-0.4,0.4-0.4l0,0h20.6c0.2,0,0.4,0.2,0.4,0.4V0.6
	C21.6,0.4,21.4,0.2,21.1,0.2C21.2,0.2,21.2,0.2,21.1,0.2z"/>
<path class="st2" d="M0.6,21.5c-0.3,0-0.6-0.3-0.6-0.6V0.6C0,0.3,0.3,0,0.6,0h20.6c0.3,0,0.6,0.2,0.6,0.6v20.3
	c0,0.3-0.3,0.6-0.6,0.6H0.6z M20.1,19.9V1.6H1.6v18.3L20.1,19.9z"/>
<path id="_Bileşik_Yol_" class="st3" d="M21.1,0.2H0.6c-0.2,0-0.4,0.2-0.4,0.4v20.3c0,0.2,0.2,0.4,0.4,0.4c0,0,0,0,0,0h20.6
	c0.2,0,0.4-0.2,0.4-0.4c0,0,0,0,0,0V0.6C21.6,0.4,21.4,0.2,21.1,0.2z M20.3,20H1.4V1.4l0,0h18.9l0,0V20L20.3,20z"/>
<circle class="st2" cx="5.4" cy="8.6" r="2.2"/>
<circle class="st3" cx="5.4" cy="8.6" r="2"/>
<circle class="st2" cx="10.8" cy="13.4" r="2.2"/>
<circle class="st3" cx="10.8" cy="13.4" r="2.1"/>
<circle class="st2" cx="16.1" cy="8.6" r="2.2"/>
<circle class="st3" cx="16.1" cy="8.6" r="2"/>
<polygon class="st5" points="20.3,20 20.3,20 1.4,20 1.4,20.7 20.3,20.7 20.3,20 "/>
<path class="st5" d="M21.1,0.2H0.6c-0.2,0-0.4,0.2-0.4,0.4v0.7c0-0.2,0.2-0.4,0.4-0.4h20.6c0.2,0,0.4,0.2,0.4,0.4V0.6
	C21.6,0.4,21.4,0.2,21.1,0.2z"/>
<path class="st6" d="M19.1,2.1h1.2V1.4l0,0H1.5l0,0v0.7l0,0L19.1,2.1L19.1,2.1z"/>
<path class="st6" d="M21.2,21.3H0.6c-0.2,0-0.4-0.2-0.4-0.4c0,0,0,0,0,0v0.7c0,0.2,0.2,0.4,0.4,0.4c0,0,0,0,0,0h20.6
	c0.2,0,0.4-0.2,0.4-0.4c0,0,0,0,0,0v-0.7C21.6,21.1,21.4,21.3,21.2,21.3C21.2,21.3,21.2,21.3,21.2,21.3z"/>
<path class="st5" d="M5.4,7.3c1,0,1.9,0.7,2,1.7c0-1.1-0.9-2-2-2s-2,0.9-2,2C3.5,8,4.4,7.2,5.4,7.3z"/>
<path class="st6" d="M5.4,10.7c-1,0-1.9-0.7-2-1.7c0,1.1,0.9,2,2,2s2-0.9,2-2C7.3,9.9,6.4,10.7,5.4,10.7z"/>
<path class="st5" d="M10.8,12.1c1,0,1.9,0.7,2,1.7c0-1.1-0.9-2-2-2s-2,0.9-2,2C8.9,12.8,9.8,12.1,10.8,12.1z"/>
<path class="st6" d="M10.8,15.5c-1,0-1.9-0.7-2-1.7c0,1.1,0.9,2,2,2s2-0.9,2-2C12.6,14.8,11.8,15.5,10.8,15.5z"/>
<path class="st5" d="M16.1,7.3c1,0,1.9,0.7,2,1.7c0-1.1-0.9-2-2-2s-2,0.9-2,2C14.2,8,15.1,7.2,16.1,7.3z"/>
<path class="st6" d="M16.1,10.7c-1,0-1.9-0.7-2-1.7c0,1.1,0.9,2,2,2s2-0.9,2-2C17.9,9.9,17.1,10.7,16.1,10.7z"/>
</svg>
