<?xml version="1.0" encoding="utf-8"?>
<!-- Generator: Adobe Illustrator 21.0.0, SVG Export Plug-In . SVG Version: 6.00 Build 0)  -->
<svg version="1.1" id="katman_1" xmlns="http://www.w3.org/2000/svg" xmlns:xlink="http://www.w3.org/1999/xlink" x="0px" y="0px"
	 viewBox="0 0 23.3 24" style="enable-background:new 0 0 23.3 24;" xml:space="preserve">
<style type="text/css">
	.st0{fill:#333333;}
	.st1{fill:#C6C6C5;}
	.st2{fill:#9C9B9B;}
	.st3{fill:#D9D9D9;}
	.st4{fill:#B1B1B1;}
	.st5{opacity:0.2;enable-background:new    ;}
	.st6{opacity:0.1;fill:#FFFFFF;enable-background:new    ;}
	.st7{fill:url(#SVGID_1_);}
	.st8{opacity:0.2;}
	.st9{fill:url(#SVGID_2_);}
	.st10{fill:#FFC900;}
</style>
<title>Varlık 20</title>
<path class="st0" d="M5.7,23.3H3.5c-0.2,0-0.4-0.2-0.4-0.4L0,7.7l3.8-3L5.3,0l6.3,1.5L18,0l1.5,4.7l3.8,3l-0.1,0.6L20.7,23
	c0,0.2-0.2,0.4-0.5,0.4L5.7,23.3z"/>
<polygon id="_Yol_" class="st1" points="11.7,7.7 17.9,7.7 17.9,0.1 11.6,1.6 "/>
<polygon id="_Yol_2" class="st2" points="11.7,7.7 5.4,7.7 5.4,0.1 11.6,1.6 "/>
<polygon id="_Yol_3" class="st3" points="1.8,16.4 5.4,16.4 5.4,0.1 3.9,4.8 0.1,7.7 "/>
<polygon id="_Yol_4" class="st3" points="21.5,16.4 17.9,16.4 17.9,0.1 19.4,4.8 23.1,7.7 "/>
<polygon id="_Yol_5" class="st4" points="17.9,16.4 17.9,0.1 19.4,4.8 "/>
<polygon id="_Yol_6" class="st4" points="5.4,16.4 5.4,0.1 3.9,4.8 "/>
<path class="st5" d="M22.3,7.1H5.6H5.5l0,0c-0.1,0-0.2,0.1-0.2,0.2l-1.4,3.4L2.6,7.3C2.5,7.2,2.4,7.1,2.2,7.1H1L0,7.8h2.2
	c0.2,0,0.3,0.1,0.3,0.2l1.3,3.4l1.4-3.4c0-0.1,0.1-0.2,0.2-0.2l0,0h0.1h17.7L22.3,7.1z"/>
<polygon class="st6" points="11.6,1.6 11.6,2.3 17.9,0.9 17.9,0.1 "/>
<polygon class="st6" points="11.7,7.7 11.7,7.7 11.6,1.6 5.4,0.1 5.4,0.9 11.6,2.3 "/>
<linearGradient id="SVGID_1_" gradientUnits="userSpaceOnUse" x1="8.7633" y1="11.7556" x2="-1.9089" y2="5.3962" gradientTransform="matrix(1 0 0 -1 0 23.73)">
	<stop  offset="0" style="stop-color:#E7E6E6"/>
	<stop  offset="0.38" style="stop-color:#C8C7C7"/>
	<stop  offset="0.77" style="stop-color:#ADAEAE"/>
	<stop  offset="1" style="stop-color:#A3A4A4"/>
</linearGradient>
<path class="st7" d="M3.5,23.2h2.1V7.7l-1,5L2.7,8C2.6,7.9,2.5,7.8,2.3,7.8H0.1L3.1,23C3.1,23.1,3.3,23.2,3.5,23.2z"/>
<g class="st8">
	<path d="M3.1,23v-0.1H2.9l0.2,0.8c0,0.2,0.2,0.3,0.4,0.3h2.1v-0.7H3.5C3.3,23.3,3.1,23.2,3.1,23z"/>
</g>
<linearGradient id="SVGID_2_" gradientUnits="userSpaceOnUse" x1="1.8164" y1="8.2458" x2="23.1308" y2="8.2458" gradientTransform="matrix(1 0 0 -1 0 23.73)">
	<stop  offset="0" style="stop-color:#A3A4A4"/>
	<stop  offset="4.000000e-02" style="stop-color:#A7A8A8"/>
	<stop  offset="8.000000e-02" style="stop-color:#B2B2B2"/>
	<stop  offset="0.12" style="stop-color:#C5C5C5"/>
	<stop  offset="0.16" style="stop-color:#DFDEDE"/>
	<stop  offset="0.17" style="stop-color:#E7E6E6"/>
	<stop  offset="0.58" style="stop-color:#E5E4E4"/>
	<stop  offset="0.72" style="stop-color:#DEDEDE"/>
	<stop  offset="0.83" style="stop-color:#D3D2D2"/>
	<stop  offset="0.91" style="stop-color:#C2C2C2"/>
	<stop  offset="0.98" style="stop-color:#ACADAD"/>
	<stop  offset="1" style="stop-color:#A5A6A6"/>
</linearGradient>
<path class="st9" d="M23.1,7.7H5.6C5.5,7.7,5.3,7.8,5.3,8l-3.5,8.3l0.8,4.1l2.8,2.6c0.1,0.1,0.2,0.1,0.2,0.1h14.6
	c0.2,0,0.3-0.1,0.4-0.3L23.1,7.7z"/>
<path class="st5" d="M20.6,22.9L20.6,22.9c0,0.2-0.2,0.4-0.4,0.4H5.7c-0.1,0-0.2,0-0.2-0.1l-2.8-2.6l0,0H2.5l0.1,0.8l2.8,2.6
	C5.5,23.9,5.6,24,5.7,24h14.6c0.2,0,0.3-0.1,0.4-0.3l0.1-0.8L20.6,22.9z"/>
<g id="_Grup_">
	<g id="_Grup_2">
		<path id="_Yol_7" class="st10" d="M6.6,16.6C6.6,16.6,6.6,16.6,6.6,16.6L6.6,16.6L6.6,16.6z"/>
		<path id="_Yol_8" class="st10" d="M6.8,16.4l0.1-0.1L6.8,16.4c-0.1,0,0-0.1,0-0.1C6.7,16.4,6.9,16.4,6.8,16.4z"/>
		<path id="_Yol_9" class="st10" d="M7,16.3C7.1,16.3,7,16.2,7,16.3L7,16.3z"/>
		<path id="_Yol_10" class="st10" d="M11.9,14C11.9,14,11.9,14,11.9,14C11.8,14,11.8,14.1,11.9,14z"/>
		<path id="_Yol_11" class="st10" d="M11.9,14L11.9,14z"/>
		<path id="_Yol_12" class="st10" d="M10.1,14.3c-0.1,0.1-0.1,0.1-0.2,0.1H9.8c-0.1,0.1,0,0.1-0.1,0.1c-0.1,0-0.2,0.1-0.3,0.1
			c0,0,0,0,0-0.1s-0.1,0.1-0.2,0.2l0,0c-0.3,0.2-0.7,0.4-1,0.6l0,0c-0.4,0.2-0.7,0.4-1,0.7c0.2-0.1,0.5-0.2,0.7-0.4
			c0.1,0,0.2-0.1,0.2-0.1c0.3-0.1,0.4-0.3,0.6-0.4c0,0,0,0,0.1,0l-0.2,0.1h0.1c0,0-0.2,0.1-0.2,0.2c0.2-0.1,0.5-0.3,0.6-0.4
			c-0.1,0-0.2,0.1-0.3,0.1c-0.1,0-0.1,0-0.1,0c0.2-0.2,0.5-0.3,0.7-0.4c0.1,0,0.2-0.1,0.2-0.1s0,0,0,0.1c0,0.1,0-0.1,0.1-0.1v0.1
			c0-0.1,0.2-0.1,0.3-0.2c0.1-0.1,0,0.1-0.1,0.1c0.1,0,0.1-0.1,0.1-0.1v0.1c0-0.1,0.1,0,0.2,0c0,0-0.1,0,0-0.1s0,0,0,0
			s0-0.1,0.1-0.1c0.1,0,0,0,0,0.1c0,0,0.1,0,0.1,0c0.1-0.1,0,0,0-0.1c0-0.1,0,0.1,0.1,0.1c-0.1,0.1-0.2,0.1-0.2,0.2l0.2-0.1
			c0,0,0.1,0,0.1,0.1c0.2-0.1,0.4-0.2,0.6-0.3c0,0-0.1,0-0.1,0c0,0,0.1,0,0.1,0s0-0.1,0.1-0.1c0.1,0,0.2,0,0.3,0l0,0
			c0.1,0,0.1-0.1,0.2-0.1c0.1,0,0,0,0,0.1c0,0.1,0.2-0.2,0.2-0.2v0.1c0.1,0,0.1-0.1,0.1,0c0.1-0.1,0.3-0.2,0.4-0.3l0,0
			c0-0.1,0.3-0.1,0.3-0.2l0,0l0.1-0.1c0.1-0.1,0.2-0.1,0.3-0.1c0-0.1,0.1-0.1,0.3-0.2c0.6-0.2,1.2-0.5,1.7-0.7
			c0.1,0,0.2-0.1,0.3-0.2c-0.1,0-0.2,0-0.3,0.1c-0.1,0-0.1,0-0.2,0h0c-0.1,0.1-0.1,0-0.2,0.1v-0.1c0,0-0.1,0-0.2,0v0.1
			c-0.1,0-0.1,0-0.2,0l0,0c0,0-0.3,0.1-0.2,0s0,0-0.1,0.1l0,0c-0.1,0-0.1,0.1-0.2,0.1c0,0,0-0.1,0-0.1c-0.3,0.1,0,0.2-0.3,0.3l0,0
			l0,0.1h-0.1c-0.1,0.1-0.4,0.1-0.5,0.3c-0.1,0.1-0.2,0-0.3,0.1l0,0c-0.1,0-0.5,0.1-0.6,0s0,0,0,0c-0.1,0.1-0.2,0.1-0.3,0.1
			c-0.1,0,0.1,0,0,0s-0.1,0.1-0.3,0.2c0,0,0,0,0.1-0.1c-0.2,0.1-0.4,0.2-0.6,0.3l-0.9,0.3l0,0c-0.1,0-0.2,0.1-0.4,0.2L10.1,14.3z"/>
		<path id="_Yol_13" class="st10" d="M8.6,15.5L8.6,15.5l0.1-0.1C8.7,15.5,8.7,15.5,8.6,15.5z"/>
		<polygon id="_Yol_14" class="st10" points="8.6,15.4 8.5,15.4 8.6,15.4 		"/>
		<polygon id="_Yol_15" class="st10" points="10.2,14.7 10.2,14.7 10,14.8 		"/>
		<path id="_Yol_16" class="st10" d="M11.9,14.1C11.9,14.1,11.9,14.1,11.9,14.1L11.9,14.1L11.9,14.1z"/>
		<path id="_Yol_17" class="st10" d="M13.1,13.8C13.1,13.7,13.2,13.8,13.1,13.8C13,13.6,13.1,13.7,13.1,13.8z"/>
		<path id="_Yol_18" class="st10" d="M13.3,13.5C13.3,13.6,13.2,13.6,13.3,13.5C13.3,13.6,13.3,13.6,13.3,13.5z"/>
	</g>
	<g id="_Grup_3">
		<path id="_Yol_19" class="st10" d="M7.2,17.6C7.2,17.6,7.2,17.6,7.2,17.6L7.2,17.6L7.2,17.6z"/>
		<path id="_Yol_20" class="st10" d="M7.4,17.5l0.1-0.1L7.4,17.5c-0.1,0,0-0.1,0-0.1C7.3,17.4,7.4,17.4,7.4,17.5z"/>
		<path id="_Yol_21" class="st10" d="M7.6,17.3C7.7,17.3,7.6,17.2,7.6,17.3C7.6,17.2,7.6,17.3,7.6,17.3z"/>
		<path id="_Yol_22" class="st10" d="M12.7,14.9L12.7,14.9C12.6,14.9,12.6,14.9,12.7,14.9z"/>
		<path id="_Yol_23" class="st10" d="M12.6,14.9L12.6,14.9z"/>
		<path id="_Yol_24" class="st10" d="M10.8,15.2c-0.1,0.1-0.1,0.1-0.2,0.1h-0.1c-0.1,0.1,0,0.1-0.1,0.1c-0.1,0-0.2,0.1-0.3,0.1
			c0,0,0,0,0-0.1s-0.1,0.1-0.2,0.2l0,0c-0.3,0.2-0.7,0.4-1,0.7l0,0c-0.4,0.2-0.7,0.5-1,0.8c0.3-0.1,0.5-0.3,0.7-0.4
			c0.1,0,0.2-0.1,0.2-0.1c0.3-0.1,0.4-0.3,0.7-0.4c0,0,0,0,0.1,0l-0.2,0.1l0.1-0.1c0,0-0.2,0.1-0.2,0.2c0.2-0.2,0.5-0.3,0.6-0.4
			c-0.1,0-0.2,0.1-0.3,0.1c-0.1,0-0.1,0-0.1,0c0.2-0.2,0.5-0.3,0.8-0.5c0.1,0,0.2-0.1,0.2-0.1s0,0,0,0.1c0,0.1,0-0.1,0.1-0.1v0.1
			c0-0.1,0.2-0.1,0.3-0.2c0.1-0.1,0,0.1-0.1,0.1c0.1,0,0.1-0.1,0.2-0.1v0.1c0-0.1,0.1-0.1,0.2,0c0.1,0-0.1,0,0-0.1s0,0,0,0
			s0-0.1,0.1-0.1c0.1,0,0,0,0,0.1c0,0,0.1,0,0.1,0c0.1-0.1,0,0,0-0.1c0-0.1,0,0.1,0.1,0.1c-0.1,0.1-0.2,0.1-0.2,0.2l0.2-0.1
			c0,0,0.1,0,0.1,0.1c0.2-0.1,0.4-0.2,0.6-0.3H12c0,0,0.1,0,0.1,0c0,0,0-0.1,0.1-0.1c0.1,0,0.2,0,0.3,0l0,0c0.1,0,0.1-0.1,0.2-0.1
			s0,0,0,0.1c0,0.1,0.1,0,0.2,0V15c0.1,0,0.1-0.1,0.1,0c0.1-0.1,0.3-0.2,0.4-0.2l0,0c0.1-0.1,0.3-0.1,0.3-0.2l0,0l0.1-0.1
			c0.1-0.1,0.2-0.1,0.4-0.1c0-0.1,0.2-0.1,0.3-0.2c0.6-0.2,1.3-0.4,1.8-0.6c0.1,0,0.2-0.1,0.3-0.2c-0.1,0-0.2,0-0.3,0.1
			c-0.1,0-0.1,0-0.2-0.1h0c-0.1,0.1-0.1,0-0.2,0.1v-0.1c0,0-0.1,0-0.2,0v0.1c-0.1,0-0.1,0-0.2,0l0,0c0,0-0.3,0.1-0.2,0
			c0,0-0.1,0.1-0.1,0.1l0,0c-0.1,0-0.1,0.1-0.2,0c0,0,0,0,0-0.1c-0.3,0.1,0,0.2-0.3,0.3l0,0l-0.1,0.1h-0.1c-0.1,0.1-0.4,0.1-0.5,0.2
			c-0.1,0.1-0.2,0-0.3,0l0,0c-0.1,0-0.5,0.1-0.6,0s0,0,0,0c-0.2,0.1-0.2,0-0.3,0.1c-0.1,0,0.1,0,0,0s-0.1,0.1-0.3,0.2
			c0,0,0,0,0.1-0.1c-0.2,0.1-0.4,0.2-0.6,0.3c-0.3,0.1-0.6,0.2-1,0.3l0,0c-0.1,0-0.2,0.1-0.4,0.2L10.8,15.2z"/>
		<path id="_Yol_25" class="st10" d="M9.3,16.5L9.3,16.5l0.1-0.1C9.4,16.4,9.3,16.4,9.3,16.5z"/>
		<polygon id="_Yol_26" class="st10" points="9.2,16.3 9.2,16.4 9.3,16.3 		"/>
		<polygon id="_Yol_27" class="st10" points="10.9,15.6 10.9,15.6 10.7,15.7 		"/>
		<path id="_Yol_28" class="st10" d="M12.7,14.9C12.7,14.9,12.6,14.9,12.7,14.9L12.7,14.9L12.7,14.9z"/>
		<path id="_Yol_29" class="st10" d="M13.9,14.7C13.9,14.6,14,14.7,13.9,14.7C13.8,14.5,13.9,14.6,13.9,14.7z"/>
		<path id="_Yol_30" class="st10" d="M14.1,14.4C14.1,14.5,14.1,14.5,14.1,14.4C14.1,14.5,14.1,14.5,14.1,14.4z"/>
	</g>
	<g id="_Grup_4">
		<path id="_Yol_31" class="st10" d="M8.2,18.4C8.2,18.4,8.2,18.4,8.2,18.4L8.2,18.4L8.2,18.4z"/>
		<path id="_Yol_32" class="st10" d="M8.5,18.3l0.1-0.1L8.5,18.3c-0.1,0,0-0.1,0-0.1C8.3,18.2,8.5,18.2,8.5,18.3z"/>
		<path id="_Yol_33" class="st10" d="M8.6,18.1C8.7,18.1,8.6,18,8.6,18.1C8.6,18,8.6,18.1,8.6,18.1z"/>
		<path id="_Yol_34" class="st10" d="M13.2,16.1L13.2,16.1C13.1,16.1,13.1,16.1,13.2,16.1z"/>
		<path id="_Yol_35" class="st10" d="M13.1,16.1L13.1,16.1z"/>
		<path id="_Yol_36" class="st10" d="M11.5,16.3c-0.1,0-0.1,0.1-0.2,0.1h-0.1c-0.1,0,0,0.1-0.1,0.1c-0.1,0-0.2,0.1-0.3,0.1
			c0,0,0,0,0-0.1s-0.1,0.1-0.2,0.2l0,0c-0.3,0.2-0.6,0.3-1,0.5l0,0c-0.3,0.2-0.7,0.4-0.9,0.7c0.2-0.1,0.5-0.2,0.6-0.4
			c0.1,0,0.2-0.1,0.2-0.1c0.3-0.1,0.3-0.2,0.6-0.4c0,0,0,0,0.1,0l-0.2,0.1h0.1c0,0-0.2,0.1-0.2,0.1c0.2-0.1,0.5-0.2,0.6-0.4
			c-0.1,0-0.2,0.1-0.3,0.1s-0.1,0-0.1,0c0.2-0.1,0.5-0.3,0.7-0.4c0.1,0,0.1-0.1,0.2,0c0,0,0,0,0,0.1c0,0.1,0-0.1,0.1-0.1v0.1
			c0-0.1,0.2-0.1,0.2-0.1c0.1-0.1,0,0.1-0.1,0.1c0.1,0,0.1-0.1,0.1-0.1v0.1c0-0.1,0.1,0,0.2,0c0,0-0.1,0,0-0.1c0.1,0,0,0,0,0
			c0,0,0-0.1,0.1-0.1c0,0,0,0,0,0.1c0,0,0.1,0,0.1,0c0.1-0.1,0,0,0-0.1c0-0.1,0,0.1,0.1,0.1c0.1,0-0.2,0.1-0.2,0.2l0.2-0.1
			c0,0,0.1,0,0.1,0.1c0.2-0.1,0.4-0.2,0.5-0.3h-0.1c0,0,0.1,0,0.1,0s0-0.1,0-0.1c0.1,0,0.2,0,0.3,0l0,0c0.1,0,0.1-0.1,0.2-0.1
			c0.1,0,0,0,0,0.1c0,0.1,0.1,0,0.1,0v0.1c0.1,0,0.1-0.1,0.1,0c0.1-0.1,0.3-0.2,0.4-0.2l0,0c0-0.1,0.2-0.1,0.3-0.2l0,0l0.1-0.1
			c0.1-0.1,0.2-0.1,0.3-0.1c0-0.1,0.1-0.1,0.2-0.2c0.5-0.2,1-0.5,1.5-0.8c0.1,0,0.1-0.1,0.2-0.2c-0.1,0-0.1,0.1-0.2,0.1
			s-0.1,0-0.2,0H16c-0.1,0.1-0.1,0-0.1,0.1v-0.1c0,0-0.1,0.1-0.1,0v0.1c-0.1,0-0.1,0-0.2,0l0,0c0,0-0.3,0.1-0.2,0c0-0.1,0,0-0.1,0.1
			l0,0c-0.1,0-0.1,0.1-0.2,0.1c0,0,0-0.1,0-0.1c-0.3,0.1,0,0.2-0.2,0.3l0,0v0.1h-0.1c0,0.1-0.3,0.1-0.5,0.2c-0.1,0.1-0.1,0-0.3,0.1
			l0,0c-0.1,0-0.4,0.1-0.6,0c-0.1-0.1,0,0,0,0c-0.1,0.1-0.2,0-0.3,0.1c-0.1,0,0.1,0,0,0c-0.1,0-0.1,0.1-0.3,0.2c0,0,0,0,0-0.1
			c-0.2,0.1-0.4,0.2-0.6,0.3C12.1,16,11.8,16.1,11.5,16.3L11.5,16.3c0-0.1-0.1,0-0.3,0.1L11.5,16.3z"/>
		<path id="_Yol_37" class="st10" d="M10.1,17.4L10.1,17.4l0.1-0.1C10.2,17.3,10.2,17.4,10.1,17.4z"/>
		<polygon id="_Yol_38" class="st10" points="10.1,17.3 10,17.3 10.1,17.3 		"/>
		<polygon id="_Yol_39" class="st10" points="11.6,16.7 11.6,16.7 11.4,16.8 		"/>
		<path id="_Yol_40" class="st10" d="M13.2,16.1C13.2,16.1,13.1,16.1,13.2,16.1L13.2,16.1L13.2,16.1z"/>
		<path id="_Yol_41" class="st10" d="M14.3,15.8C14.3,15.7,14.4,15.8,14.3,15.8C14.2,15.7,14.3,15.8,14.3,15.8z"/>
		<path id="_Yol_42" class="st10" d="M14.5,15.6C14.4,15.6,14.4,15.6,14.5,15.6C14.5,15.7,14.5,15.6,14.5,15.6z"/>
	</g>
</g>
<path class="st6" d="M5.6,8.5H23l0.1-0.7H5.6C5.5,7.7,5.3,7.8,5.3,8l-3.5,8.3l0.1,0.5l3.4-8.2C5.3,8.6,5.5,8.5,5.6,8.5z"/>
<path class="st6" d="M2.3,8.5c0.2,0,0.3,0.1,0.3,0.2l1.1,2.9l0.1-0.3l0,0L2.7,8C2.6,7.9,2.5,7.8,2.3,7.8H0.1l0.1,0.7L2.3,8.5z"/>
</svg>
