<?xml version="1.0" encoding="utf-8"?>
<!-- Generator: Adobe Illustrator 21.0.0, SVG Export Plug-In . SVG Version: 6.00 Build 0)  -->
<svg version="1.1" id="katman_1" xmlns="http://www.w3.org/2000/svg" xmlns:xlink="http://www.w3.org/1999/xlink" x="0px" y="0px"
	 viewBox="0 0 63 63.2" style="enable-background:new 0 0 63 63.2;" xml:space="preserve">
<style type="text/css">
	.st0{opacity:0.7;fill:#2C5879;enable-background:new    ;}
	.st1{fill:url(#SVGID_1_);}
	.st2{fill:#F1F2F2;}
	.st3{opacity:0.1;fill:#FFFFFF;enable-background:new    ;}
	.st4{opacity:0.1;fill:#020202;enable-background:new    ;}
	.st5{fill:url(#SVGID_2_);}
	.st6{fill:url(#SVGID_3_);}
</style>
<title>web-browser</title>
<path class="st0" d="M29.8,59.7C13.3,59.7,0,46.3,0,29.8S13.3,0,29.8,0s29.8,13.4,29.8,29.8l0,0C59.7,46.3,46.3,59.7,29.8,59.7z
	 M42,45.5c-1.9,4.3-4.7,8.2-8,11.5c5.8-0.9,11.2-3.6,15.3-7.8C47,47.6,44.6,46.4,42,45.5z M10.4,49.1c4.1,4.2,9.5,6.9,15.3,7.8
	c-3.3-3.3-6.1-7.2-8-11.5C15.1,46.4,12.7,47.6,10.4,49.1z M31,56.4c3.7-3.3,6.6-7.2,8.7-11.7c-2.8-0.8-5.8-1.3-8.7-1.4V56.4z
	 M20,44.7c2.1,4.4,5,8.4,8.7,11.7v-13C25.7,43.4,22.8,43.9,20,44.7z M43,43.2c2.8,1,5.5,2.4,8,4.1c3.8-4.6,6-10.3,6.2-16.3H45.3
	C45.2,35.2,44.4,39.3,43,43.2L43,43.2z M2.4,31c0.3,6,2.5,11.7,6.3,16.3c2.5-1.7,5.2-3,8-4.1c-1.5-3.9-2.3-8-2.4-12.2H2.4z M16.8,31
	c0.1,3.9,0.9,7.8,2.2,11.5c3.1-0.9,6.3-1.4,9.6-1.5V31H16.8z M31,40.9c3.3,0.1,6.5,0.6,9.6,1.5c1.4-3.7,2.2-7.5,2.3-11.5H31V40.9z
	 M57.2,28.6c-0.3-6.3-2.7-12.2-6.8-16.9c-2.4,1.6-5.1,2.9-7.8,3.9c1.7,4.2,2.6,8.6,2.8,13.1H57.2z M42.9,28.6
	c-0.1-4.2-1-8.4-2.6-12.3c-3,0.9-6.1,1.3-9.3,1.4v10.9H42.9z M28.6,28.6V17.7c-3.1-0.1-6.2-0.6-9.2-1.4c-1.6,3.9-2.5,8.1-2.6,12.3
	L28.6,28.6z M14.3,28.6c0.1-4.5,1.1-8.9,2.7-13.1c-2.7-1-5.4-2.3-7.8-3.9c-4.1,4.7-6.6,10.7-6.8,16.9H14.3z M20.4,14.1
	c2.7,0.7,5.4,1.2,8.2,1.2v-12C25.2,6.4,22.4,10,20.4,14.1z M31,15.3c2.8-0.1,5.5-0.5,8.2-1.2c-2-4.1-4.8-7.7-8.2-10.8V15.3z M11,9.9
	c2.2,1.4,4.6,2.5,7.1,3.4c1.9-4,4.5-7.5,7.6-10.6C20.2,3.6,15,6.1,11,9.9z M34,2.7c3.1,3.1,5.7,6.7,7.6,10.6c2.5-0.9,4.9-2,7.1-3.4
	C44.6,6.1,39.5,3.6,34,2.7z"/>
<linearGradient id="SVGID_1_" gradientUnits="userSpaceOnUse" x1="29.83" y1="5.65" x2="29.83" y2="61.99" gradientTransform="matrix(1 0 0 -1 0 63.73)">
	<stop  offset="0" style="stop-color:#2D5879"/>
	<stop  offset="1" style="stop-color:#2C6E95"/>
</linearGradient>
<path class="st1" d="M58.5,29.8c0,15.8-12.8,28.6-28.6,28.6S1.2,45.7,1.2,29.8S14,1.2,29.8,1.2c0,0,0,0,0,0
	C45.6,1.2,58.5,14,58.5,29.8z"/>
<path class="st2" d="M29.8,59.2C13.6,59.2,0.5,46,0.5,29.8c0-16.2,13.1-29.3,29.3-29.3c16.2,0,29.3,13.1,29.3,29.3v0
	C59.2,46,46,59.2,29.8,59.2z M9.6,49c4.6,4.9,10.9,8,17.6,8.6c-3.9-3.6-7.1-7.9-9.2-12.8C15,45.8,12.2,47.2,9.6,49z M41.7,44.8
	c-2.1,4.9-5.3,9.2-9.2,12.8c6.7-0.6,13-3.7,17.6-8.6C47.5,47.3,44.7,45.9,41.7,44.8L41.7,44.8z M30.5,57.5c4.2-3.6,7.6-8,9.8-13.1
	c-3.2-1-6.5-1.5-9.9-1.6L30.5,57.5z M19.3,44.4c2.2,5.1,5.6,9.5,9.9,13.1V42.8C25.8,42.9,22.5,43.4,19.3,44.4z M42.3,43.5
	c3.1,1.1,6,2.6,8.7,4.5c4.2-4.9,6.5-11,6.7-17.4H44.8C44.8,35,43.9,39.4,42.3,43.5L42.3,43.5z M1.9,30.5C2.1,36.9,4.4,43.1,8.6,48
	c2.7-1.9,5.7-3.4,8.8-4.5c-1.6-4.1-2.5-8.5-2.6-13L1.9,30.5z M30.5,41.4c3.5,0.1,7,0.6,10.4,1.7c1.6-4,2.4-8.2,2.5-12.5H30.5V41.4z
	 M16.2,30.5c0.1,4.3,0.9,8.5,2.5,12.5c3.4-1,6.9-1.6,10.4-1.7V30.5H16.2z M57.8,29.1C57.6,22.4,55,16,50.5,11.1
	c-2.7,1.8-5.5,3.2-8.6,4.2c1.9,4.4,2.8,9.1,2.9,13.9H57.8z M43.4,29.1c-0.1-4.6-1.1-9.2-2.9-13.4c-3.2,1-6.6,1.5-10,1.6v11.9
	L43.4,29.1z M29.1,29.1V17.3c-3.4-0.1-6.8-0.6-10-1.6c-1.8,4.3-2.8,8.8-2.9,13.4L29.1,29.1z M14.8,29.1c0.1-4.8,1.1-9.5,2.9-13.9
	c-3-1-5.9-2.4-8.6-4.2c-4.5,5-7.1,11.4-7.3,18.1L14.8,29.1z M19.7,14.4c3.1,0.9,6.2,1.4,9.4,1.4V2.2C25.1,5.5,21.9,9.7,19.7,14.4
	L19.7,14.4z M30.5,15.8c3.2-0.1,6.4-0.5,9.5-1.4c-2.2-4.7-5.5-8.9-9.5-12.2L30.5,15.8z M10.2,10c2.5,1.7,5.3,3,8.1,4
	c2.1-4.6,5.1-8.6,8.8-12C20.7,2.6,14.7,5.5,10.2,10z M32.5,2c3.7,3.4,6.7,7.4,8.8,12c2.9-1,5.6-2.3,8.1-4C44.9,5.5,38.9,2.6,32.5,2z
	"/>
<path class="st3" d="M29.8,2.5c15.8,0,28.8,12.5,29.3,28.3c0-0.3,0-0.7,0-1C59.4,13.6,46.6,0.3,30.4,0S0.8,12.6,0.5,28.8
	c0,0.4,0,0.7,0,1.1c0,0.3,0,0.7,0,1C1,15,14,2.5,29.8,2.5z"/>
<path class="st4" d="M29.8,59.2C14,59.2,1.1,46.6,0.5,30.8c0,0.3,0,0.7,0,1C0.2,48,13.1,61.4,29.3,61.7s29.6-12.6,29.9-28.8
	c0-0.4,0-0.7,0-1.1c0-0.3,0-0.7,0-1C58.6,46.7,45.7,59.2,29.8,59.2z"/>
<path class="st4" d="M35,58.2h-6.9c-1,0-1.9-0.8-1.9-1.9v2c0,1,0.8,1.9,1.9,1.9H35c1,0,1.9-0.8,1.9-1.9v-2
	C36.9,57.4,36,58.2,35,58.2z"/>
<path class="st4" d="M60,35.2v-2c0,1-0.8,1.9-1.9,1.9H44.3l2,2h11.8C59.1,37.1,60,36.2,60,35.2C60,35.2,60,35.2,60,35.2z"/>
<path class="st4" d="M62.4,55.9l-4.8,4.8c-0.7,0.7-1.9,0.7-2.7,0L36.8,42.6v2L55,62.7c0.7,0.7,1.9,0.7,2.7,0l4.8-4.8
	c0.6-0.6,0.7-1.6,0.3-2.3C62.7,55.7,62.5,55.8,62.4,55.9z"/>
<linearGradient id="SVGID_2_" gradientUnits="userSpaceOnUse" x1="28.1436" y1="40.4147" x2="59.1636" y2="3.0247" gradientTransform="matrix(1 0 0 -1 0 63.73)">
	<stop  offset="0" style="stop-color:#2C6E95"/>
	<stop  offset="0.54" style="stop-color:#2D6083"/>
	<stop  offset="1" style="stop-color:#2D5879"/>
</linearGradient>
<path class="st5" d="M56.3,61.2c-0.5,0-0.9-0.2-1.3-0.6L36.8,42.6v13.8c0,1-0.8,1.9-1.8,1.9h-6.9c-1,0-1.9-0.8-1.9-1.9v-29
	c0-1.5,1.3-2.8,2.8-2.8h29c1,0,1.9,0.8,1.9,1.8c0,0,0,0,0,0v6.8c0,1-0.8,1.9-1.9,1.9H44.3l18.1,18.1c0.7,0.7,0.7,1.9,0,2.7l-4.8,4.8
	C57.3,61,56.8,61.2,56.3,61.2z"/>
<linearGradient id="SVGID_3_" gradientUnits="userSpaceOnUse" x1="33.3019" y1="37.4144" x2="59.062" y2="-1.8856" gradientTransform="matrix(1 0 0 -1 0 63.73)">
	<stop  offset="0" style="stop-color:#E8E6E5"/>
	<stop  offset="0.25" style="stop-color:#E4E2E1"/>
	<stop  offset="0.48" style="stop-color:#D9D7D6"/>
	<stop  offset="0.72" style="stop-color:#C5C4C4"/>
	<stop  offset="0.95" style="stop-color:#AAAAAA"/>
	<stop  offset="1" style="stop-color:#A3A3A3"/>
</linearGradient>
<path class="st6" d="M35.9,56.3V40.2L55.7,60c0.4,0.4,0.9,0.4,1.3,0l4.8-4.8c0.4-0.4,0.4-0.9,0-1.3L42,34.1h16.1
	c0.5,0,0.9-0.4,0.9-0.9v-6.8c0-0.5-0.4-0.9-0.9-0.9h-29c-1,0-1.8,0.8-1.8,1.8v29c0,0.5,0.4,0.9,0.9,0.9H35
	C35.5,57.2,35.8,56.8,35.9,56.3z"/>
<path class="st3" d="M29.1,27.5h29c0.5,0,0.9,0.4,0.9,0.9v-2c0-0.5-0.4-0.9-0.9-0.9h-29c-1,0-1.8,0.8-1.8,1.8v2
	C27.2,28.3,28.1,27.5,29.1,27.5C29.1,27.5,29.1,27.5,29.1,27.5z"/>
</svg>
