<?xml version="1.0" encoding="utf-8"?>
<!-- Generator: Adobe Illustrator 21.0.0, SVG Export Plug-In . SVG Version: 6.00 Build 0)  -->
<svg version="1.1" id="katman_1" xmlns="http://www.w3.org/2000/svg" xmlns:xlink="http://www.w3.org/1999/xlink" x="0px" y="0px"
	 viewBox="0 0 46.9 48" style="enable-background:new 0 0 46.9 48;" xml:space="preserve">
<style type="text/css">
	.st0{opacity:0.7;fill:#42210B;enable-background:new    ;}
	.st1{fill:url(#SVGID_1_);}
	.st2{opacity:0.2;fill:#FFFFFF;enable-background:new    ;}
	.st3{opacity:0.2;enable-background:new    ;}
	.st4{fill:#FFFFFF;}
</style>
<title>access_1</title>
<path class="st0" d="M3.3,0h40.2c1.9,0,3.3,1.5,3.3,3.3v40.2c0,1.9-1.5,3.3-3.3,3.3H3.3c-1.9,0-3.3-1.5-3.3-3.3V3.4
	C0,1.5,1.5,0,3.3,0z"/>
<linearGradient id="SVGID_1_" gradientUnits="userSpaceOnUse" x1="23.46" y1="1.55" x2="23.46" y2="46.99" gradientTransform="matrix(1 0 0 -1 0 47.73)">
	<stop  offset="0" style="stop-color:#F6A000"/>
	<stop  offset="3.000000e-02" style="stop-color:#F6A307"/>
	<stop  offset="0.13" style="stop-color:#F7AB1F"/>
	<stop  offset="0.25" style="stop-color:#F7B130"/>
	<stop  offset="0.37" style="stop-color:#F7B53A"/>
	<stop  offset="0.53" style="stop-color:#F7B63D"/>
	<stop  offset="0.66" style="stop-color:#F7B539"/>
	<stop  offset="0.77" style="stop-color:#F7B12E"/>
	<stop  offset="0.89" style="stop-color:#F6AA1B"/>
	<stop  offset="1" style="stop-color:#F6A001"/>
	<stop  offset="1" style="stop-color:#F6A000"/>
</linearGradient>
<path class="st1" d="M3.3,0.7h40.2c1.4,0,2.6,1.2,2.6,2.6v40.2c0,1.4-1.2,2.6-2.6,2.6H3.3c-1.4,0-2.6-1.2-2.6-2.6V3.3
	C0.7,1.9,1.9,0.7,3.3,0.7z"/>
<path class="st2" d="M43.7,0.4H3.3c-1.6,0-2.9,1.3-2.9,2.9v1.4c0-1.6,1.3-2.9,2.9-2.9h40.4c1.6,0,2.9,1.3,2.9,2.9V3.3
	C46.6,1.7,45.3,0.4,43.7,0.4C43.7,0.4,43.7,0.4,43.7,0.4z"/>
<path class="st3" d="M43.7,46.6H3.3c-1.6,0-2.9-1.3-2.9-2.9c0,0,0,0,0,0v1.4c0,1.6,1.3,2.9,2.9,2.9c0,0,0,0,0,0h40.4
	c1.6,0,2.9-1.3,2.9-2.9v-1.4C46.6,45.3,45.3,46.6,43.7,46.6C43.7,46.6,43.7,46.6,43.7,46.6z"/>
<path class="st4" d="M16.4,19.6v-1.3c-1.4-1.1-2.2-2.8-2.2-4.6c0-3.3,2.7-6.1,6-6.1s6.1,2.7,6.1,6c0,0,0,0,0,0
	c0,1.4-0.5,2.8-1.4,3.8c0.4,0,0.8,0.1,1.2,0.2c0.9-1.2,1.3-2.7,1.3-4.2c0-3.9-3.2-7.1-7.2-7.1c-3.9,0-7.1,3.2-7.1,7.1
	C13.1,16,14.3,18.3,16.4,19.6z"/>
<path class="st4" d="M25.2,13.6c-0.4-2.7-2.9-4.6-5.7-4.2c-2.2,0.3-3.9,2-4.2,4.2c0,1.1,0.4,2.2,1.1,3.1v-3.1c0-2.1,1.7-3.9,3.9-3.9
	s3.9,1.7,3.9,3.9v3.1C24.8,15.8,25.2,14.7,25.2,13.6z"/>
<path class="st4" d="M33.4,21.8c-0.6,0-1.2,0.2-1.6,0.5c0-1.5-1.2-2.7-2.7-2.7c0,0-0.1,0-0.1,0c-0.7,0-1.3,0.2-1.9,0.6
	c-0.5-1.4-2.1-2.1-3.5-1.5c-0.2,0.1-0.4,0.2-0.6,0.3v-5.5c0-1.5-1.2-2.8-2.8-2.8s-2.8,1.2-2.8,2.8v9.8c-2.2-2-4.6-3.5-6.2-2
	c-2.2,2.2,2.4,6.5,5.9,13c2.5,4.5,6.1,6.2,9.6,6.2c5.2,0,9.3-4.2,9.4-9.3c0,0,0,0,0,0v-6.6C36.2,23.1,35,21.8,33.4,21.8
	C33.5,21.8,33.5,21.8,33.4,21.8L33.4,21.8z"/>
<path class="st4" d="M35.1,27"/>
<path class="st3" d="M20.2,7.6c-3.3,0-6,2.7-6.1,6c0,0.1,0,0.2,0,0.3c0-3.3,2.7-6,6-6s6,2.7,6,6c0-0.1,0-0.2,0-0.4
	C26.2,10.3,23.5,7.7,20.2,7.6z"/>
<path class="st3" d="M16.4,20.3v-0.7c-1.9-1.3-3.2-3.4-3.3-5.7c0,0.1,0,0.3,0,0.4C13.1,16.7,14.3,19,16.4,20.3z"/>
<path class="st3" d="M26.1,17.7c-0.3-0.1-0.5-0.1-0.7-0.2c-0.1,0.2-0.3,0.5-0.5,0.7c0.4,0,0.8,0.1,1.2,0.2c0.9-1.2,1.3-2.7,1.3-4.2
	c0-0.1,0-0.2,0-0.3C27.3,15.3,26.9,16.6,26.1,17.7z"/>
<path class="st3" d="M24.1,13.6c0-2.1-1.7-3.9-3.8-3.9s-3.9,1.7-3.9,3.8c0,0,0,0,0,0v0.7c0-2.1,1.7-3.9,3.9-3.9s3.9,1.7,3.9,3.9
	L24.1,13.6z"/>
<path class="st3" d="M24.1,16.6v0.7c0.7-0.9,1.1-2,1.1-3.1c0-0.1,0-0.2,0-0.3C25.1,14.9,24.7,15.9,24.1,16.6z"/>
<path class="st3" d="M16.4,17.4v-0.7c-0.6-0.8-1-1.7-1.1-2.7c0,0.1,0,0.2,0,0.3C15.3,15.4,15.7,16.5,16.4,17.4z"/>
<path class="st3" d="M26.8,40.5c-3.5,0-7-1.7-9.6-6.2c-2.6-4.8-5.8-8.4-6.4-10.8c-0.8,2.4,3.2,6.4,6.4,12.2c2.5,4.5,6,6.2,9.6,6.2
	c5.2,0,9.3-4.2,9.4-9.3c0,0,0,0,0,0v-1.5C36.2,36.3,32,40.5,26.8,40.5C26.8,40.5,26.8,40.5,26.8,40.5z"/>
</svg>
