<?xml version="1.0" encoding="utf-8"?>
<!-- Generator: Adobe Illustrator 21.0.0, SVG Export Plug-In . SVG Version: 6.00 Build 0)  -->
<svg version="1.1" id="katman_1" xmlns="http://www.w3.org/2000/svg" xmlns:xlink="http://www.w3.org/1999/xlink" x="0px" y="0px"
	 viewBox="0 0 17 22" style="enable-background:new 0 0 17 22;" xml:space="preserve">
<style type="text/css">
	.st0{opacity:0.2;enable-background:new    ;}
	.st1{fill:url(#SVGID_1_);}
	.st2{opacity:0.1;enable-background:new    ;}
	.st3{fill:#F5F5F5;}
	.st4{opacity:0.1;fill:#FFFFFF;enable-background:new    ;}
	.st5{opacity:0.5;enable-background:new    ;}
</style>
<title>libreoffice-writer_6</title>
<path class="st0" d="M0,20.1v0.8C0,21.5,0.5,22,1.2,22h14.7c0.6,0,1.2-0.5,1.2-1.1c0,0,0,0,0,0v-0.8c0,0.6-0.5,1.2-1.2,1.2H1.2
	C0.5,21.2,0,20.7,0,20.1z"/>
<linearGradient id="SVGID_1_" gradientUnits="userSpaceOnUse" x1="8.5" y1="1.6698" x2="8.5" y2="23.2902" gradientTransform="matrix(1 0 0 -1 0 23.29)">
	<stop  offset="0" style="stop-color:#3B4184"/>
	<stop  offset="1" style="stop-color:#395DA8"/>
</linearGradient>
<path class="st1" d="M17,20.5V1.2C17,0.5,16.5,0,15.8,0c0,0,0,0,0,0H1.2C0.5,0,0,0.5,0,1.2c0,0,0,0,0,0v19.3c0,0.6,0.5,1.2,1.2,1.2
	h14.7C16.5,21.6,17,21.1,17,20.5C17,20.5,17,20.5,17,20.5z"/>
<path class="st2" d="M1.5,1.9v18.5h13.9v-12L8.9,2L1.5,1.9z M11.1,1.9l4.3,4.3V1.9H11.1z"/>
<path class="st3" d="M1.5,1.5v18.5h13.9V8L8.9,1.5L1.5,1.5z M11.1,1.5l4.3,4.3V1.5H11.1z"/>
<path class="st4" d="M1.2,0C0.5,0,0,0.5,0,1.2c0,0,0,0,0,0v0.4c0-0.6,0.5-1.2,1.2-1.2l0,0h14.7c0.6,0,1.2,0.5,1.2,1.1c0,0,0,0,0,0
	V1.2C17,0.5,16.5,0,15.8,0c0,0,0,0,0,0H1.2z"/>
<path class="st5" d="M3.9,17v-0.8H10V17H3.9z M3.9,14.7v-0.8h9.3v0.8H3.9z M3.9,12.4v-0.8h9.3v0.8L3.9,12.4z M3.9,10V9.3h9.3V10
	L3.9,10z"/>
<path class="st4" d="M3.9,17.3v-0.8H10v0.8H3.9z M3.9,15v-0.8h9.3V15L3.9,15z M3.9,12.7v-0.8h9.3v0.8H3.9z M3.9,10.4V9.6h9.3v0.8
	L3.9,10.4z"/>
</svg>
