<?xml version="1.0" encoding="utf-8"?>
<!-- Generator: Adobe Illustrator 21.0.0, SVG Export Plug-In . SVG Version: 6.00 Build 0)  -->
<svg version="1.1" id="katman_1" xmlns="http://www.w3.org/2000/svg" xmlns:xlink="http://www.w3.org/1999/xlink" x="0px" y="0px"
	 viewBox="0 0 46.6 48" style="enable-background:new 0 0 46.6 48;" xml:space="preserve">
<style type="text/css">
	.st0{fill:#333333;}
	.st1{fill:url(#SVGID_1_);}
	.st2{opacity:0.2;fill:#FFFFFF;enable-background:new    ;}
	.st3{opacity:0.2;enable-background:new    ;}
	.st4{opacity:0.5;enable-background:new    ;}
	.st5{fill:url(#SVGID_2_);}
	.st6{fill:url(#SVGID_3_);}
	.st7{fill:url(#SVGID_4_);}
	.st8{fill:url(#SVGID_5_);}
	.st9{fill:url(#SVGID_6_);}
</style>
<title>avatar-default_1</title>
<path class="st0" d="M23.3,46.6C10.4,46.6,0,36.2,0,23.3S10.4,0,23.3,0s23.3,10.4,23.3,23.3l0,0C46.6,36.2,36.2,46.6,23.3,46.6z"/>
<linearGradient id="SVGID_1_" gradientUnits="userSpaceOnUse" x1="23.32" y1="1.82" x2="23.32" y2="48.19" gradientTransform="matrix(1 0 0 -1 0 47.73)">
	<stop  offset="0" style="stop-color:#2D5778"/>
	<stop  offset="0.17" style="stop-color:#29658D"/>
	<stop  offset="0.53" style="stop-color:#2180B3"/>
	<stop  offset="0.82" style="stop-color:#1C91CB"/>
	<stop  offset="1" style="stop-color:#1A97D4"/>
</linearGradient>
<circle class="st1" cx="23.3" cy="23.3" r="23.1"/>
<path class="st2" d="M23.2,1.7c12.7,0,23.1,10.3,23.1,23c0-0.5,0-0.9,0-1.4C46.4,10.5,36,0.2,23.2,0.2C10.4,0.2,0.1,10.5,0.1,23.3
	c0,0,0,0.1,0,0.1C0.8,11.2,11,1.7,23.2,1.7z"/>
<path class="st3" d="M23.3,46.5c-12.7,0-23.1-10.3-23.1-23c0,0.5,0,0.9,0,1.4C0.2,37.6,10.5,48,23.3,48c12.8,0,23.1-10.4,23.1-23.1
	c0,0,0-0.1,0-0.1C45.7,37,35.5,46.5,23.3,46.5z"/>
<path class="st4" d="M22.9,22.3c-5,0-9-4-9-9s4-9,9-9s9,4,9,9S27.9,22.3,22.9,22.3L22.9,22.3z"/>
<radialGradient id="SVGID_2_" cx="22.89" cy="34.44" r="11.75" gradientTransform="matrix(1 0 0 -1 0 47.73)" gradientUnits="userSpaceOnUse">
	<stop  offset="0" style="stop-color:#E7E6E6"/>
	<stop  offset="0.26" style="stop-color:#E3E3E3"/>
	<stop  offset="0.49" style="stop-color:#D9D8D8"/>
	<stop  offset="0.72" style="stop-color:#C6C6C6"/>
	<stop  offset="0.93" style="stop-color:#ADAEAE"/>
	<stop  offset="1" style="stop-color:#A3A4A4"/>
</radialGradient>
<circle class="st5" cx="22.9" cy="13.3" r="8.7"/>
<path class="st4" d="M23.3,46.7c-7.7,0-14.9-3.8-19.3-10.1L4,36.5v-0.1c3.4-10.4,14.5-16.1,25-12.8c6.4,2.1,11.3,7.2,13,13.6v0.1
	l-0.1,0.1C37.5,43.3,30.6,46.7,23.3,46.7z"/>
<radialGradient id="SVGID_3_" cx="24.1" cy="19.01" r="19.83" gradientTransform="matrix(1 0 0 -1 0 47.73)" gradientUnits="userSpaceOnUse">
	<stop  offset="0" style="stop-color:#E7E6E6"/>
	<stop  offset="0.26" style="stop-color:#E3E3E3"/>
	<stop  offset="0.49" style="stop-color:#D9D8D8"/>
	<stop  offset="0.72" style="stop-color:#C6C6C6"/>
	<stop  offset="0.93" style="stop-color:#ADAEAE"/>
	<stop  offset="1" style="stop-color:#A3A4A4"/>
</radialGradient>
<path class="st6" d="M22.9,22.9L22.9,22.9c-8.5,0-16,5.5-18.6,13.5c7.2,10.5,21.6,13.2,32.2,6c2-1.4,3.8-3.1,5.3-5.1
	C39.4,28.8,31.7,22.9,22.9,22.9z"/>
<linearGradient id="SVGID_4_" gradientUnits="userSpaceOnUse" x1="22.9745" y1="3.68" x2="22.9745" y2="16.06" gradientTransform="matrix(1 0 0 -1 -4.900997e-03 47.7278)">
	<stop  offset="5.000000e-02" style="stop-color:#1A1A1A"/>
	<stop  offset="0.39" style="stop-color:#1D1D1D"/>
	<stop  offset="0.66" style="stop-color:#272727"/>
	<stop  offset="0.91" style="stop-color:#383838"/>
	<stop  offset="1" style="stop-color:#404040"/>
</linearGradient>
<circle class="st7" cx="23" cy="41.3" r="2.3"/>
<linearGradient id="SVGID_5_" gradientUnits="userSpaceOnUse" x1="22.121" y1="3.4058" x2="22.121" y2="15.7858" gradientTransform="matrix(1.0028 -4.560265e-03 -4.560265e-03 -1.0028 0.6814 47.5889)">
	<stop  offset="5.000000e-02" style="stop-color:#1A1A1A"/>
	<stop  offset="0.39" style="stop-color:#1D1D1D"/>
	<stop  offset="0.66" style="stop-color:#272727"/>
	<stop  offset="0.91" style="stop-color:#383838"/>
	<stop  offset="1" style="stop-color:#404040"/>
</linearGradient>
<path class="st8" d="M21.5,34.5c0.2-1.5,1-2.6,1.8-2.5c0.7,0.1,1.2,1.4,0.9,2.9c-0.2,1.5-1,2.6-1.8,2.5C21.6,37.3,21.2,36,21.5,34.5
	z"/>
<linearGradient id="SVGID_6_" gradientUnits="userSpaceOnUse" x1="18.7195" y1="3.68" x2="18.7195" y2="16.06" gradientTransform="matrix(1 0 0 -1 1.354438e-03 47.726)">
	<stop  offset="5.000000e-02" style="stop-color:#1A1A1A"/>
	<stop  offset="0.39" style="stop-color:#1D1D1D"/>
	<stop  offset="0.66" style="stop-color:#272727"/>
	<stop  offset="0.91" style="stop-color:#383838"/>
	<stop  offset="1" style="stop-color:#404040"/>
</linearGradient>
<path class="st9" d="M17.3,37.9c0.3-0.7,1.2-0.9,2-0.5c0.8,0.4,1.2,1.3,0.8,1.9c-0.3,0.7-1.2,0.9-2,0.5C17.3,39.5,17,38.6,17.3,37.9
	z"/>
</svg>
