<?xml version="1.0" encoding="utf-8"?>
<!-- Generator: Adobe Illustrator 21.0.0, SVG Export Plug-In . SVG Version: 6.00 Build 0)  -->
<svg version="1.1" id="katman_1" xmlns="http://www.w3.org/2000/svg" xmlns:xlink="http://www.w3.org/1999/xlink" x="0px" y="0px"
	 viewBox="0 0 46.8 48" style="enable-background:new 0 0 46.8 48;" xml:space="preserve">
<style type="text/css">
	.st0{opacity:0.7;fill:#333333;enable-background:new    ;}
	.st1{fill:#1A1A1A;}
	.st2{fill:url(#SVGID_1_);}
	.st3{opacity:0.5;fill:#FFFFFF;enable-background:new    ;}
	.st4{fill:url(#SVGID_2_);}
	.st5{fill:url(#SVGID_3_);}
	.st6{fill:url(#SVGID_4_);}
	.st7{fill:url(#SVGID_5_);}
	.st8{fill:url(#SVGID_6_);}
	.st9{fill:url(#SVGID_7_);}
	.st10{fill:url(#SVGID_8_);}
	.st11{fill:url(#SVGID_9_);}
	.st12{fill:url(#SVGID_10_);}
	.st13{fill:url(#SVGID_11_);}
	.st14{fill:url(#SVGID_12_);}
	.st15{fill:#58595B;}
	.st16{opacity:0.2;fill:#FFFFFF;enable-background:new    ;}
	.st17{opacity:0.1;fill:#FFFFFF;enable-background:new    ;}
	.st18{opacity:0.2;fill:#010101;enable-background:new    ;}
	.st19{fill:#FF0000;}
	.st20{fill:url(#SVGID_13_);}
	.st21{fill:url(#SVGID_14_);}
	.st22{fill:#00FFFF;}
	.st23{opacity:0.2;fill:#383838;enable-background:new    ;}
</style>
<title>Varlık 8</title>
<path class="st0" d="M9.1,47l0.3-3.3H8.1L8.3,40H2.5c-0.9,0-1.7-0.6-1.9-1.5c0-0.1,0-0.1,0-0.2c-0.2-0.2-0.3-0.4-0.3-0.6
	c0-0.1-0.2-3.8-0.2-5c-0.1-2.1,0-8.1,0-9.9v-0.1c0-0.1,0-0.1,0-0.2C0,22.4,0,22.3,0,22.2c0-1,0.1-3.3,0.2-4.1s0.5-2.6,0.6-3.4
	c0.1-0.3,0.3-0.5,0.6-0.5h7.9L8.9,3.9h1.4V0h26v3.9h1.5l-0.3,10.2h7.8c0.3,0,0.6,0.2,0.6,0.5c0.2,0.8,0.5,2.7,0.6,3.4
	s0.2,3.1,0.2,4.1c0,0.1,0,0.2-0.1,0.3c0,0.1,0,0.1,0,0.2c0,0,0,7.1,0,9.9c0,1-0.1,5-0.1,5.1c0,0.2-0.1,0.4-0.2,0.5
	c0,0.1,0,0.2,0,0.3c-0.2,0.9-1,1.5-1.9,1.5h-5.9l0.1,3.8h-1.1l0.3,3.2H9.1z"/>
<path class="st1" d="M46.1,37.9L46.1,37.9c0,0.9-0.7,1.6-1.6,1.6c0,0,0,0,0,0H2.5c-0.9,0-1.6-0.7-1.6-1.6c0,0,0,0,0,0l0,0l0,0H46.1
	L46.1,37.9z"/>
<linearGradient id="SVGID_1_" gradientUnits="userSpaceOnUse" x1="23.5" y1="7.81" x2="23.5" y2="10.18" gradientTransform="matrix(1 0 0 -1 0 47.73)">
	<stop  offset="5.000000e-02" style="stop-color:#0F0F0F"/>
	<stop  offset="0.31" style="stop-color:#161616"/>
	<stop  offset="0.7" style="stop-color:#2B2B2B"/>
	<stop  offset="1" style="stop-color:#404040"/>
</linearGradient>
<path class="st2" d="M1,37.9h45l0,0l0,0c0,0.8-0.7,1.5-1.5,1.5h-42C1.7,39.4,1,38.8,1,37.9L1,37.9L1,37.9z"/>
<path class="st3" d="M0.9,37.9L0.9,37.9c0,0.3,0.1,0.5,0.2,0.7h44.8c0.1-0.2,0.2-0.5,0.2-0.7H0.9z"/>
<polygon class="st1" points="9.7,15.7 9.3,4.2 37.5,4.2 37.1,15.7 "/>
<path class="st1" d="M0.7,22.4c-0.1,0-0.3-0.1-0.3-0.3c0,0,0,0,0,0c0-0.8,0.1-3.3,0.2-4.1s0.5-2.8,0.6-3.4c0-0.1,0.1-0.2,0.3-0.2h8
	c0.1,0,0.3,0.1,0.3,0.3c0,0,0,0,0,0c-0.1,0.6-0.3,2.6-0.4,3.3c-0.1,0.9-0.1,3.4-0.1,4.1c0,0.1-0.1,0.3-0.3,0.3h0L0.7,22.4z"/>
<path class="st1" d="M37.9,22.4c-0.1,0-0.3-0.1-0.3-0.3l0,0c0-0.7,0-3.2-0.1-4.1c0-0.7-0.3-2.6-0.4-3.3c0-0.1,0.1-0.3,0.2-0.3
	c0,0,0,0,0,0h8c0.1,0,0.2,0.1,0.3,0.2c0.1,0.6,0.5,2.6,0.6,3.4s0.2,3.3,0.2,4.1c0,0.1-0.1,0.3-0.3,0.3c0,0,0,0,0,0H37.9z"/>
<path class="st1" d="M1.4,38.1c-0.4,0.1-0.7-0.2-0.8-0.6c0,0,0,0,0,0c0,0-0.2-3.7-0.2-5c-0.1-2.5,0.1-9.9,0.1-10
	c0-0.1,0.1-0.3,0.3-0.3c0,0,0,0,0,0h45.4c0.1,0,0.3,0.1,0.3,0.3l0,0c0,0.1,0,7.1,0,9.9c0,1-0.1,5-0.1,5.1c0,0.3-0.3,0.6-0.6,0.6
	c0,0,0,0,0,0L1.4,38.1z"/>
<linearGradient id="SVGID_2_" gradientUnits="userSpaceOnUse" x1="9.32" y1="-584.85" x2="37.42" y2="-584.85" gradientTransform="matrix(1 0 0 1 0 594.77)">
	<stop  offset="0" style="stop-color:#E7E6E6"/>
	<stop  offset="9.000000e-02" style="stop-color:#A3A4A4"/>
	<stop  offset="0.92" style="stop-color:#A3A4A4"/>
	<stop  offset="1" style="stop-color:#E7E6E6"/>
</linearGradient>
<polygon class="st4" points="37.4,4.2 9.3,4.2 9.8,15.6 37.1,15.6 "/>
<linearGradient id="SVGID_3_" gradientUnits="userSpaceOnUse" x1="9.85" y1="-584.875" x2="36.89" y2="-584.875" gradientTransform="matrix(1 0 0 1 0 594.77)">
	<stop  offset="0" style="stop-color:#A3A4A4"/>
	<stop  offset="3.000000e-02" style="stop-color:#B1B1B1"/>
	<stop  offset="0.1" style="stop-color:#D5D5D5"/>
	<stop  offset="0.12" style="stop-color:#E7E6E6"/>
	<stop  offset="0.89" style="stop-color:#E7E6E6"/>
	<stop  offset="1" style="stop-color:#A3A4A4"/>
</linearGradient>
<polygon class="st5" points="9.9,4.2 10.3,15.6 36.6,15.6 36.9,4.2 "/>
<rect x="10.7" y="0.3" class="st1" width="25.3" height="15.4"/>
<linearGradient id="SVGID_4_" gradientUnits="userSpaceOnUse" x1="23.32" y1="32.1" x2="23.32" y2="48.82" gradientTransform="matrix(1 0 0 -1 0 47.73)">
	<stop  offset="0" style="stop-color:#A3A4A4"/>
	<stop  offset="1.000000e-02" style="stop-color:#A6A7A7"/>
	<stop  offset="0.14" style="stop-color:#BFC0C0"/>
	<stop  offset="0.28" style="stop-color:#D3D3D4"/>
	<stop  offset="0.44" style="stop-color:#E1E1E2"/>
	<stop  offset="0.64" style="stop-color:#E9E9EA"/>
	<stop  offset="1" style="stop-color:#EBEBEC"/>
</linearGradient>
<rect x="10.7" y="0.3" class="st6" width="25.2" height="15.3"/>
<rect x="7.2" y="15.5" class="st1" width="32.7" height="6.9"/>
<linearGradient id="SVGID_5_" gradientUnits="userSpaceOnUse" x1="23.4439" y1="25.6" x2="23.4439" y2="31.92" gradientTransform="matrix(1 0 0 -1 0 47.73)">
	<stop  offset="5.000000e-02" style="stop-color:#0F0F0F"/>
	<stop  offset="0.19" style="stop-color:#131313"/>
	<stop  offset="0.32" style="stop-color:#1E1E1E"/>
	<stop  offset="0.45" style="stop-color:#313131"/>
	<stop  offset="0.53" style="stop-color:#404040"/>
	<stop  offset="0.61" style="stop-color:#2F2F2F"/>
	<stop  offset="0.73" style="stop-color:#1D1D1D"/>
	<stop  offset="0.85" style="stop-color:#121212"/>
	<stop  offset="1" style="stop-color:#0F0F0F"/>
</linearGradient>
<path class="st7" d="M37.3,22.5H9.5c0,0-0.2-3.5-0.1-4.8c0-0.7,0.2-1.5,0.5-2.2c0,0,21.4,0.2,26.9,0.1C37.8,18,37.3,22.5,37.3,22.5z
	"/>
<linearGradient id="SVGID_6_" gradientUnits="userSpaceOnUse" x1="5.061" y1="25.35" x2="5.061" y2="33.21" gradientTransform="matrix(1 0 0 -1 0 47.73)">
	<stop  offset="0" style="stop-color:#B1B3B6"/>
	<stop  offset="0.16" style="stop-color:#B4B6B9"/>
	<stop  offset="0.28" style="stop-color:#BDBFC1"/>
	<stop  offset="0.39" style="stop-color:#CDCECF"/>
	<stop  offset="0.49" style="stop-color:#E4E3E3"/>
	<stop  offset="0.5" style="stop-color:#E7E6E6"/>
	<stop  offset="0.55" style="stop-color:#DFDFDF"/>
	<stop  offset="0.72" style="stop-color:#C6C7C9"/>
	<stop  offset="0.88" style="stop-color:#B6B8BB"/>
	<stop  offset="1" style="stop-color:#B1B3B6"/>
</linearGradient>
<path class="st8" d="M8.9,22.3H0.7c-0.1,0-0.2-0.1-0.2-0.2c0,0,0,0,0,0c0-0.8,0.1-3.3,0.2-4.1s0.5-2.8,0.6-3.4
	c0-0.1,0.1-0.2,0.2-0.2h8c0.1,0,0.2,0.1,0.2,0.2c0,0,0,0,0,0c-0.1,0.7-0.3,2.6-0.4,3.3c-0.1,0.9-0.1,3.4-0.1,4.1
	C9.2,22.2,9.1,22.3,8.9,22.3C9,22.3,9,22.3,8.9,22.3z"/>
<linearGradient id="SVGID_7_" gradientUnits="userSpaceOnUse" x1="41.749" y1="25.14" x2="41.749" y2="33.32" gradientTransform="matrix(1 0 0 -1 0 47.73)">
	<stop  offset="0" style="stop-color:#B1B3B6"/>
	<stop  offset="0.16" style="stop-color:#B4B6B9"/>
	<stop  offset="0.28" style="stop-color:#BDBFC1"/>
	<stop  offset="0.39" style="stop-color:#CDCECF"/>
	<stop  offset="0.49" style="stop-color:#E4E3E3"/>
	<stop  offset="0.5" style="stop-color:#E7E6E6"/>
	<stop  offset="0.55" style="stop-color:#DFDFDF"/>
	<stop  offset="0.72" style="stop-color:#C6C7C9"/>
	<stop  offset="0.88" style="stop-color:#B6B8BB"/>
	<stop  offset="1" style="stop-color:#B1B3B6"/>
</linearGradient>
<path class="st9" d="M37.9,22.3h8.3c0.1,0,0.2-0.1,0.2-0.2c0,0,0,0,0,0c0-0.8-0.1-3.3-0.2-4.1s-0.5-2.8-0.6-3.4
	c0-0.1-0.1-0.2-0.2-0.2h-8c-0.1,0-0.2,0.1-0.2,0.2c0,0,0,0,0,0c0.1,0.7,0.3,2.6,0.4,3.3c0.1,0.9,0.1,3.4,0.1,4.1
	C37.6,22.2,37.7,22.3,37.9,22.3C37.9,22.3,37.9,22.3,37.9,22.3z"/>
<linearGradient id="SVGID_8_" gradientUnits="userSpaceOnUse" x1="23.382" y1="10.18" x2="23.382" y2="31.71" gradientTransform="matrix(1 0 0 -1 0 47.73)">
	<stop  offset="0" style="stop-color:#818486"/>
	<stop  offset="0.18" style="stop-color:#8D9091"/>
	<stop  offset="0.51" style="stop-color:#ADAEAF"/>
	<stop  offset="0.95" style="stop-color:#E1E0E0"/>
	<stop  offset="1" style="stop-color:#E7E6E6"/>
</linearGradient>
<path class="st10" d="M45.5,38H1.4c-0.3,0.1-0.7-0.2-0.7-0.5c0,0,0,0,0,0c0,0-0.2-3.7-0.2-5c-0.1-2.5,0.1-10,0.1-10
	c0-0.1,0.1-0.2,0.2-0.2h45.4c0.1,0,0.2,0.1,0.2,0.2l0,0c0,0,0,7.1,0,9.8c0,1-0.1,5.1-0.1,5.1c0,0.3-0.2,0.6-0.5,0.6
	C45.6,38,45.6,38,45.5,38z"/>
<linearGradient id="SVGID_9_" gradientUnits="userSpaceOnUse" x1="8.52" y1="10.15" x2="38.33" y2="10.15" gradientTransform="matrix(1 0 0 -1 0 47.73)">
	<stop  offset="0" style="stop-color:#E7E6E6"/>
	<stop  offset="9.000000e-02" style="stop-color:#A3A4A4"/>
	<stop  offset="0.92" style="stop-color:#A3A4A4"/>
	<stop  offset="1" style="stop-color:#E7E6E6"/>
</linearGradient>
<polygon class="st11" points="38.3,43.3 8.5,43.3 9,31.9 38,31.9 "/>
<linearGradient id="SVGID_10_" gradientUnits="userSpaceOnUse" x1="9.08" y1="10.395" x2="37.77" y2="10.395" gradientTransform="matrix(1 0 0 -1 0 47.73)">
	<stop  offset="0" style="stop-color:#A3A4A4"/>
	<stop  offset="3.000000e-02" style="stop-color:#B1B1B1"/>
	<stop  offset="0.1" style="stop-color:#D5D5D5"/>
	<stop  offset="0.12" style="stop-color:#E7E6E6"/>
	<stop  offset="0.89" style="stop-color:#E7E6E6"/>
	<stop  offset="1" style="stop-color:#A3A4A4"/>
</linearGradient>
<polygon class="st12" points="9.1,42.8 9.5,31.9 37.4,31.9 37.8,42.8 "/>
<linearGradient id="SVGID_11_" gradientUnits="userSpaceOnUse" x1="23.475" y1="1.19" x2="23.475" y2="15.94" gradientTransform="matrix(1 0 0 -1 0 47.73)">
	<stop  offset="0" style="stop-color:#E7E6E6"/>
	<stop  offset="1" style="stop-color:#E9E3E2"/>
</linearGradient>
<polygon class="st13" points="37.5,46.5 9.5,46.5 10.7,31.8 36.3,31.8 "/>
<path class="st1" d="M38.2,31.9H8.7v-1.8c0-1.9,1.5-3.4,3.4-3.4h22.7c1.9,0,3.4,1.5,3.4,3.4V31.9z"/>
<linearGradient id="SVGID_12_" gradientUnits="userSpaceOnUse" x1="23.435" y1="21.85" x2="23.435" y2="15.13" gradientTransform="matrix(1 0 0 -1 0 47.73)">
	<stop  offset="0" style="stop-color:#404040"/>
	<stop  offset="0.37" style="stop-color:#252525"/>
	<stop  offset="0.7" style="stop-color:#151515"/>
	<stop  offset="0.95" style="stop-color:#0F0F0F"/>
</linearGradient>
<path class="st14" d="M8.9,31.8H38v-1.6c0-1.8-1.4-3.2-3.2-3.2c0,0,0,0,0,0H12.1c-1.8,0-3.2,1.4-3.2,3.2l0,0L8.9,31.8z"/>
<rect x="13.5" y="33.5" class="st15" width="20.1" height="0.6"/>
<rect x="13.2" y="35.2" class="st15" width="20.5" height="0.6"/>
<rect x="13" y="37" class="st15" width="20.9" height="0.6"/>
<rect x="12.8" y="38.7" class="st15" width="21.3" height="0.6"/>
<rect x="12.6" y="40.4" class="st15" width="21.8" height="0.6"/>
<rect x="12.4" y="42.1" class="st15" width="22.2" height="0.6"/>
<rect x="12.2" y="43.8" class="st15" width="22.7" height="0.6"/>
<rect x="0.5" y="22.3" class="st1" width="45.8" height="0.2"/>
<path class="st16" d="M0.5,24.6c0-0.3,0-0.5,0-0.5c0-0.1,0.1-0.2,0.2-0.2h45.4c0.1,0,0.2,0.1,0.2,0.2l0,0c0,0,0,0.2,0,0.5l0,0
	c0-1.2,0-2,0-2c0-0.1-0.1-0.2-0.2-0.2l0,0H0.7c-0.1,0-0.2,0.1-0.2,0.2C0.5,22.6,0.5,23.4,0.5,24.6z"/>
<path class="st17" d="M34.7,27H12.1c-1.8,0-3.3,1.5-3.3,3.3l0,0v1.5c0-1.8,1.5-3.3,3.3-3.3h0h22.6c1.8,0,3.2,1.4,3.3,3.2v-1.5
	C38,28.4,36.5,27,34.7,27z"/>
<path class="st16" d="M0.5,20.2c0-0.3,0-0.6,0.1-0.8c0.1-0.7,0.5-2.8,0.6-3.4c0-0.1,0.1-0.2,0.3-0.2h8c0.1,0,0.1,0,0.2,0.1l0,0v-0.5
	l0,0v-0.2v-0.8c0,0-0.1-0.1-0.2-0.1h-8c-0.1,0-0.2,0.1-0.3,0.2c-0.1,0.6-0.5,2.7-0.6,3.4C0.6,18.4,0.5,19.3,0.5,20.2L0.5,20.2z"/>
<path class="st16" d="M37.4,15.9h8c0.1,0,0.2,0.1,0.3,0.2c0.1,0.6,0.5,2.6,0.6,3.4c0,0.2,0,0.4,0.1,0.8h0.1c0-0.9-0.1-1.8-0.1-2.2
	c-0.1-0.7-0.5-2.8-0.6-3.4c0-0.1-0.1-0.2-0.3-0.2h-8c-0.1,0-0.1,0-0.2,0.1v0.8v0.2l0,0V16l0,0C37.2,15.9,37.3,15.9,37.4,15.9z"/>
<polygon class="st16" points="36.9,4.2 36,4.2 36,5.7 36.9,5.7 37.4,5.7 37.5,4.2 "/>
<rect x="10.7" y="0.3" class="st16" width="25.3" height="1.5"/>
<polygon class="st16" points="10.7,5.7 10.7,4.2 9.9,4.2 9.3,4.2 9.3,5.7 9.9,5.7 "/>
<polygon class="st18" points="9.5,48 37.5,48 37.3,46.5 9.6,46.5 "/>
<path class="st16" d="M9.7,15.5v-0.6v0.3V15.5z"/>
<path class="st16" d="M37.1,15v0.5l0,0v-0.2V15z"/>
<polygon class="st18" points="37.3,44.7 38.3,44.7 38.3,43.3 37.2,43.3 "/>
<path class="st18" d="M46.2,37.5L46.2,37.5c0,0.1-0.1,0.3-0.2,0.4c0,0.1,0,0.2,0,0.4l0,0c-0.2,0.7-0.8,1.2-1.6,1.2h-6.3v1.5h6.2
	c0.7,0,1.4-0.5,1.6-1.2l0,0c0-0.1,0-0.2,0-0.4c0.1-0.1,0.2-0.2,0.2-0.4L46.2,37.5L46.2,37.5z"/>
<polygon class="st18" points="8.6,43.3 8.5,44.7 9.6,44.7 9.8,43.3 "/>
<path class="st18" d="M1,38.3L1,38.3c0-0.1,0-0.2,0-0.2c-0.2-0.1-0.3-0.3-0.3-0.5H0.5c0,0.8,0.1,1.5,0.1,1.5c0,0.2,0.2,0.4,0.3,0.5
	c0,0.1,0,0.2,0,0.2l0,0C1.1,40.5,1.8,41,2.5,41h6.1l0.1-1.5H2.5C1.8,39.5,1.2,39,1,38.3z"/>
<circle class="st19" cx="42.4" cy="26.3" r="0.8"/>
<ellipse class="st1" cx="42.4" cy="22.3" rx="1.6" ry="2.4"/>
<radialGradient id="SVGID_13_" cx="42.42" cy="25.45" r="1.95" gradientTransform="matrix(1 0 0 -1 0 47.73)" gradientUnits="userSpaceOnUse">
	<stop  offset="0" style="stop-color:#404040"/>
	<stop  offset="0.38" style="stop-color:#2F2F2F"/>
	<stop  offset="0.95" style="stop-color:#0F0F0F"/>
</radialGradient>
<ellipse class="st20" cx="42.4" cy="22.3" rx="1.5" ry="2.3"/>
<ellipse class="st1" cx="42.4" cy="22.3" rx="1" ry="1.5"/>
<radialGradient id="SVGID_14_" cx="42.42" cy="45.4385" r="0.8" gradientTransform="matrix(1 0 0 -1.74 0 101.4202)" gradientUnits="userSpaceOnUse">
	<stop  offset="0" style="stop-color:#EBEBEC"/>
	<stop  offset="0.22" style="stop-color:#E7E7E8"/>
	<stop  offset="0.47" style="stop-color:#D9DADA"/>
	<stop  offset="0.72" style="stop-color:#C3C4C4"/>
	<stop  offset="0.99" style="stop-color:#A5A6A6"/>
	<stop  offset="1" style="stop-color:#A3A4A4"/>
</radialGradient>
<ellipse class="st21" cx="42.4" cy="22.3" rx="0.9" ry="1.4"/>
<path class="st16" d="M42.4,26.2c0.3,0,0.6,0.2,0.7,0.5c0.1-0.1,0.1-0.2,0.1-0.4c0-0.5-0.4-0.8-0.8-0.8s-0.8,0.4-0.8,0.8
	c0,0,0,0,0,0c0,0.1,0,0.2,0.1,0.4C41.8,26.4,42.1,26.2,42.4,26.2z"/>
<path class="st18" d="M42.4,27.1c-0.3,0-0.6-0.2-0.7-0.5c-0.1,0.1-0.1,0.2-0.1,0.4c0,0.5,0.4,0.8,0.8,0.8c0.5,0,0.8-0.4,0.8-0.8
	c0-0.1,0-0.2-0.1-0.4C43,26.9,42.7,27.1,42.4,27.1z"/>
<path class="st16" d="M42.4,20.7c0.7,0,1.3,0.9,1.5,2c0-0.1,0-0.2,0-0.4c0-1.3-0.7-2.3-1.5-2.3s-1.5,1-1.5,2.3c0,0.1,0,0.2,0,0.4
	C41.1,21.5,41.7,20.7,42.4,20.7z"/>
<path class="st18" d="M42.4,24.6c-0.7,0-1.3-0.9-1.5-2c0,0.1,0,0.2,0,0.4c0,1.3,0.7,2.3,1.5,2.3s1.5-1,1.5-2.3c0-0.1,0-0.2,0-0.4
	C43.8,23.8,43.2,24.6,42.4,24.6z"/>
<path class="st16" d="M42.4,21.7c0.4,0,0.7,0.4,0.8,1c0-0.1,0-0.2,0-0.4c0-0.8-0.4-1.4-0.9-1.4s-0.9,0.6-0.9,1.4c0,0.1,0,0.2,0,0.4
	C41.7,22.1,42,21.7,42.4,21.7z"/>
<circle class="st22" cx="42.4" cy="28.5" r="0.8"/>
<path class="st16" d="M42.4,28.4c0.3,0,0.6,0.2,0.7,0.5c0.1-0.1,0.1-0.2,0.1-0.4c0-0.5-0.4-0.8-0.8-0.8c-0.5,0-0.8,0.4-0.8,0.8
	c0,0.1,0,0.2,0.1,0.4C41.8,28.6,42.1,28.4,42.4,28.4z"/>
<path class="st18" d="M42.4,29.4c-0.3,0-0.6-0.2-0.7-0.5c-0.1,0.1-0.1,0.2-0.1,0.4c0,0.5,0.4,0.8,0.8,0.8s0.8-0.4,0.8-0.8
	c0,0,0,0,0,0c0-0.1,0-0.2-0.1-0.4C43,29.2,42.7,29.3,42.4,29.4z"/>
<polygon class="st23" points="36.7,37.1 36.3,31.8 10.7,31.8 10.2,37.1 "/>
</svg>
