<?xml version="1.0" encoding="utf-8"?>
<!-- Generator: Adobe Illustrator 21.0.0, SVG Export Plug-In . SVG Version: 6.00 Build 0)  -->
<svg version="1.1" id="katman_1" xmlns="http://www.w3.org/2000/svg" xmlns:xlink="http://www.w3.org/1999/xlink" x="0px" y="0px"
	 viewBox="0 0 48 43.8" style="enable-background:new 0 0 48 43.8;" xml:space="preserve">
<style type="text/css">
	.st0{fill:url(#_Dikdörtgen__1_);}
	.st1{opacity:0.7;fill:#1C1C1C;enable-background:new    ;}
	.st2{fill:url(#_Yol__1_);}
	.st3{fill:url(#_Bileşik_Yol__1_);}
	.st4{fill:url(#_Yol_2_1_);}
	.st5{opacity:0.1;fill:#FFFFFF;enable-background:new    ;}
	.st6{opacity:0.2;fill:#030303;enable-background:new    ;}
</style>
<title>Varlık 10</title>
<linearGradient id="_Dikdörtgen__1_" gradientUnits="userSpaceOnUse" x1="23.995" y1="14.52" x2="23.995" y2="41.14" gradientTransform="matrix(1 0 0 -1 0 43.73)">
	<stop  offset="0" style="stop-color:#2D5879"/>
	<stop  offset="1" style="stop-color:#2C6E95"/>
</linearGradient>
<rect id="_Dikdörtgen_" x="2.8" y="2.6" class="st0" width="42.4" height="26.6"/>
<path class="st1" d="M11.9,43.3v-1c0-0.7,0.6-1.3,1.3-1.3c2.4,0,4.4-2.8,4.4-6.4c0-0.8-0.1-1.6-0.3-2.4L17.2,32h13.5l-0.1,0.2
	c-0.2,0.8-0.3,1.6-0.3,2.4c0,3.5,2,6.4,4.4,6.4c0.8,0,1.4,0.6,1.4,1.4c0,0,0,0,0,0v0.9L11.9,43.3z"/>
<linearGradient id="_Yol__1_" gradientUnits="userSpaceOnUse" x1="24.01" y1="0.39" x2="24.01" y2="15.67" gradientTransform="matrix(1 0 0 -1 0 43.73)">
	<stop  offset="0" style="stop-color:#A3A3A3"/>
	<stop  offset="6.000000e-02" style="stop-color:#BBBBBA"/>
	<stop  offset="0.14" style="stop-color:#CFCECD"/>
	<stop  offset="0.22" style="stop-color:#DDDCDB"/>
	<stop  offset="0.33" style="stop-color:#E6E4E3"/>
	<stop  offset="0.51" style="stop-color:#E8E6E5"/>
	<stop  offset="0.7" style="stop-color:#C6C5C4"/>
	<stop  offset="0.89" style="stop-color:#ACACAC"/>
	<stop  offset="1" style="stop-color:#A3A3A3"/>
</linearGradient>
<path id="_Yol_" class="st2" d="M34.7,41.2c-2.5,0-4.6-2.9-4.6-6.6c0-0.8,0.1-1.6,0.3-2.4H17.5c0.2,0.8,0.3,1.6,0.3,2.4
	c0,3.6-2.1,6.6-4.6,6.6l0,0c-0.6,0-1.1,0.5-1.1,1.1c0,0,0,0,0,0v0.8h23.8v-0.7C35.9,41.7,35.4,41.2,34.7,41.2
	C34.7,41.2,34.7,41.2,34.7,41.2L34.7,41.2z"/>
<path class="st1" d="M1.1,32C0.5,32,0,31.5,0,30.9c0,0,0,0,0,0V1.1C0,0.5,0.5,0,1.1,0h45.8C47.5,0,48,0.5,48,1.1l0,0v29.8
	c0,0.6-0.5,1.1-1.1,1.1c0,0,0,0,0,0H1.1z M44.8,28.8V3.2H3.2v25.6L44.8,28.8z"/>
<linearGradient id="_Bileşik_Yol__1_" gradientUnits="userSpaceOnUse" x1="24" y1="11.93" x2="24" y2="43.53" gradientTransform="matrix(1 0 0 -1 0 43.73)">
	<stop  offset="0" style="stop-color:#A3A3A3"/>
	<stop  offset="0.13" style="stop-color:#BCBBBB"/>
	<stop  offset="0.27" style="stop-color:#D0CECE"/>
	<stop  offset="0.43" style="stop-color:#DEDCDB"/>
	<stop  offset="0.64" style="stop-color:#E6E4E3"/>
	<stop  offset="1" style="stop-color:#E8E6E5"/>
</linearGradient>
<path id="_Bileşik_Yol_" class="st3" d="M46.9,0.2H1.1c-0.5,0-0.9,0.4-0.9,0.9c0,0,0,0,0,0v29.8c0,0.5,0.4,0.9,0.9,0.9h45.8
	c0.5,0,0.9-0.4,0.9-0.9c0,0,0,0,0,0V1.1C47.8,0.6,47.4,0.2,46.9,0.2z M45,29H3V3h42V29z"/>
<linearGradient id="_Yol_2_1_" gradientUnits="userSpaceOnUse" x1="24.005" y1="0.66" x2="24.005" y2="2.5704" gradientTransform="matrix(1 0 0 -1 0 43.73)">
	<stop  offset="0" style="stop-color:#A3A3A3"/>
	<stop  offset="0.39" style="stop-color:#C4C4C3"/>
	<stop  offset="0.77" style="stop-color:#DEDDDC"/>
	<stop  offset="1" style="stop-color:#E8E6E5"/>
</linearGradient>
<path id="_Yol_2" class="st4" d="M34.7,41.2H13.2c-0.6,0-1.1,0.5-1.1,1.1c0,0,0,0,0,0v0.8h23.8v-0.7C35.9,41.7,35.4,41.2,34.7,41.2
	C34.7,41.2,34.7,41.2,34.7,41.2z"/>
<rect x="3" y="29" class="st5" width="42" height="1.5"/>
<path class="st5" d="M46.9,0.2H1.1c-0.5,0-0.9,0.4-0.9,0.9c0,0,0,0,0,0v1.5c0-0.5,0.4-0.9,0.9-0.9l0,0h45.8c0.5,0,0.9,0.4,0.9,0.9
	c0,0,0,0,0,0V1.1C47.8,0.6,47.4,0.2,46.9,0.2z"/>
<path class="st6" d="M46.9,31.8H1.1c-0.5,0-0.9-0.4-0.9-0.9v1.5c0,0.5,0.4,0.9,0.9,0.9c0,0,0,0,0,0h45.8c0.5,0,0.9-0.4,0.9-0.9v0
	v-1.5C47.8,31.4,47.4,31.8,46.9,31.8L46.9,31.8z"/>
<rect x="3" y="3" class="st6" width="42" height="1.5"/>
<path class="st5" d="M35.9,42.3c0-0.7-0.5-1.2-1.2-1.2c0,0,0,0,0,0H13.2c-0.6,0-1.1,0.5-1.1,1.1c0,0,0,0,0,0V43
	c0-0.6,0.5-1.1,1.1-1.1c0,0,0,0,0,0h21.5c0.7,0,1.2,0.5,1.2,1.2c0,0,0,0,0,0l0,0L35.9,42.3z"/>
<path class="st6" d="M12.1,43.8h23.8v-0.8H12.1V43.8z"/>
</svg>
