<?xml version="1.0" encoding="utf-8"?>
<!-- Generator: Adobe Illustrator 21.0.0, SVG Export Plug-In . SVG Version: 6.00 Build 0)  -->
<svg version="1.1" id="katman_1" xmlns="http://www.w3.org/2000/svg" xmlns:xlink="http://www.w3.org/1999/xlink" x="0px" y="0px"
	 viewBox="0 0 62 64" style="enable-background:new 0 0 62 64;" xml:space="preserve">
<style type="text/css">
	.st0{fill:url(#SVGID_1_);}
	.st1{opacity:0.1;fill:#FFFFFF;enable-background:new    ;}
	.st2{opacity:0.2;enable-background:new    ;}
	.st3{fill:#FFFFFF;}
</style>
<title>system-shutdown</title>
<radialGradient id="SVGID_1_" cx="31" cy="107.53" r="35.7115" gradientTransform="matrix(1 0 0 1 0 -76.53)" gradientUnits="userSpaceOnUse">
	<stop  offset="0.25" style="stop-color:#CC2A31"/>
	<stop  offset="0.5" style="stop-color:#C92930"/>
	<stop  offset="0.67" style="stop-color:#C0272F"/>
	<stop  offset="0.82" style="stop-color:#B0242C"/>
	<stop  offset="0.96" style="stop-color:#9A1F28"/>
	<stop  offset="1" style="stop-color:#931D27"/>
</radialGradient>
<path class="st0" d="M31,0L31,0c17.1,0,31,13.9,31,31l0,0c0,17.1-13.9,31-31,31l0,0C13.9,62,0,48.1,0,31l0,0C0,13.9,13.9,0,31,0z"/>
<path class="st1" d="M62,31C62,13.9,48.1,0,31,0l0,0C13.9,0,0,13.9,0,31l0,0c0,0.3,0,0.7,0,1C0.5,15.3,14.3,2,31,2l0,0
	c16.7,0,30.5,13.3,31,30C62,31.7,62,31.3,62,31z"/>
<path class="st2" d="M31,62L31,62C14.3,62,0.5,48.7,0,32c0,0.3,0,0.7,0,1l0,0c0,17.1,13.9,31,31,31l0,0c17.1,0,31-13.9,31-31l0,0
	c0-0.3,0-0.7,0-1C61.5,48.7,47.7,62,31,62z"/>
<path class="st2" d="M31,38.4c-3.8,0-7-2.8-7.5-6.6c-0.5,4.1,2.4,7.9,6.5,8.5s7.9-2.4,8.5-6.5c0.1-0.6,0.1-1.3,0-1.9
	C38,35.6,34.8,38.5,31,38.4z"/>
<path class="st1" d="M32.6,7.1h-3.2c-0.6,0-1,0.4-1,1v2c0-0.6,0.4-1,1-1h3.2c0.6,0,1,0.4,1,1v-2C33.6,7.5,33.2,7.1,32.6,7.1z"/>
<path class="st2" d="M32.6,26.7h-3.2c-0.6,0-1-0.4-1-1v2c0,0.6,0.4,1,1,1h3.2c0.6,0,1-0.4,1-1v-2C33.6,26.2,33.2,26.7,32.6,26.7z"/>
<path class="st1" d="M26.4,12.3v-2C16.9,12.5,10.1,21,10.1,30.8c0,0.3,0,0.6,0,0.9C10.5,22.3,17.2,14.4,26.4,12.3z"/>
<path class="st1" d="M31,46.5c-8.3,0-15.2-6.5-15.7-14.9c0,0.4,0,0.7,0,1.1c0,8.7,7,15.7,15.7,15.7s15.7-7,15.7-15.7
	c0-0.4,0-0.7,0-1.1C46.3,40,39.4,46.5,31,46.5z"/>
<path class="st1" d="M35.6,10.3v2c9.2,2.1,15.8,10,16.3,19.4c0-0.3,0-0.6,0-0.9C51.9,21,45.1,12.5,35.6,10.3z"/>
<path class="st2" d="M35.6,15.7v2c6.2,1.9,10.7,7.5,11.1,14c0-0.3,0-0.6,0-0.9C46.7,23.9,42.2,17.8,35.6,15.7z"/>
<path class="st2" d="M26.4,17.7v-2c-6.6,2-11.2,8.1-11.2,15.1c0,0.3,0,0.6,0,0.9C15.7,25.1,20.2,19.6,26.4,17.7z"/>
<path class="st2" d="M31,51.7c-11.2,0-20.4-8.8-20.9-20c0,0.3,0,0.7,0,1.1c0.8,11.6,10.8,20.3,22.4,19.5c10.5-0.7,18.8-9,19.5-19.5
	c0-0.4,0-0.7,0-1.1C51.5,42.9,42.2,51.8,31,51.7z"/>
<path class="st3" d="M26.4,24.9c-3.3,2.5-4,7.3-1.4,10.6s7.3,4,10.6,1.4s4-7.3,1.4-10.6c-0.4-0.5-0.9-1-1.4-1.4v0.8c0,1.7-1.3,3-3,3
	h-3.2c-1.7,0-3-1.3-3-3L26.4,24.9z"/>
<path class="st3" d="M29.4,7.1h3.2c0.5,0,1,0.4,1,1v17.6c0,0.5-0.4,1-1,1h-3.2c-0.5,0-1-0.4-1-1V8.1C28.4,7.5,28.9,7.1,29.4,7.1z"/>
<path class="st3" d="M35.6,10.3v5.4c8.3,2.5,13,11.3,10.5,19.6s-11.3,13-19.6,10.5S13.5,34.5,16,26.2c1.5-5,5.5-8.9,10.5-10.5v-5.4
	C15.1,12.9,8,24.1,10.5,35.4s13.8,18.4,25.1,15.9C46.9,48.8,54,37.5,51.5,26.2C49.7,18.3,43.5,12.1,35.6,10.3z"/>
</svg>
