<?xml version="1.0" encoding="UTF-8" standalone="no"?>
<!-- Created with Inkscape (http://www.inkscape.org/) -->

<svg
   xmlns:dc="http://purl.org/dc/elements/1.1/"
   xmlns:cc="http://creativecommons.org/ns#"
   xmlns:rdf="http://www.w3.org/1999/02/22-rdf-syntax-ns#"
   xmlns:svg="http://www.w3.org/2000/svg"
   xmlns="http://www.w3.org/2000/svg"
   xmlns:sodipodi="http://sodipodi.sourceforge.net/DTD/sodipodi-0.dtd"
   xmlns:inkscape="http://www.inkscape.org/namespaces/inkscape"
   version="1.1"
   id="svg64"
   width="64"
   height="64"
   viewBox="0 0 64 63.999999"
   sodipodi:docname="pycad64.svg"
   inkscape:version="0.92.4 (5da689c313, 2019-01-14)">
  <metadata
     id="metadata70">
    <rdf:RDF>
      <cc:Work
         rdf:about="">
        <dc:format>image/svg+xml</dc:format>
        <dc:type
           rdf:resource="http://purl.org/dc/dcmitype/StillImage" />
        <dc:title></dc:title>
      </cc:Work>
    </rdf:RDF>
  </metadata>
  <defs
     id="defs68">
    <linearGradient
       id="linearGradient-1"
       y2="148.33669"
       x2="151.13554"
       y1="22.898218"
       x1="24.714943"
       gradientTransform="matrix(0.07374801,0,0,0.07391248,2.1163754,2.7868859)"
       gradientUnits="userSpaceOnUse">
      <stop
         id="stop136"
         offset="0%"
         stop-color="#387EB8" />
      <stop
         id="stop138"
         offset="100%"
         stop-color="#366994" />
    </linearGradient>
    <linearGradient
       id="linearGradient-2"
       y2="231.90547"
       x2="238.25963"
       y1="103.26588"
       x1="102.48342"
       gradientTransform="matrix(0.099201,0,0,-0.09942224,190.10342,-108.99392)"
       gradientUnits="userSpaceOnUse">
      <stop
         id="stop141"
         offset="0%"
         stop-color="#FFE052" />
      <stop
         id="stop143"
         offset="100%"
         stop-color="#FFC331" />
    </linearGradient>
  </defs>
  <sodipodi:namedview
     pagecolor="#ffffff"
     bordercolor="#666666"
     borderopacity="1"
     objecttolerance="10"
     gridtolerance="10"
     guidetolerance="10"
     inkscape:pageopacity="0"
     inkscape:pageshadow="2"
     inkscape:window-width="1918"
     inkscape:window-height="1179"
     id="namedview66"
     showgrid="false"
     fit-margin-top="0"
     fit-margin-left="0"
     fit-margin-right="0"
     fit-margin-bottom="0"
     inkscape:zoom="10.54031"
     inkscape:cx="44.553099"
     inkscape:cy="29.880656"
     inkscape:window-x="0"
     inkscape:window-y="19"
     inkscape:window-maximized="0"
     inkscape:current-layer="svg64" />
  <g
     id="g1523"
     transform="matrix(0.12473848,0,0,0.12473848,18.722459,47.046027)">
    <g
       id="g1501">
      <g
         id="g1495">
        <rect
           ry="0"
           y="-377.15729"
           x="-52.59539"
           height="513.07343"
           width="30.412294"
           id="rect1473"
           style="fill:#000000;fill-opacity:1;stroke:none;stroke-width:0.30072176;stroke-linejoin:round;stroke-miterlimit:4;stroke-dasharray:none;stroke-opacity:1" />
        <rect
           transform="rotate(90)"
           style="fill:#000000;fill-opacity:1;stroke:none;stroke-width:0.30072176;stroke-linejoin:round;stroke-miterlimit:4;stroke-dasharray:none;stroke-opacity:1"
           id="rect1475"
           width="30.412294"
           height="513.07343"
           x="10.152314"
           y="-362.97974"
           ry="0" />
      </g>
      <rect
         style="fill:#43f20d;fill-opacity:1;stroke:none;stroke-width:1.076033;stroke-linejoin:round;stroke-miterlimit:4;stroke-dasharray:none;stroke-opacity:1"
         id="rect1477"
         width="109.72379"
         height="107.41381"
         x="-93.904556"
         y="-32.235451" />
    </g>
    <g
       id="g1509">
      <g
         id="g1491"
         transform="translate(28.981132,18.247379)"
         style="fill:#cbcbcb;fill-opacity:1">
        <rect
           style="fill:#cbcbcb;fill-opacity:1;stroke:none;stroke-width:1;stroke-linejoin:round;stroke-miterlimit:4;stroke-dasharray:none;stroke-opacity:1"
           id="rect1487"
           width="266.19705"
           height="34.348007"
           x="32.20126"
           y="-94.859535" />
        <rect
           style="fill:#cbcbcb;fill-opacity:1;stroke:none;stroke-width:1;stroke-linejoin:round;stroke-miterlimit:4;stroke-dasharray:none;stroke-opacity:1"
           id="rect1489"
           width="40.788261"
           height="290.8847"
           x="149.19916"
           y="-366.42346" />
      </g>
      <g
         id="g1485">
        <rect
           y="-94.859535"
           x="32.20126"
           height="34.348007"
           width="266.19705"
           id="rect1479"
           style="fill:#e40df2;fill-opacity:1;stroke:none;stroke-width:1;stroke-linejoin:round;stroke-miterlimit:4;stroke-dasharray:none;stroke-opacity:1" />
        <rect
           y="-366.42346"
           x="149.19916"
           height="290.8847"
           width="40.788261"
           id="rect1481"
           style="fill:#e40df2;fill-opacity:1;stroke:none;stroke-width:1;stroke-linejoin:round;stroke-miterlimit:4;stroke-dasharray:none;stroke-opacity:1" />
      </g>
    </g>
  </g>
</svg>
