<?xml version="1.0" encoding="UTF-8" standalone="no"?>
<!-- Created with Inkscape (http://www.inkscape.org/) -->

<svg
   xmlns:dc="http://purl.org/dc/elements/1.1/"
   xmlns:cc="http://creativecommons.org/ns#"
   xmlns:rdf="http://www.w3.org/1999/02/22-rdf-syntax-ns#"
   xmlns:svg="http://www.w3.org/2000/svg"
   xmlns="http://www.w3.org/2000/svg"
   xmlns:sodipodi="http://sodipodi.sourceforge.net/DTD/sodipodi-0.dtd"
   xmlns:inkscape="http://www.inkscape.org/namespaces/inkscape"
   version="1.1"
   id="svg99"
   width="64"
   height="60.929153"
   viewBox="0 0 64 60.929153"
   sodipodi:docname="akis64.svg"
   inkscape:version="0.92.4 (5da689c313, 2019-01-14)">
  <metadata
     id="metadata105">
    <rdf:RDF>
      <cc:Work
         rdf:about="">
        <dc:format>image/svg+xml</dc:format>
        <dc:type
           rdf:resource="http://purl.org/dc/dcmitype/StillImage" />
        <dc:title />
      </cc:Work>
    </rdf:RDF>
  </metadata>
  <defs
     id="defs103" />
  <sodipodi:namedview
     pagecolor="#ffffff"
     bordercolor="#666666"
     borderopacity="1"
     objecttolerance="10"
     gridtolerance="10"
     guidetolerance="10"
     inkscape:pageopacity="0"
     inkscape:pageshadow="2"
     inkscape:window-width="1918"
     inkscape:window-height="1080"
     id="namedview101"
     showgrid="false"
     inkscape:zoom="10.369565"
     inkscape:cx="18.620506"
     inkscape:cy="29.097537"
     inkscape:window-x="0"
     inkscape:window-y="0"
     inkscape:window-maximized="0"
     inkscape:current-layer="g5095"
     fit-margin-top="0"
     fit-margin-left="0"
     fit-margin-right="0"
     fit-margin-bottom="0" />
  <g
     id="g5095"
     transform="matrix(0.18092779,0,0,0.18092779,109.53875,25.369771)">
    <rect
       ry="17.538126"
       y="-139.18372"
       x="-604.3913"
       height="334.6861"
       width="351.65887"
       id="rect5063"
       style="fill:#fff6d5;stroke:#e6e6e6;stroke-width:2.0734148;stroke-linejoin:round;stroke-miterlimit:4;stroke-dasharray:none;stroke-opacity:1" />
    <path
       inkscape:connector-curvature="0"
       id="path4661"
       d="m -562.21405,-6.869086 267.85264,0.8182871 c 0,0 20.04804,-1.6365742 20.45718,19.3661279 0.40914,21.002702 -0.27276,118.106111 -0.27276,118.106111 l -43.77836,40.36883 -242.21298,0.13638 c 0,0 -24.00309,-0.81829 -23.73033,-22.23014 0.27276,-21.41184 1.09105,-137.199468 1.09105,-137.199468 0,0 -0.54552,-18.2750788 20.59356,-19.366128 z"
       style="fill:#ececec;stroke:#e6e6e6;stroke-width:4.19999981;stroke-linecap:butt;stroke-linejoin:miter;stroke-miterlimit:4;stroke-dasharray:none;stroke-opacity:1" />
    <rect
       ry="23.965971"
       y="12.965727"
       x="-557.15125"
       height="134.2672"
       width="158.97888"
       id="rect4663"
       style="fill:#ffcc00;stroke:#666666;stroke-width:2.70499992;stroke-linejoin:round;stroke-miterlimit:4;stroke-dasharray:none;stroke-opacity:1" />
    <path
       inkscape:connector-curvature="0"
       id="path4665"
       d="m -544.09224,42.81761 h -2.21803 l 0.77149,-25.169812 39.34591,-1.157232 L -506,14.079664 h 2.89308 l -0.0964,2.410902 25.94129,0.192872 24.49476,0.09644 0.0964,-2.507338 h 2.89308 l 0.0964,2.410902 40.79245,0.96436 1.15723,0.964361 0.19288,24.784067 h -2.02516 l -0.0964,-23.72327 -66.73375,-0.675053 -0.0964,18.322851 26.23061,0.482181 0.0964,8.100629 51.49685,0.385744 -0.0964,2.218029 -8.67925,0.675053 0.38575,22.758909 -2.89309,-0.289308 V 49.857442 l -39.53878,-0.578616 -0.67505,27.966457 50.91824,-0.482181 -0.38575,2.70021 -50.33962,-0.09644 0.19287,26.327048 39.63522,-0.0964 0.48218,-21.023061 h 2.50734 l -0.48218,20.733761 8.87212,0.2893 0.0964,2.89309 -53.52201,-0.0964 -0.48218,-67.312373 -49.66457,-0.964361 -2.02516,1.639413 0.48218,35.874214 0.0964,38.381557 h 51.97903 l 0.0964,2.89308 -24.97694,0.19287 -0.19287,18.12998 66.34801,0.96436 0.57861,-26.51991 h 2.50734 l -0.28931,31.34171 h -2.4109 l -0.19287,-2.60377 h -39.82809 l 0.19287,6.9434 -2.70021,0.0964 0.0964,-6.84696 -51.20755,-0.38574 -0.0964,6.65409 h -2.02515 l 0.0964,-6.46122 -38.38155,-0.28931 -0.0964,3.76101 -2.02515,-0.38574 0.0964,-31.8239 h 2.1216 l 0.38574,25.84486 63.93711,0.48218 -0.0964,-18.61216 -25.36268,-0.77149 -1.0608,-0.0964 v -10.22223 l -50.72537,-0.0964 v -2.50734 l 10.31866,0.0964 0.0964,-22.662482 2.31446,0.09644 0.0964,22.373162 37.61006,0.0964 0.38575,-26.616352 -50.82181,0.289308 0.0964,-2.70021 50.14675,-0.48218 0.38575,-26.809224 -37.22432,-0.192872 -0.28931,22.662473 -2.89308,-0.09644 0.2893,-22.373165 -10.02935,-0.09644 -0.0964,-2.70021 L -507.15723,46 h 0.86792 l -0.19287,-8.197065 27.09853,-0.289309 -0.19287,-17.165618 -63.6478,-0.867925 z"
       style="fill:#666666;stroke:#666666;stroke-width:1px;stroke-linecap:butt;stroke-linejoin:miter;stroke-opacity:1" />
    <g
       transform="matrix(0,0.08707198,-0.08707198,0,-306.42627,24.905644)"
       id="g4901">
      <rect
         style="fill:#e30a17"
         y="0"
         x="0"
         width="1200"
         height="800"
         id="rect4881" />
      <circle
         cx="425"
         cy="400"
         r="200"
         style="fill:#ffffff"
         id="circle4883" />
      <circle
         cx="475"
         cy="400"
         r="160"
         style="fill:#e30a17"
         id="circle4885" />
      <polygon
         style="fill:#ffffff"
         points="652.431,304.894 652.431,495.106 764.235,341.221 583.334,400 764.235,458.779 "
         id="polygon4887" />
    </g>
    <text
       id="text4905"
       y="-22.632542"
       x="-567.46625"
       style="font-style:normal;font-variant:normal;font-weight:bold;font-stretch:normal;font-size:118.61084747px;line-height:1.25;font-family:'DejaVu Sans Mono';-inkscape-font-specification:'DejaVu Sans Mono, Bold';font-variant-ligatures:normal;font-variant-caps:normal;font-variant-numeric:normal;font-feature-settings:normal;text-align:start;letter-spacing:0px;word-spacing:0px;writing-mode:lr-tb;text-anchor:start;fill:#006680;fill-opacity:1;stroke:none;stroke-width:2.96531606"
       xml:space="preserve"><tspan
         sodipodi:role="line"
         id="tspan823"
         x="-567.46625"
         y="-22.632542">AKİS</tspan></text>
  </g>
</svg>
