Library\Bee\artifacts\movedfrom\Unity.VisualScripting.Core.ref.dll_15518829177300997364.movedfrom
Library\Bee\artifacts\movedfrom\UnityEditor.UI.ref.dll_5519394401220875509.movedfrom
Library\Bee\artifacts\movedfrom\UnityEngine.UI.ref.dll_648142665722821984.movedfrom
Library\Bee\artifacts\movedfrom\UnityEditor.Graphs.dll_2282535014084980036.movedfrom
Library\Bee\artifacts\movedfrom\UnityEditor.CoreModule.dll_10794703867914630418.movedfrom
Library\Bee\artifacts\movedfrom\UnityEditor.DeviceSimulatorModule.dll_3107904664080474959.movedfrom
Library\Bee\artifacts\movedfrom\UnityEditor.dll_6759249303479232483.movedfrom
Library\Bee\artifacts\movedfrom\UnityEditor.GraphViewModule.dll_1418220851380565012.movedfrom
Library\Bee\artifacts\movedfrom\UnityEditor.PackageManagerUIModule.dll_11037568660873273326.movedfrom
Library\Bee\artifacts\movedfrom\UnityEditor.QuickSearchModule.dll_333593653793465910.movedfrom
Library\Bee\artifacts\movedfrom\UnityEditor.SceneTemplateModule.dll_2713576744442455927.movedfrom
Library\Bee\artifacts\movedfrom\UnityEditor.UIBuilderModule.dll_7509529685094542664.movedfrom
Library\Bee\artifacts\movedfrom\UnityEditor.UIElementsModule.dll_14767720270962687758.movedfrom
Library\Bee\artifacts\movedfrom\UnityEditor.UIElementsSamplesModule.dll_2683315273156463935.movedfrom
Library\Bee\artifacts\movedfrom\UnityEditor.UIServiceModule.dll_11612891012099669346.movedfrom
Library\Bee\artifacts\movedfrom\UnityEditor.UnityConnectModule.dll_17982039145122589896.movedfrom
Library\Bee\artifacts\movedfrom\UnityEngine.AccessibilityModule.dll_6363018113788088084.movedfrom
Library\Bee\artifacts\movedfrom\UnityEngine.AIModule.dll_9822232197166077222.movedfrom
Library\Bee\artifacts\movedfrom\UnityEngine.AndroidJNIModule.dll_5420755238517763556.movedfrom
Library\Bee\artifacts\movedfrom\UnityEngine.AnimationModule.dll_16299657910000289978.movedfrom
Library\Bee\artifacts\movedfrom\UnityEngine.ARModule.dll_4738447786055988207.movedfrom
Library\Bee\artifacts\movedfrom\UnityEngine.AssetBundleModule.dll_5227092136227625768.movedfrom
Library\Bee\artifacts\movedfrom\UnityEngine.AudioModule.dll_5362887796640820012.movedfrom
Library\Bee\artifacts\movedfrom\UnityEngine.ClothModule.dll_12778166815577246224.movedfrom
Library\Bee\artifacts\movedfrom\UnityEngine.ClusterInputModule.dll_8730648346629980046.movedfrom
Library\Bee\artifacts\movedfrom\UnityEngine.ClusterRendererModule.dll_3516820122725970131.movedfrom
Library\Bee\artifacts\movedfrom\UnityEngine.CoreModule.dll_13325959210456555581.movedfrom
Library\Bee\artifacts\movedfrom\UnityEngine.CrashReportingModule.dll_4775055690404477941.movedfrom
Library\Bee\artifacts\movedfrom\UnityEngine.DirectorModule.dll_13751044735876961690.movedfrom
Library\Bee\artifacts\movedfrom\UnityEngine.dll_10408368796667688136.movedfrom
Library\Bee\artifacts\movedfrom\UnityEngine.DSPGraphModule.dll_14134239284698572475.movedfrom
Library\Bee\artifacts\movedfrom\UnityEngine.GameCenterModule.dll_8468929240173207253.movedfrom
Library\Bee\artifacts\movedfrom\UnityEngine.GIModule.dll_2345211238619544896.movedfrom
Library\Bee\artifacts\movedfrom\UnityEngine.GridModule.dll_10835780800921744948.movedfrom
Library\Bee\artifacts\movedfrom\UnityEngine.HotReloadModule.dll_7168818597868282940.movedfrom
Library\Bee\artifacts\movedfrom\UnityEngine.ImageConversionModule.dll_11295097088711043271.movedfrom
Library\Bee\artifacts\movedfrom\UnityEngine.IMGUIModule.dll_9425028449312915213.movedfrom
Library\Bee\artifacts\movedfrom\UnityEngine.InputLegacyModule.dll_15694894863332380953.movedfrom
Library\Bee\artifacts\movedfrom\UnityEngine.InputModule.dll_12745914521496178640.movedfrom
Library\Bee\artifacts\movedfrom\UnityEngine.JSONSerializeModule.dll_13287171956671672222.movedfrom
Library\Bee\artifacts\movedfrom\UnityEngine.LocalizationModule.dll_13219833731289133703.movedfrom
Library\Bee\artifacts\movedfrom\UnityEngine.ParticleSystemModule.dll_10760983137746274179.movedfrom
Library\Bee\artifacts\movedfrom\UnityEngine.PerformanceReportingModule.dll_11455996928600879612.movedfrom
Library\Bee\artifacts\movedfrom\UnityEngine.Physics2DModule.dll_3375998171102642255.movedfrom
Library\Bee\artifacts\movedfrom\UnityEngine.PhysicsModule.dll_466960537447150461.movedfrom
Library\Bee\artifacts\movedfrom\UnityEngine.ProfilerModule.dll_17373690592806902951.movedfrom
Library\Bee\artifacts\movedfrom\UnityEngine.RuntimeInitializeOnLoadManagerInitializerModule.dll_11830075875135688472.movedfrom
Library\Bee\artifacts\movedfrom\UnityEngine.ScreenCaptureModule.dll_15153823314324921344.movedfrom
Library\Bee\artifacts\movedfrom\UnityEngine.SharedInternalsModule.dll_2364809589160518679.movedfrom
Library\Bee\artifacts\movedfrom\UnityEngine.SpriteMaskModule.dll_6824115439637951567.movedfrom
Library\Bee\artifacts\movedfrom\UnityEngine.SpriteShapeModule.dll_7055884927534371634.movedfrom
Library\Bee\artifacts\movedfrom\UnityEngine.StreamingModule.dll_10865199988858404856.movedfrom
Library\Bee\artifacts\movedfrom\UnityEngine.SubstanceModule.dll_8319281129539419654.movedfrom
Library\Bee\artifacts\movedfrom\UnityEngine.SubsystemsModule.dll_14511028148887936098.movedfrom
Library\Bee\artifacts\movedfrom\UnityEngine.TerrainModule.dll_2360296946765659243.movedfrom
Library\Bee\artifacts\movedfrom\UnityEngine.TerrainPhysicsModule.dll_10795508709520359952.movedfrom
Library\Bee\artifacts\movedfrom\UnityEngine.TextCoreModule.dll_6309642305745847722.movedfrom
Library\Bee\artifacts\movedfrom\UnityEngine.TextRenderingModule.dll_18126042983761845237.movedfrom
Library\Bee\artifacts\movedfrom\UnityEngine.TilemapModule.dll_13816442303036054900.movedfrom
Library\Bee\artifacts\movedfrom\UnityEngine.TLSModule.dll_17010935142690282769.movedfrom
Library\Bee\artifacts\movedfrom\UnityEngine.UIElementsModule.dll_14816817072953432153.movedfrom
Library\Bee\artifacts\movedfrom\UnityEngine.UIElementsNativeModule.dll_16404087645808775184.movedfrom
Library\Bee\artifacts\movedfrom\UnityEngine.UIModule.dll_9494487766957038290.movedfrom
Library\Bee\artifacts\movedfrom\UnityEngine.UmbraModule.dll_14213776185778001567.movedfrom
Library\Bee\artifacts\movedfrom\UnityEngine.UNETModule.dll_5446427779764229558.movedfrom
Library\Bee\artifacts\movedfrom\UnityEngine.UnityAnalyticsModule.dll_13039647085698029951.movedfrom
Library\Bee\artifacts\movedfrom\UnityEngine.UnityConnectModule.dll_16639830181057097075.movedfrom
Library\Bee\artifacts\movedfrom\UnityEngine.UnityCurlModule.dll_1535909665278786215.movedfrom
Library\Bee\artifacts\movedfrom\UnityEngine.UnityTestProtocolModule.dll_16212891556227211925.movedfrom
Library\Bee\artifacts\movedfrom\UnityEngine.UnityWebRequestAssetBundleModule.dll_17342431186357961616.movedfrom
Library\Bee\artifacts\movedfrom\UnityEngine.UnityWebRequestAudioModule.dll_1655130454738828436.movedfrom
Library\Bee\artifacts\movedfrom\UnityEngine.UnityWebRequestModule.dll_12564839135562449734.movedfrom
Library\Bee\artifacts\movedfrom\UnityEngine.UnityWebRequestTextureModule.dll_16668410544042552553.movedfrom
Library\Bee\artifacts\movedfrom\UnityEngine.UnityWebRequestWWWModule.dll_17353591697970699941.movedfrom
Library\Bee\artifacts\movedfrom\UnityEngine.VehiclesModule.dll_3934034824068425013.movedfrom
Library\Bee\artifacts\movedfrom\UnityEngine.VFXModule.dll_7850218152476591742.movedfrom
Library\Bee\artifacts\movedfrom\UnityEngine.VideoModule.dll_8031697644900304593.movedfrom
Library\Bee\artifacts\movedfrom\UnityEngine.VirtualTexturingModule.dll_591021842378838171.movedfrom
Library\Bee\artifacts\movedfrom\UnityEngine.VRModule.dll_15462362578562228298.movedfrom
Library\Bee\artifacts\movedfrom\UnityEngine.WindModule.dll_3404207248687373990.movedfrom
Library\Bee\artifacts\movedfrom\UnityEngine.XRModule.dll_672192876573683112.movedfrom
Library\Bee\artifacts\movedfrom\UnityEditor.Android.Extensions.dll_1280721742464316538.movedfrom
Library\Bee\artifacts\movedfrom\UnityEditor.AppleTV.Extensions.dll_18154823716333846126.movedfrom
Library\Bee\artifacts\movedfrom\UnityEditor.iOS.Extensions.Xcode.dll_10498979789981888932.movedfrom
Library\Bee\artifacts\movedfrom\UnityEditor.iOS.Extensions.Common.dll_16508229547760025303.movedfrom
Library\Bee\artifacts\movedfrom\UnityEditor.iOS.Extensions.dll_2078722475627465310.movedfrom
Library\Bee\artifacts\movedfrom\UnityEditor.iOS.Extensions.Xcode.dll_2213281010978245221.movedfrom
Library\Bee\artifacts\movedfrom\UnityEditor.LinuxStandalone.Extensions.dll_6857850218306649438.movedfrom
Library\Bee\artifacts\movedfrom\UnityEditor.Lumin.Extensions.dll_12146564074688855742.movedfrom
Library\Bee\artifacts\movedfrom\UnityEditor.OSXStandalone.Extensions.dll_5376597413742022233.movedfrom
Library\Bee\artifacts\movedfrom\UnityEditor.UWP.Extensions.dll_13291095960922219673.movedfrom
Library\Bee\artifacts\movedfrom\UnityEditor.WebGL.Extensions.dll_9479280427387176894.movedfrom
Library\Bee\artifacts\movedfrom\UnityEditor.WindowsStandalone.Extensions.dll_10750140688074149806.movedfrom