{
  "project_info": {
    "project_number": "782971096675",
    "firebase_url": "https://planetshare-72ab5.firebaseio.com",
    "project_id": "planetshare-72ab5",
    "storage_bucket": "planetshare-72ab5.appspot.com"
  },
  "client": [
    {
      "client_info": {
        "mobilesdk_app_id": "1:782971096675:android:916bc902a3067a10a1b256",
        "android_client_info": {
          "package_name": "com.planetshare.activity"
        }
      },
      "oauth_client": [
        {
          "client_id": "782971096675-cecse4ee1apifius6su28alk2p8v8i45.apps.googleusercontent.com",
          "client_type": 3
        }
      ],
      "api_key": [
        {
          "current_key": "AIzaSyDH8-heV2Tk527Dw0ekr_MWiOQxIzBljKs"
        }
      ],
      "services": {
        "appinvite_service": {
          "other_platform_oauth_client": [
            {
              "client_id": "782971096675-cecse4ee1apifius6su28alk2p8v8i45.apps.googleusercontent.com",
              "client_type": 3
            }
          ]
        }
      }
    }
  ],
  "configuration_version": "1"
}