{
    "name": "string",
    "includes": [
        "string.h"
    ],
    "extra": [
    ],
    "functions": {
        "memcpy": {
            "active": true,
            "args": [
                { "name": "dest", "type": "void*"},
                { "name": "src", "type": "void*"},
                { "name": "n", "type": "size_t"}
            ],
            "ret": "void*"
        },
        "memmove": {
            "active": true,
            "args": [
                { "name": "dest", "type": "void*"},
                { "name": "src", "type": "void*"},
                { "name": "n", "type": "size_t"}
            ],
            "ret": "void*"
        },
        "strcpy": {
            "active": true,
            "args": [
                { "name": "dest", "type": "char*" },
                { "name": "src", "type": "char const*" }
            ],
            "ret": "char *"
        },
        "strncpy": {
            "active": true,
            "args": [
                { "name": "dest", "type": "char *" },
                { "name": "src", "type": "char const *"},
                { "name": "count", "type": "size_t" }
            ],
            "ret": "char *"
        },
        "strcat": {
            "active": true,
            "args": [
                { "name": "dest", "type": "char *" },
                { "name": "src", "type": "char const *" }
            ],
            "ret": "char *"
        },
        "strncat": {
            "active" : true,
            "args": [
                { "name": "dest", "type": "char *" },
                { "name": "src", "type": "char const *" },
                { "name": "count", "type": "size_t" }
            ],
            "ret": "char *"
        },
        "strxfrm": {
            "active": true,
            "args": [
                { "name": "dest", "type": "char *restrict " },
                { "name": "src", "type": "const char *restrict " },
                { "name": "count", "type": "size_t " }
            ],
            "ret": "size_t"
        },
        "strlen": {
            "active": true,
            "args": [
                { "name": "str", "type": "const char *" }
            ],
            "ret": "size_t"
        },
        "strcmp": {
            "active": true,
            "args": [
                { "name": "lhs", "type": "const char *" },
                { "name": "rhs", "type": "const char *" }
            ],
            "ret": "int"
        },
        "strcoll": {
            "active": true,
            "args": [
                { "name": "lhs", "type": "const char *" },
                { "name": "rhs", "type": "const char *" }
            ],
            "ret": "int"
        },
        "strchr": {
            "active": true,
            "args": [
                { "name": "str", "type": "const char *" },
                { "name": "ch", "type": "int " }
            ],
            "ret": "char*"
        },
        "strspn": {
            "active": true,
            "args": [
                { "name": "dest", "type": "const char *" },
                { "name": "src", "type": "const char *" }
            ],
            "ret": "size_t"
        },
        "strcspn": {
            "active": true,
            "args": [
                { "name": "dest", "type": "const char *" },
                { "name": "src", "type": "const char *" }
            ],
            "ret": "size_t"
        },
        "strpbrk": {
            "active": true,
            "args": [
                { "name": "dest", "type": "const char* " },
                { "name": "breakset", "type": "const char* " }
            ],
            "ret": "char*"
        },
        "strstr": {
            "active": true,
            "args": [
                { "name": "str", "type": "const char* " },
                { "name": "substr", "type": "const char* " }
            ],
            "ret": "char*"
        },
        "strtok": {
            "active": true,
            "args": [
                { "name": "str", "type": "char *restrict " },
                { "name": "delim", "type": "const char *restrict " }
            ],
            "ret": "char*"
        },
        "memchr": {
            "active": true,
            "args": [
                { "name": "ptr", "type": "const void* " },
                { "name": "ch", "type": "int " },
                { "name": "count", "type": "size_t " }
            ],
            "ret": "void*"
        },
        "memcmp": {
            "active": true,
            "args": [
                { "name": "lhs", "type": "const void* " },
                { "name": "rhs", "type": "const void* " },
                { "name": "count", "type": "size_t " }
            ],
            "ret": "int"
        },
        "memset": {
            "active": true,
            "args": [
                { "name": "dest", "type": "void *" },
                { "name": "ch", "type": "int " },
                { "name": "count", "type": "size_t " }
            ],
            "ret": "void*"
        },
        "memcpy": {
            "active": true,
            "args": [
                { "name": "dest", "type": "void *restrict " },
                { "name": "src", "type": "const void *restrict " },
                { "name": "count", "type": "size_t " }
            ],
            "ret": "void*"
        },
        "memmove": {
            "active": true,
            "args": [
                { "name": "dest", "type": "void* " },
                { "name": "src", "type": "const void* " },
                { "name": "count", "type": "size_t " }
            ],
            "ret": "void*"
        },
        "strerror": {
            "active": true,
            "args": [
                { "name": "errnum", "type": "int " }
            ],
            "ret": "char*"
        }
    }
}

