%YAML 1.1
%TAG !u! tag:unity3d.com,2011:
--- !u!1045 &1
EditorBuildSettings:
  m_ObjectHideFlags: 0
  serializedVersion: 2
  m_Scenes:
  - enabled: 1
    path: Assets/Scenes/GameLauncherScene.unity
    guid: bdb4ea81c5224324c80aaf34c97b8e75
  - enabled: 1
    path: Assets/Scenes/GameScene.unity
    guid: e3d8a71be927e874c8fa79c437de0f97
  m_configObjects: {}
