77.106    .48750
74.812    .29130
87.349    .11170
86.830    .05770
89.805    .05190
13.210    .37280
12.691    .34820
15.710    .10920
15.582    .09160
16.295    .02170
16.271    .01880
13.808    .01950
13.700    .01300
15.951    .00320
15.904    .00200
13.024    .77750
15.248    .16890
11.712    .02150
14.773    .00560
15.685    .02440
15.551    .00120
12.534    .00090
10.839    .68990
10.731    .07850
12.980    .14030
12.955    .01570
9.420    .04120
12.482    .01030
13.259    .00220
13.395    .02190