1.000E-03 1.326E+01 4.873E-03 6.456E+03 6.470E+03 
1.039E-03 1.321E+01 5.120E-03 6.021E+03 6.034E+03 
1.080E-03 1.316E+01 5.377E-03 5.610E+03 5.623E+03 
1.080E-03 1.316E+01 5.377E-03 5.690E+03 5.703E+03 
1.200E-03 1.302E+01 6.100E-03 4.660E+03 4.673E+03 
1.269E-03 1.293E+01 6.509E-03 4.191E+03 4.204E+03 
1.269E-03 1.293E+01 6.509E-03 4.276E+03 4.289E+03 
1.500E-03 1.263E+01 7.910E-03 3.069E+03 3.082E+03 
2.000E-03 1.198E+01 1.088E-02 1.684E+03 1.696E+03 
2.500E-03 1.135E+01 1.378E-02 1.028E+03 1.040E+03 
3.000E-03 1.074E+01 1.662E-02 6.873E+02 6.980E+02 
3.219E-03 1.049E+01 1.784E-02 5.854E+02 5.959E+02 
3.219E-03 1.049E+01 1.784E-02 1.526E+03 1.536E+03 
3.294E-03 1.040E+01 1.825E-02 1.406E+03 1.416E+03 
3.370E-03 1.031E+01 1.866E-02 1.296E+03 1.306E+03 
3.370E-03 1.031E+01 1.866E-02 1.882E+03 1.892E+03 
3.500E-03 1.017E+01 1.936E-02 1.708E+03 1.718E+03 
3.909E-03 9.719E+00 2.150E-02 1.287E+03 1.297E+03 
3.909E-03 9.719E+00 2.150E-02 1.495E+03 1.504E+03 
4.000E-03 9.624E+00 2.197E-02 1.416E+03 1.426E+03 
4.500E-03 9.154E+00 2.428E-02 1.052E+03 1.061E+03 
4.656E-03 8.968E+00 2.518E-02 9.655E+02 9.745E+02 
4.656E-03 8.968E+00 2.518E-02 1.025E+03 1.034E+03 
5.000E-03 8.647E+00 2.676E-02 8.600E+02 8.686E+02 
5.002E-03 8.647E+00 2.676E-02 8.592E+02 8.679E+02 
5.002E-03 8.647E+00 2.676E-02 8.966E+02 9.053E+02 
5.500E-03 8.340E+00 2.824E-02 7.112E+02 7.195E+02 
6.000E-03 7.807E+00 3.104E-02 5.751E+02 5.829E+02 
6.500E-03 7.371E+00 3.343E-02 4.714E+02 4.788E+02 
7.000E-03 7.023E+00 3.532E-02 3.921E+02 3.992E+02 
7.500E-03 6.719E+00 3.696E-02 3.304E+02 3.371E+02 
8.000E-03 6.433E+00 3.854E-02 2.814E+02 2.879E+02 
8.500E-03 6.151E+00 4.019E-02 2.414E+02 2.476E+02 
9.000E-03 5.879E+00 4.189E-02 2.088E+02 2.147E+02 
9.500E-03 5.620E+00 4.358E-02 1.821E+02 1.878E+02 
1.000E-02 5.377E+00 4.523E-02 1.599E+02 1.653E+02 
1.050E-02 5.150E+00 4.681E-02 1.410E+02 1.462E+02 
1.100E-02 4.938E+00 4.831E-02 1.251E+02 1.301E+02 
1.150E-02 4.739E+00 4.975E-02 1.116E+02 1.164E+02 
1.200E-02 4.552E+00 5.114E-02 1.000E+02 1.046E+02 
1.250E-02 4.377E+00 5.247E-02 9.004E+01 9.447E+01 
1.300E-02 4.211E+00 5.374E-02 8.139E+01 8.566E+01 
1.350E-02 4.054E+00 5.498E-02 7.386E+01 7.797E+01 
1.400E-02 3.906E+00 5.617E-02 6.726E+01 7.122E+01 
1.450E-02 3.765E+00 5.732E-02 6.145E+01 6.527E+01 
1.500E-02 3.631E+00 5.844E-02 5.631E+01 6.000E+01 
1.550E-02 3.504E+00 5.952E-02 5.173E+01 5.529E+01 
1.587E-02 3.414E+00 6.029E-02 4.865E+01 5.212E+01 
1.587E-02 3.414E+00 6.029E-02 1.179E+02 1.214E+02 
1.600E-02 3.383E+00 6.056E-02 1.153E+02 1.188E+02 
1.650E-02 3.268E+00 6.155E-02 1.061E+02 1.094E+02 
1.700E-02 3.157E+00 6.249E-02 9.782E+01 1.010E+02 
1.750E-02 3.052E+00 6.341E-02 9.040E+01 9.352E+01 
1.800E-02 2.953E+00 6.430E-02 8.374E+01 8.675E+01 
1.850E-02 2.858E+00 6.518E-02 7.772E+01 8.065E+01 
1.900E-02 2.768E+00 6.604E-02 7.229E+01 7.512E+01 
1.908E-02 2.753E+00 6.618E-02 7.143E+01 7.425E+01 
1.908E-02 2.753E+00 6.618E-02 1.008E+02 1.036E+02 
1.950E-02 2.682E+00 6.689E-02 9.542E+01 9.817E+01 
1.984E-02 2.627E+00 6.743E-02 9.133E+01 9.402E+01 
1.984E-02 2.627E+00 6.743E-02 1.051E+02 1.078E+02 
2.000E-02 2.601E+00 6.767E-02 1.035E+02 1.061E+02 
2.050E-02 2.523E+00 6.840E-02 9.712E+01 9.971E+01 
2.100E-02 2.448E+00 6.912E-02 9.128E+01 9.380E+01 
2.150E-02 2.377E+00 6.984E-02 8.593E+01 8.837E+01 
2.200E-02 2.308E+00 7.054E-02 8.100E+01 8.338E+01 
2.250E-02 2.243E+00 7.123E-02 7.645E+01 7.877E+01 
2.300E-02 2.180E+00 7.191E-02 7.225E+01 7.450E+01 
2.350E-02 2.120E+00 7.257E-02 6.837E+01 7.056E+01 
2.400E-02 2.063E+00 7.323E-02 6.477E+01 6.690E+01 
2.450E-02 2.008E+00 7.387E-02 6.142E+01 6.351E+01 
2.500E-02 1.955E+00 7.450E-02 5.832E+01 6.035E+01 
2.550E-02 1.904E+00 7.511E-02 5.542E+01 5.740E+01 
2.600E-02 1.856E+00 7.571E-02 5.272E+01 5.466E+01 
2.650E-02 1.809E+00 7.630E-02 5.021E+01 5.209E+01 
2.700E-02 1.765E+00 7.688E-02 4.785E+01 4.969E+01 
2.750E-02 1.722E+00 7.744E-02 4.565E+01 4.745E+01 
2.800E-02 1.680E+00 7.799E-02 4.358E+01 4.534E+01 
2.850E-02 1.641E+00 7.853E-02 4.164E+01 4.336E+01 
2.900E-02 1.603E+00 7.905E-02 3.982E+01 4.150E+01 
2.950E-02 1.566E+00 7.956E-02 3.811E+01 3.976E+01 
3.000E-02 1.531E+00 8.006E-02 3.650E+01 3.811E+01 
3.050E-02 1.497E+00 8.054E-02 3.495E+01 3.652E+01 
3.100E-02 1.465E+00 8.101E-02 3.348E+01 3.503E+01 
3.150E-02 1.433E+00 8.147E-02 3.210E+01 3.361E+01 
3.200E-02 1.403E+00 8.191E-02 3.080E+01 3.228E+01 