1.000E-03 1.085E+01 4.754E-03 3.007E+03 3.017E+03 
1.200E-03 1.065E+01 5.999E-03 2.090E+03 2.101E+03 
1.500E-03 1.039E+01 7.897E-03 1.340E+03 1.350E+03 
1.528E-03 1.037E+01 8.071E-03 1.290E+03 1.300E+03 
1.528E-03 1.037E+01 8.071E-03 1.937E+03 1.948E+03 
1.552E-03 1.034E+01 8.221E-03 2.745E+03 2.756E+03 
1.576E-03 1.032E+01 8.373E-03 3.894E+03 3.905E+03 
1.576E-03 1.032E+01 8.373E-03 4.528E+03 4.538E+03 
1.753E-03 1.015E+01 9.469E-03 3.972E+03 3.982E+03 
1.950E-03 9.960E+00 1.069E-02 3.487E+03 3.497E+03 
1.950E-03 9.960E+00 1.069E-02 4.044E+03 4.054E+03 
2.000E-03 9.912E+00 1.100E-02 3.786E+03 3.796E+03 
2.173E-03 9.734E+00 1.208E-02 3.119E+03 3.128E+03 
2.173E-03 9.734E+00 1.208E-02 3.314E+03 3.324E+03 
2.283E-03 9.622E+00 1.276E-02 2.960E+03 2.969E+03 
2.398E-03 9.508E+00 1.348E-02 2.644E+03 2.653E+03 
2.398E-03 9.508E+00 1.348E-02 2.760E+03 2.769E+03 
2.500E-03 9.409E+00 1.411E-02 2.503E+03 2.512E+03 
3.000E-03 8.927E+00 1.719E-02 1.632E+03 1.640E+03 
3.500E-03 8.439E+00 2.017E-02 1.122E+03 1.130E+03 
4.000E-03 7.963E+00 2.304E-02 8.112E+02 8.192E+02 
4.500E-03 7.511E+00 2.580E-02 6.045E+02 6.120E+02 
5.000E-03 7.086E+00 2.845E-02 4.646E+02 4.717E+02 
5.500E-03 6.685E+00 3.098E-02 3.647E+02 3.715E+02 
6.000E-03 6.310E+00 3.339E-02 2.924E+02 2.988E+02 
6.500E-03 5.958E+00 3.566E-02 2.379E+02 2.439E+02 
7.000E-03 5.633E+00 3.783E-02 1.965E+02 2.022E+02 
7.500E-03 5.334E+00 3.992E-02 1.645E+02 1.699E+02 
8.000E-03 5.060E+00 4.197E-02 1.393E+02 1.444E+02 
8.500E-03 4.807E+00 4.395E-02 1.189E+02 1.238E+02 
8.944E-03 4.587E+00 4.552E-02 1.042E+02 1.088E+02 
8.944E-03 4.587E+00 4.552E-02 2.778E+02 2.824E+02 
9.000E-03 4.559E+00 4.570E-02 2.733E+02 2.779E+02 
9.500E-03 4.319E+00 4.725E-02 2.372E+02 2.416E+02 
9.978E-03 4.134E+00 4.914E-02 2.087E+02 2.129E+02 
9.978E-03 4.134E+00 4.914E-02 2.938E+02 2.980E+02 
1.000E-02 4.128E+00 4.924E-02 2.902E+02 2.944E+02 
1.049E-02 3.940E+00 5.085E-02 2.537E+02 2.577E+02 
1.049E-02 3.940E+00 5.085E-02 2.933E+02 2.973E+02 
1.050E-02 3.934E+00 5.088E-02 2.923E+02 2.963E+02 
1.100E-02 3.741E+00 5.224E-02 2.592E+02 2.630E+02 
1.150E-02 3.566E+00 5.366E-02 2.312E+02 2.348E+02 
1.200E-02 3.406E+00 5.512E-02 2.072E+02 2.106E+02 
1.250E-02 3.258E+00 5.660E-02 1.865E+02 1.898E+02 
1.300E-02 3.122E+00 5.808E-02 1.685E+02 1.717E+02 
1.350E-02 2.994E+00 5.955E-02 1.529E+02 1.560E+02 
1.400E-02 2.875E+00 6.098E-02 1.392E+02 1.422E+02 
1.450E-02 2.764E+00 6.238E-02 1.272E+02 1.300E+02 
1.500E-02 2.659E+00 6.372E-02 1.166E+02 1.193E+02 
1.550E-02 2.560E+00 6.501E-02 1.068E+02 1.095E+02 
1.600E-02 2.466E+00 6.624E-02 9.821E+01 1.007E+02 
1.650E-02 2.378E+00 6.742E-02 9.051E+01 9.295E+01 
1.700E-02 2.295E+00 6.855E-02 8.362E+01 8.598E+01 
1.750E-02 2.216E+00 6.964E-02 7.743E+01 7.971E+01 
1.800E-02 2.141E+00 7.069E-02 7.185E+01 7.406E+01 
1.850E-02 2.071E+00 7.171E-02 6.681E+01 6.895E+01 
1.900E-02 2.004E+00 7.269E-02 6.225E+01 6.432E+01 
1.950E-02 1.941E+00 7.365E-02 5.810E+01 6.012E+01 
2.000E-02 1.881E+00 7.458E-02 5.433E+01 5.628E+01 
2.050E-02 1.825E+00 7.549E-02 5.081E+01 5.271E+01 
2.100E-02 1.771E+00 7.637E-02 4.760E+01 4.945E+01 
2.150E-02 1.720E+00 7.723E-02 4.467E+01 4.646E+01 
2.200E-02 1.671E+00 7.806E-02 4.197E+01 4.372E+01 
2.250E-02 1.624E+00 7.888E-02 3.949E+01 4.120E+01 
2.300E-02 1.580E+00 7.967E-02 3.721E+01 3.887E+01 
2.350E-02 1.537E+00 8.044E-02 3.511E+01 3.672E+01 
2.400E-02 1.496E+00 8.119E-02 3.316E+01 3.474E+01 
2.450E-02 1.457E+00 8.192E-02 3.136E+01 3.290E+01 
2.500E-02 1.419E+00 8.263E-02 2.969E+01 3.119E+01 
2.550E-02 1.383E+00 8.331E-02 2.814E+01 2.961E+01 
2.600E-02 1.349E+00 8.398E-02 2.670E+01 2.813E+01 
2.650E-02 1.315E+00 8.463E-02 2.536E+01 2.676E+01 
2.700E-02 1.283E+00 8.526E-02 2.411E+01 2.548E+01 
2.750E-02 1.252E+00 8.587E-02 2.294E+01 2.428E+01 
2.800E-02 1.222E+00 8.646E-02 2.185E+01 2.316E+01 
2.850E-02 1.193E+00 8.703E-02 2.082E+01 2.210E+01 
2.900E-02 1.165E+00 8.758E-02 1.987E+01 2.112E+01 
2.950E-02 1.137E+00 8.812E-02 1.897E+01 2.019E+01 
3.000E-02 1.111E+00 8.864E-02 1.812E+01 1.932E+01 
3.050E-02 1.086E+00 8.914E-02 1.732E+01 1.849E+01 
3.100E-02 1.061E+00 8.963E-02 1.656E+01 1.771E+01 
3.150E-02 1.037E+00 9.010E-02 1.585E+01 1.698E+01 
3.200E-02 1.014E+00 9.056E-02 1.518E+01 1.628E+01 