1.000E-03 7.833E+00 4.981E-03 7.029E+03 7.037E+03 
1.200E-03 7.682E+00 6.596E-03 4.634E+03 4.642E+03 
1.500E-03 7.453E+00 9.167E-03 2.783E+03 2.791E+03 
2.000E-03 7.018E+00 1.345E-02 1.393E+03 1.401E+03 
2.500E-03 6.560E+00 1.767E-02 7.992E+02 8.058E+02 
3.000E-03 6.113E+00 2.173E-02 5.075E+02 5.136E+02 
3.351E-03 5.812E+00 2.446E-02 3.829E+02 3.887E+02 
3.351E-03 5.812E+00 2.446E-02 1.268E+03 1.274E+03 
3.500E-03 5.686E+00 2.559E-02 1.139E+03 1.145E+03 
3.524E-03 5.667E+00 2.577E-02 1.120E+03 1.126E+03 
3.524E-03 5.667E+00 2.577E-02 1.541E+03 1.547E+03 
3.662E-03 5.553E+00 2.681E-02 1.402E+03 1.408E+03 
3.806E-03 5.437E+00 2.788E-02 1.276E+03 1.282E+03 
3.806E-03 5.437E+00 2.788E-02 1.462E+03 1.468E+03 
4.000E-03 5.285E+00 2.930E-02 1.300E+03 1.305E+03 
4.500E-03 4.915E+00 3.284E-02 9.614E+02 9.664E+02 
5.000E-03 4.577E+00 3.622E-02 7.341E+02 7.388E+02 
5.500E-03 4.272E+00 3.950E-02 5.730E+02 5.773E+02 
6.000E-03 3.996E+00 4.267E-02 4.570E+02 4.611E+02 
6.500E-03 3.748E+00 4.574E-02 3.697E+02 3.735E+02 
7.000E-03 3.525E+00 4.869E-02 3.037E+02 3.073E+02 
7.500E-03 3.324E+00 5.152E-02 2.530E+02 2.564E+02 
8.000E-03 3.142E+00 5.424E-02 2.132E+02 2.164E+02 
8.500E-03 2.977E+00 5.683E-02 1.810E+02 1.840E+02 
9.000E-03 2.827E+00 5.929E-02 1.551E+02 1.579E+02 
9.500E-03 2.690E+00 6.164E-02 1.340E+02 1.367E+02 
1.000E-02 2.563E+00 6.387E-02 1.166E+02 1.193E+02 
1.050E-02 2.446E+00 6.598E-02 1.020E+02 1.045E+02 
1.100E-02 2.338E+00 6.799E-02 8.972E+01 9.213E+01 
1.150E-02 2.237E+00 6.990E-02 7.939E+01 8.170E+01 
1.200E-02 2.142E+00 7.172E-02 7.062E+01 7.284E+01 
1.250E-02 2.053E+00 7.345E-02 6.312E+01 6.525E+01 
1.300E-02 1.970E+00 7.510E-02 5.666E+01 5.871E+01 
1.350E-02 1.891E+00 7.668E-02 5.107E+01 5.304E+01 
1.400E-02 1.816E+00 7.819E-02 4.621E+01 4.810E+01 
1.450E-02 1.745E+00 7.963E-02 4.196E+01 4.378E+01 
1.500E-02 1.678E+00 8.101E-02 3.822E+01 3.998E+01 
1.550E-02 1.614E+00 8.233E-02 3.487E+01 3.657E+01 
1.600E-02 1.554E+00 8.360E-02 3.191E+01 3.355E+01 
1.650E-02 1.496E+00 8.482E-02 2.928E+01 3.086E+01 
1.700E-02 1.441E+00 8.599E-02 2.694E+01 2.846E+01 
1.750E-02 1.389E+00 8.711E-02 2.484E+01 2.632E+01 
1.800E-02 1.340E+00 8.820E-02 2.296E+01 2.439E+01 
1.850E-02 1.293E+00 8.925E-02 2.126E+01 2.265E+01 
1.900E-02 1.248E+00 9.025E-02 1.974E+01 2.108E+01 
1.950E-02 1.205E+00 9.123E-02 1.835E+01 1.965E+01 
2.000E-02 1.165E+00 9.217E-02 1.710E+01 1.836E+01 
2.050E-02 1.126E+00 9.309E-02 1.595E+01 1.717E+01 
2.100E-02 1.089E+00 9.397E-02 1.490E+01 1.608E+01 
2.150E-02 1.054E+00 9.482E-02 1.394E+01 1.509E+01 
2.200E-02 1.021E+00 9.565E-02 1.307E+01 1.418E+01 
2.250E-02 9.891E-01 9.644E-02 1.226E+01 1.335E+01 
2.300E-02 9.589E-01 9.722E-02 1.152E+01 1.258E+01 
2.350E-02 9.300E-01 9.796E-02 1.084E+01 1.187E+01 
2.400E-02 9.025E-01 9.868E-02 1.022E+01 1.122E+01 
2.450E-02 8.763E-01 9.938E-02 9.641E+00 1.062E+01 
2.500E-02 8.513E-01 1.000E-01 9.106E+00 1.006E+01 
2.550E-02 8.275E-01 1.007E-01 8.611E+00 9.539E+00 
2.551E-02 8.268E-01 1.007E-01 8.598E+00 9.525E+00 
2.551E-02 8.268E-01 1.007E-01 5.447E+01 5.539E+01 
2.600E-02 8.047E-01 1.013E-01 5.190E+01 5.281E+01 
2.650E-02 7.829E-01 1.019E-01 4.944E+01 5.032E+01 
2.700E-02 7.621E-01 1.025E-01 4.713E+01 4.800E+01 
2.750E-02 7.422E-01 1.031E-01 4.497E+01 4.581E+01 
2.800E-02 7.231E-01 1.036E-01 4.293E+01 4.376E+01 
2.850E-02 7.048E-01 1.041E-01 4.102E+01 4.183E+01 
2.900E-02 6.873E-01 1.047E-01 3.922E+01 4.001E+01 
2.950E-02 6.705E-01 1.051E-01 3.752E+01 3.830E+01 
3.000E-02 6.543E-01 1.056E-01 3.592E+01 3.668E+01 
3.050E-02 6.388E-01 1.061E-01 3.440E+01 3.515E+01 
3.100E-02 6.238E-01 1.065E-01 3.297E+01 3.370E+01 
3.150E-02 6.094E-01 1.070E-01 3.161E+01 3.233E+01 
3.200E-02 5.956E-01 1.074E-01 3.033E+01 3.103E+01 