61.142    .49850
59.719    .28810
69.308    .11020
68.994    .05700
71.207    .04620
10.160    .41240
9.846    .33200
12.082    .11190
12.010    .08430
12.487    .03090
10.643    .01490
10.577    .00990
12.261    .00360
10.010    .80230
11.685    .16010
9.027    .02180
11.334    .00550
11.956    .00850
11.876    .00100
9.591    .00070
8.653    .71220
8.586    .08090
10.274    .15060
7.604    .03780
9.911    .00920
10.453    .00170
10.532    .00760