23.174    .53670
22.984    .28540
26.095    .09940
26.060    .05110
26.645    .02730
3.401    .51550
3.367    .31350
3.951    .16220
3.612    .00880
3.317    .86910
3.717    .10020
2.957    .02560
3.619    .00500
3.133    .86300
3.528    .09870
2.767    .03200
3.430    .00630



















