21.176    .54030
21.020    .28600
23.818    .09800
23.791    .05040
24.298    .02530
3.073    .52760
3.045    .31630
3.553    .15610
2.990    .88660
3.329    .08190
2.660    .02650
3.244    .00500
2.838    .88070
3.172    .08070
2.503    .03240
3.087    .00620
















