1.000E-03 1.919E+00 1.270E-02 6.523E+02 6.542E+02 
1.035E-03 1.909E+00 1.326E-02 5.945E+02 5.964E+02 
1.072E-03 1.898E+00 1.384E-02 5.412E+02 5.431E+02 
1.072E-03 1.898E+00 1.384E-02 6.433E+03 6.435E+03 
1.200E-03 1.861E+00 1.578E-02 5.155E+03 5.156E+03 
1.500E-03 1.775E+00 1.994E-02 3.193E+03 3.195E+03 
2.000E-03 1.641E+00 2.638E-02 1.519E+03 1.521E+03 
2.500E-03 1.519E+00 3.286E-02 8.323E+02 8.339E+02 
3.000E-03 1.403E+00 3.948E-02 5.056E+02 5.070E+02 
3.500E-03 1.291E+00 4.618E-02 3.286E+02 3.299E+02 
4.000E-03 1.185E+00 5.284E-02 2.249E+02 2.261E+02 
4.500E-03 1.085E+00 5.932E-02 1.604E+02 1.616E+02 
5.000E-03 9.925E-01 6.557E-02 1.183E+02 1.194E+02 
5.500E-03 9.077E-01 7.153E-02 8.959E+01 9.057E+01 
6.000E-03 8.306E-01 7.717E-02 6.939E+01 7.030E+01 
6.500E-03 7.611E-01 8.246E-02 5.478E+01 5.563E+01 
7.000E-03 6.987E-01 8.740E-02 4.396E+01 4.475E+01 
7.500E-03 6.429E-01 9.199E-02 3.579E+01 3.652E+01 
8.000E-03 5.931E-01 9.624E-02 2.950E+01 3.018E+01 
8.500E-03 5.485E-01 1.002E-01 2.458E+01 2.523E+01 
9.000E-03 5.086E-01 1.038E-01 2.068E+01 2.129E+01 
9.500E-03 4.729E-01 1.071E-01 1.756E+01 1.814E+01 
1.000E-02 4.409E-01 1.101E-01 1.502E+01 1.557E+01 
1.050E-02 4.121E-01 1.129E-01 1.295E+01 1.347E+01 
1.100E-02 3.861E-01 1.154E-01 1.123E+01 1.173E+01 
1.150E-02 3.626E-01 1.178E-01 9.802E+00 1.028E+01 
1.200E-02 3.413E-01 1.200E-01 8.602E+00 9.063E+00 
1.250E-02 3.219E-01 1.220E-01 7.587E+00 8.031E+00 
1.300E-02 3.042E-01 1.238E-01 6.723E+00 7.151E+00 
1.350E-02 2.881E-01 1.256E-01 5.983E+00 6.397E+00 
1.400E-02 2.732E-01 1.271E-01 5.347E+00 5.747E+00 
1.450E-02 2.596E-01 1.286E-01 4.796E+00 5.184E+00 
1.500E-02 2.470E-01 1.300E-01 4.317E+00 4.694E+00 
1.550E-02 2.354E-01 1.313E-01 3.899E+00 4.265E+00 
1.600E-02 2.247E-01 1.325E-01 3.532E+00 3.889E+00 
1.650E-02 2.147E-01 1.336E-01 3.209E+00 3.557E+00 
1.700E-02 2.054E-01 1.347E-01 2.923E+00 3.263E+00 
1.750E-02 1.968E-01 1.356E-01 2.670E+00 3.002E+00 
1.800E-02 1.887E-01 1.366E-01 2.445E+00 2.770E+00 
1.850E-02 1.812E-01 1.374E-01 2.244E+00 2.562E+00 
1.900E-02 1.741E-01 1.382E-01 2.064E+00 2.376E+00 
1.950E-02 1.675E-01 1.390E-01 1.902E+00 2.208E+00 
2.000E-02 1.612E-01 1.397E-01 1.756E+00 2.057E+00 
2.050E-02 1.553E-01 1.404E-01 1.625E+00 1.921E+00 
2.100E-02 1.498E-01 1.411E-01 1.506E+00 1.797E+00 
2.150E-02 1.446E-01 1.417E-01 1.398E+00 1.685E+00 
2.200E-02 1.396E-01 1.423E-01 1.301E+00 1.582E+00 
2.250E-02 1.349E-01 1.429E-01 1.211E+00 1.489E+00 
2.300E-02 1.304E-01 1.434E-01 1.130E+00 1.404E+00 
2.350E-02 1.262E-01 1.439E-01 1.056E+00 1.326E+00 
2.400E-02 1.222E-01 1.444E-01 9.876E-01 1.254E+00 
2.450E-02 1.184E-01 1.448E-01 9.251E-01 1.188E+00 
2.500E-02 1.147E-01 1.452E-01 8.676E-01 1.128E+00 
2.550E-02 1.112E-01 1.456E-01 8.147E-01 1.072E+00 
2.600E-02 1.079E-01 1.460E-01 7.660E-01 1.020E+00 
2.650E-02 1.047E-01 1.464E-01 7.209E-01 9.720E-01 
2.700E-02 1.017E-01 1.467E-01 6.793E-01 9.277E-01 
2.750E-02 9.879E-02 1.471E-01 6.407E-01 8.866E-01 
2.800E-02 9.601E-02 1.474E-01 6.050E-01 8.483E-01 
2.850E-02 9.334E-02 1.476E-01 5.718E-01 8.128E-01 
2.900E-02 9.078E-02 1.479E-01 5.409E-01 7.796E-01 
2.950E-02 8.833E-02 1.482E-01 5.122E-01 7.487E-01 
3.000E-02 8.597E-02 1.484E-01 4.854E-01 7.198E-01 
3.050E-02 8.371E-02 1.486E-01 4.604E-01 6.928E-01 
3.100E-02 8.153E-02 1.489E-01 4.371E-01 6.675E-01 
3.150E-02 7.943E-02 1.491E-01 4.153E-01 6.438E-01 
3.200E-02 7.741E-02 1.493E-01 3.948E-01 6.215E-01 