1.000E-03 1.206E+01 3.368E-03 4.421E+03 4.433E+03 
1.200E-03 1.188E+01 4.464E-03 3.077E+03 3.089E+03 
1.500E-03 1.160E+01 6.211E-03 1.975E+03 1.986E+03 
2.000E-03 1.106E+01 9.128E-03 1.069E+03 1.080E+03 
2.122E-03 1.092E+01 9.835E-03 9.397E+02 9.506E+02 
2.122E-03 1.092E+01 9.835E-03 1.019E+03 1.030E+03 
2.161E-03 1.087E+01 1.007E-02 1.529E+03 1.539E+03 
2.202E-03 1.083E+01 1.030E-02 2.293E+03 2.304E+03 
2.202E-03 1.083E+01 1.030E-02 2.441E+03 2.452E+03 
2.500E-03 1.049E+01 1.200E-02 2.339E+03 2.349E+03 
2.645E-03 1.033E+01 1.282E-02 2.295E+03 2.305E+03 
2.645E-03 1.033E+01 1.282E-02 2.651E+03 2.661E+03 
3.000E-03 9.922E+00 1.481E-02 1.955E+03 1.965E+03 
3.026E-03 9.891E+00 1.495E-02 1.913E+03 1.923E+03 
3.026E-03 9.891E+00 1.495E-02 2.031E+03 2.041E+03 
3.158E-03 9.742E+00 1.567E-02 1.837E+03 1.846E+03 
3.296E-03 9.591E+00 1.642E-02 1.661E+03 1.670E+03 
3.296E-03 9.591E+00 1.642E-02 1.732E+03 1.742E+03 
3.500E-03 9.370E+00 1.752E-02 1.501E+03 1.510E+03 
4.000E-03 8.841E+00 2.017E-02 1.091E+03 1.100E+03 
4.500E-03 8.347E+00 2.276E-02 8.181E+02 8.265E+02 
5.000E-03 7.887E+00 2.530E-02 6.322E+02 6.401E+02 
5.500E-03 7.458E+00 2.778E-02 4.983E+02 5.058E+02 
6.000E-03 7.060E+00 3.019E-02 4.010E+02 4.081E+02 
6.500E-03 6.692E+00 3.254E-02 3.271E+02 3.339E+02 
7.000E-03 6.351E+00 3.480E-02 2.710E+02 2.773E+02 
7.500E-03 6.034E+00 3.697E-02 2.274E+02 2.334E+02 
8.000E-03 5.739E+00 3.905E-02 1.929E+02 1.987E+02 
8.500E-03 5.463E+00 4.104E-02 1.650E+02 1.705E+02 
9.000E-03 5.206E+00 4.293E-02 1.423E+02 1.476E+02 
9.500E-03 4.966E+00 4.475E-02 1.238E+02 1.288E+02 
1.000E-02 4.742E+00 4.649E-02 1.084E+02 1.132E+02 
1.050E-02 4.532E+00 4.816E-02 9.550E+01 1.001E+02 
1.100E-02 4.335E+00 4.976E-02 8.461E+01 8.899E+01 
1.150E-02 4.147E+00 5.127E-02 7.535E+01 7.955E+01 
1.156E-02 4.124E+00 5.146E-02 7.427E+01 7.845E+01 
1.156E-02 4.124E+00 5.146E-02 1.905E+02 1.946E+02 
1.200E-02 3.969E+00 5.271E-02 1.724E+02 1.764E+02 
1.250E-02 3.801E+00 5.408E-02 1.544E+02 1.582E+02 
1.300E-02 3.644E+00 5.541E-02 1.389E+02 1.426E+02 
1.327E-02 3.562E+00 5.612E-02 1.313E+02 1.349E+02 
1.327E-02 3.562E+00 5.612E-02 1.818E+02 1.854E+02 
1.350E-02 3.497E+00 5.672E-02 1.745E+02 1.780E+02 
1.388E-02 3.393E+00 5.770E-02 1.631E+02 1.666E+02 
1.388E-02 3.393E+00 5.770E-02 1.886E+02 1.921E+02 
1.400E-02 3.360E+00 5.800E-02 1.845E+02 1.879E+02 
1.450E-02 3.231E+00 5.924E-02 1.686E+02 1.719E+02 
1.500E-02 3.109E+00 6.044E-02 1.546E+02 1.578E+02 
1.550E-02 2.993E+00 6.160E-02 1.420E+02 1.451E+02 
1.600E-02 2.883E+00 6.273E-02 1.308E+02 1.338E+02 
1.650E-02 2.779E+00 6.381E-02 1.208E+02 1.237E+02 
1.700E-02 2.680E+00 6.487E-02 1.118E+02 1.146E+02 
1.750E-02 2.587E+00 6.589E-02 1.038E+02 1.064E+02 
1.800E-02 2.499E+00 6.689E-02 9.648E+01 9.905E+01 
1.850E-02 2.415E+00 6.785E-02 8.988E+01 9.236E+01 
1.900E-02 2.337E+00 6.879E-02 8.389E+01 8.630E+01 
1.950E-02 2.262E+00 6.971E-02 7.844E+01 8.077E+01 
2.000E-02 2.191E+00 7.060E-02 7.347E+01 7.573E+01 
2.050E-02 2.124E+00 7.147E-02 6.881E+01 7.100E+01 
2.100E-02 2.061E+00 7.232E-02 6.454E+01 6.668E+01 
2.150E-02 2.000E+00 7.315E-02 6.063E+01 6.271E+01 
2.200E-02 1.943E+00 7.395E-02 5.704E+01 5.906E+01 
2.250E-02 1.888E+00 7.474E-02 5.374E+01 5.570E+01 
2.300E-02 1.836E+00 7.551E-02 5.069E+01 5.260E+01 
2.350E-02 1.786E+00 7.625E-02 4.788E+01 4.974E+01 
2.400E-02 1.738E+00 7.698E-02 4.528E+01 4.709E+01 
2.450E-02 1.692E+00 7.769E-02 4.286E+01 4.463E+01 
2.500E-02 1.649E+00 7.838E-02 4.063E+01 4.235E+01 
2.550E-02 1.607E+00 7.906E-02 3.854E+01 4.023E+01 
2.600E-02 1.566E+00 7.971E-02 3.661E+01 3.825E+01 
2.650E-02 1.528E+00 8.035E-02 3.480E+01 3.641E+01 
2.700E-02 1.490E+00 8.097E-02 3.312E+01 3.469E+01 
2.750E-02 1.455E+00 8.158E-02 3.154E+01 3.308E+01 
2.800E-02 1.420E+00 8.217E-02 3.007E+01 3.157E+01 
2.850E-02 1.387E+00 8.274E-02 2.869E+01 3.016E+01 
2.900E-02 1.355E+00 8.330E-02 2.739E+01 2.883E+01 
2.950E-02 1.324E+00 8.384E-02 2.618E+01 2.759E+01 
3.000E-02 1.294E+00 8.437E-02 2.504E+01 2.641E+01 
3.050E-02 1.265E+00 8.488E-02 2.394E+01 2.529E+01 
3.100E-02 1.237E+00 8.538E-02 2.291E+01 2.423E+01 
3.150E-02 1.210E+00 8.587E-02 2.194E+01 2.324E+01 
3.200E-02 1.184E+00 8.634E-02 2.102E+01 2.230E+01 