1.000E-03 1.103E+01 4.743E-03 3.176E+03 3.187E+03 
1.200E-03 1.085E+01 6.014E-03 2.207E+03 2.218E+03 
1.500E-03 1.056E+01 7.954E-03 1.414E+03 1.424E+03 
1.588E-03 1.047E+01 8.515E-03 1.254E+03 1.264E+03 
1.588E-03 1.047E+01 8.515E-03 1.559E+03 1.570E+03 
1.614E-03 1.045E+01 8.673E-03 2.304E+03 2.314E+03 
1.639E-03 1.042E+01 8.832E-03 3.395E+03 3.406E+03 
1.639E-03 1.042E+01 8.832E-03 3.893E+03 3.903E+03 
2.000E-03 1.006E+01 1.104E-02 3.442E+03 3.452E+03 
2.024E-03 1.004E+01 1.119E-02 3.342E+03 3.352E+03 
2.024E-03 1.004E+01 1.119E-02 3.879E+03 3.889E+03 
2.140E-03 9.909E+00 1.191E-02 3.388E+03 3.398E+03 
2.263E-03 9.789E+00 1.267E-02 2.960E+03 2.969E+03 
2.263E-03 9.789E+00 1.267E-02 3.146E+03 3.155E+03 
2.375E-03 9.687E+00 1.335E-02 2.816E+03 2.825E+03 
2.491E-03 9.579E+00 1.407E-02 2.522E+03 2.531E+03 
2.491E-03 9.579E+00 1.407E-02 2.631E+03 2.641E+03 
2.500E-03 9.570E+00 1.413E-02 2.609E+03 2.619E+03 
3.000E-03 9.059E+00 1.714E-02 1.701E+03 1.710E+03 
3.500E-03 8.567E+00 2.007E-02 1.171E+03 1.180E+03 
4.000E-03 8.099E+00 2.291E-02 8.477E+02 8.559E+02 
4.500E-03 7.647E+00 2.565E-02 6.322E+02 6.399E+02 
5.000E-03 7.218E+00 2.829E-02 4.863E+02 4.936E+02 
5.500E-03 6.815E+00 3.082E-02 3.820E+02 3.888E+02 
6.000E-03 6.440E+00 3.323E-02 3.064E+02 3.129E+02 
6.500E-03 6.089E+00 3.553E-02 2.494E+02 2.555E+02 
7.000E-03 5.763E+00 3.772E-02 2.061E+02 2.119E+02 
7.500E-03 5.459E+00 3.981E-02 1.725E+02 1.780E+02 
8.000E-03 5.177E+00 4.182E-02 1.461E+02 1.514E+02 
8.500E-03 4.914E+00 4.374E-02 1.248E+02 1.297E+02 
9.000E-03 4.670E+00 4.559E-02 1.075E+02 1.122E+02 
9.244E-03 4.557E+00 4.647E-02 1.003E+02 1.049E+02 
9.244E-03 4.557E+00 4.647E-02 2.657E+02 2.703E+02 
9.500E-03 4.443E+00 4.736E-02 2.476E+02 2.521E+02 
1.000E-02 4.230E+00 4.908E-02 2.168E+02 2.211E+02 
1.035E-02 4.089E+00 5.025E-02 1.978E+02 2.019E+02 
1.035E-02 4.089E+00 5.025E-02 2.716E+02 2.758E+02 
1.050E-02 4.030E+00 5.075E-02 2.622E+02 2.663E+02 
1.087E-02 3.893E+00 5.194E-02 2.410E+02 2.449E+02 
1.087E-02 3.893E+00 5.194E-02 2.786E+02 2.826E+02 
1.100E-02 3.846E+00 5.235E-02 2.702E+02 2.741E+02 
1.150E-02 3.673E+00 5.389E-02 2.411E+02 2.448E+02 
1.200E-02 3.511E+00 5.539E-02 2.161E+02 2.197E+02 
1.250E-02 3.358E+00 5.684E-02 1.946E+02 1.980E+02 
1.300E-02 3.215E+00 5.825E-02 1.760E+02 1.793E+02 
1.350E-02 3.081E+00 5.962E-02 1.597E+02 1.629E+02 
1.400E-02 2.955E+00 6.095E-02 1.455E+02 1.485E+02 
1.450E-02 2.838E+00 6.225E-02 1.330E+02 1.359E+02 
1.500E-02 2.728E+00 6.350E-02 1.219E+02 1.247E+02 
1.550E-02 2.624E+00 6.473E-02 1.117E+02 1.144E+02 
1.600E-02 2.528E+00 6.591E-02 1.027E+02 1.053E+02 
1.650E-02 2.436E+00 6.707E-02 9.465E+01 9.716E+01 
1.700E-02 2.351E+00 6.820E-02 8.745E+01 8.987E+01 
1.750E-02 2.270E+00 6.929E-02 8.098E+01 8.332E+01 
1.800E-02 2.194E+00 7.035E-02 7.515E+01 7.741E+01 
1.850E-02 2.122E+00 7.138E-02 6.988E+01 7.207E+01 
1.900E-02 2.054E+00 7.239E-02 6.511E+01 6.723E+01 
1.950E-02 1.989E+00 7.336E-02 6.077E+01 6.283E+01 
2.000E-02 1.928E+00 7.431E-02 5.683E+01 5.883E+01 
2.050E-02 1.870E+00 7.523E-02 5.316E+01 5.510E+01 
2.100E-02 1.815E+00 7.612E-02 4.981E+01 5.170E+01 
2.150E-02 1.763E+00 7.699E-02 4.674E+01 4.858E+01 
2.200E-02 1.712E+00 7.783E-02 4.393E+01 4.572E+01 
2.250E-02 1.665E+00 7.865E-02 4.134E+01 4.308E+01 
2.300E-02 1.619E+00 7.945E-02 3.896E+01 4.066E+01 
2.350E-02 1.575E+00 8.022E-02 3.676E+01 3.841E+01 
2.400E-02 1.533E+00 8.097E-02 3.473E+01 3.634E+01 
2.450E-02 1.493E+00 8.170E-02 3.285E+01 3.442E+01 
2.500E-02 1.455E+00 8.240E-02 3.110E+01 3.264E+01 
2.550E-02 1.418E+00 8.309E-02 2.948E+01 3.098E+01 
2.600E-02 1.382E+00 8.376E-02 2.797E+01 2.944E+01 
2.650E-02 1.348E+00 8.440E-02 2.657E+01 2.800E+01 
2.700E-02 1.315E+00 8.503E-02 2.526E+01 2.666E+01 
2.750E-02 1.283E+00 8.564E-02 2.404E+01 2.541E+01 
2.800E-02 1.252E+00 8.623E-02 2.290E+01 2.424E+01 
2.850E-02 1.222E+00 8.680E-02 2.183E+01 2.314E+01 
2.900E-02 1.194E+00 8.736E-02 2.083E+01 2.211E+01 
2.950E-02 1.166E+00 8.790E-02 1.989E+01 2.114E+01 
3.000E-02 1.139E+00 8.842E-02 1.901E+01 2.023E+01 
3.050E-02 1.113E+00 8.893E-02 1.816E+01 1.937E+01 
3.100E-02 1.088E+00 8.942E-02 1.737E+01 1.855E+01 
3.150E-02 1.064E+00 8.990E-02 1.662E+01 1.778E+01 
3.200E-02 1.040E+00 9.036E-02 1.592E+01 1.705E+01 