52.389    .50510
51.354    .28650
59.382    .10890
59.157    .05640
61.965    .04310
8.537    .43430
8.313    .32420
10.143    .11310
10.090    .08070
10.460    .02690
8.960    .01250
8.910    .00840
8.402    .81590
9.870    .15550
7.580    .02220
9.491    .00550
9.925    .00090
7.416    .72410
7.367    .08220
8.759    .14770
6.546    .03590
8.456    .00860
8.889    .00150