1.000E-03 1.394E+01 4.519E-03 6.938E+03 6.952E+03 
1.042E-03 1.389E+01 4.776E-03 6.447E+03 6.461E+03 
1.087E-03 1.383E+01 5.045E-03 5.983E+03 5.997E+03 
1.087E-03 1.383E+01 5.045E-03 6.366E+03 6.380E+03 
1.200E-03 1.372E+01 5.686E-03 5.284E+03 5.298E+03 
1.328E-03 1.354E+01 6.450E-03 4.370E+03 4.383E+03 
1.328E-03 1.354E+01 6.450E-03 4.428E+03 4.442E+03 
1.500E-03 1.331E+01 7.469E-03 3.475E+03 3.489E+03 
1.501E-03 1.331E+01 7.472E-03 3.473E+03 3.486E+03 
1.501E-03 1.331E+01 7.472E-03 3.539E+03 3.552E+03 
2.000E-03 1.265E+01 1.038E-02 1.949E+03 1.962E+03 
2.500E-03 1.196E+01 1.334E-02 1.192E+03 1.204E+03 
3.000E-03 1.134E+01 1.603E-02 7.977E+02 8.091E+02 
3.500E-03 1.072E+01 1.870E-02 5.606E+02 5.714E+02 
3.666E-03 1.053E+01 1.957E-02 5.043E+02 5.148E+02 
3.666E-03 1.053E+01 1.957E-02 1.205E+03 1.216E+03 
3.757E-03 1.042E+01 2.004E-02 1.134E+03 1.144E+03 
3.850E-03 1.031E+01 2.051E-02 1.067E+03 1.077E+03 
3.850E-03 1.031E+01 2.051E-02 1.512E+03 1.522E+03 
4.000E-03 1.014E+01 2.126E-02 1.380E+03 1.390E+03 
4.435E-03 9.666E+00 2.340E-02 1.070E+03 1.079E+03 
4.435E-03 9.666E+00 2.340E-02 1.246E+03 1.256E+03 
4.500E-03 9.598E+00 2.371E-02 1.202E+03 1.211E+03 
5.000E-03 9.092E+00 2.601E-02 9.232E+02 9.323E+02 
5.366E-03 8.744E+00 2.764E-02 7.708E+02 7.796E+02 
5.366E-03 8.744E+00 2.764E-02 8.180E+02 8.268E+02 
5.500E-03 8.623E+00 2.821E-02 7.696E+02 7.782E+02 
5.723E-03 8.427E+00 2.914E-02 6.974E+02 7.058E+02 
5.723E-03 8.427E+00 2.914E-02 7.271E+02 7.355E+02 
6.000E-03 8.190E+00 3.028E-02 6.486E+02 6.568E+02 
6.500E-03 7.789E+00 3.228E-02 5.319E+02 5.398E+02 
7.000E-03 7.417E+00 3.418E-02 4.427E+02 4.502E+02 
7.500E-03 7.071E+00 3.601E-02 3.732E+02 3.803E+02 
8.000E-03 6.747E+00 3.778E-02 3.181E+02 3.249E+02 
8.500E-03 6.445E+00 3.950E-02 2.732E+02 2.797E+02 
9.000E-03 6.162E+00 4.117E-02 2.367E+02 2.429E+02 
9.500E-03 5.898E+00 4.280E-02 2.067E+02 2.126E+02 
1.000E-02 5.650E+00 4.438E-02 1.817E+02 1.874E+02 
1.050E-02 5.418E+00 4.592E-02 1.604E+02 1.659E+02 
1.100E-02 5.200E+00 4.741E-02 1.425E+02 1.477E+02 
1.150E-02 4.995E+00 4.885E-02 1.272E+02 1.322E+02 
1.200E-02 4.802E+00 5.025E-02 1.140E+02 1.189E+02 
1.250E-02 4.620E+00 5.160E-02 1.027E+02 1.074E+02 
1.300E-02 4.448E+00 5.290E-02 9.295E+01 9.745E+01 
1.350E-02 4.285E+00 5.416E-02 8.440E+01 8.874E+01 
1.400E-02 4.130E+00 5.538E-02 7.691E+01 8.110E+01 
1.450E-02 3.983E+00 5.654E-02 7.031E+01 7.435E+01 
1.500E-02 3.844E+00 5.767E-02 6.448E+01 6.838E+01 
1.550E-02 3.711E+00 5.875E-02 5.923E+01 6.300E+01 
1.600E-02 3.585E+00 5.979E-02 5.456E+01 5.821E+01 
1.650E-02 3.465E+00 6.080E-02 5.039E+01 5.391E+01 
1.700E-02 3.351E+00 6.177E-02 4.664E+01 5.006E+01 
1.750E-02 3.242E+00 6.272E-02 4.327E+01 4.658E+01 
1.761E-02 3.219E+00 6.293E-02 4.258E+01 4.586E+01 
1.761E-02 3.219E+00 6.293E-02 1.014E+02 1.046E+02 
1.800E-02 3.139E+00 6.364E-02 9.548E+01 9.868E+01 
1.850E-02 3.040E+00 6.454E-02 8.860E+01 9.171E+01 
1.900E-02 2.947E+00 6.541E-02 8.238E+01 8.539E+01 
1.950E-02 2.857E+00 6.625E-02 7.674E+01 7.966E+01 
2.000E-02 2.772E+00 6.707E-02 7.162E+01 7.445E+01 
2.050E-02 2.690E+00 6.785E-02 6.701E+01 6.977E+01 
2.100E-02 2.612E+00 6.861E-02 6.281E+01 6.549E+01 
2.150E-02 2.537E+00 6.936E-02 5.896E+01 6.157E+01 
2.160E-02 2.522E+00 6.951E-02 5.823E+01 6.082E+01 
2.160E-02 2.522E+00 6.951E-02 8.295E+01 8.554E+01 
2.200E-02 2.466E+00 7.009E-02 7.905E+01 8.159E+01 
2.243E-02 2.407E+00 7.070E-02 7.515E+01 7.762E+01 
2.243E-02 2.407E+00 7.070E-02 8.671E+01 8.918E+01 
2.250E-02 2.397E+00 7.080E-02 8.599E+01 8.846E+01 
2.300E-02 2.331E+00 7.149E-02 8.133E+01 8.373E+01 
2.350E-02 2.267E+00 7.216E-02 7.701E+01 7.935E+01 
2.400E-02 2.206E+00 7.281E-02 7.300E+01 7.528E+01 
2.450E-02 2.148E+00 7.343E-02 6.928E+01 7.150E+01 
2.500E-02 2.091E+00 7.404E-02 6.582E+01 6.798E+01 
2.550E-02 2.037E+00 7.463E-02 6.259E+01 6.470E+01 
2.600E-02 1.985E+00 7.520E-02 5.958E+01 6.164E+01 
2.650E-02 1.934E+00 7.576E-02 5.677E+01 5.878E+01 
2.700E-02 1.886E+00 7.630E-02 5.414E+01 5.610E+01 
2.750E-02 1.840E+00 7.683E-02 5.167E+01 5.359E+01 
2.800E-02 1.796E+00 7.734E-02 4.936E+01 5.124E+01 
2.850E-02 1.753E+00 7.785E-02 4.720E+01 4.903E+01 
2.900E-02 1.712E+00 7.834E-02 4.516E+01 4.695E+01 
2.950E-02 1.672E+00 7.882E-02 4.324E+01 4.499E+01 
3.000E-02 1.635E+00 7.929E-02 4.144E+01 4.315E+01 
3.050E-02 1.598E+00 7.975E-02 3.969E+01 4.137E+01 
3.100E-02 1.563E+00 8.020E-02 3.804E+01 3.969E+01 
3.150E-02 1.529E+00 8.064E-02 3.649E+01 3.810E+01 
3.200E-02 1.497E+00 8.107E-02 3.503E+01 3.660E+01 