1.000E-03 8.418E+00 4.688E-03 9.087E+03 9.096E+03 
1.035E-03 8.388E+00 4.969E-03 8.457E+03 8.465E+03 
1.072E-03 8.357E+00 5.272E-03 7.858E+03 7.867E+03 
1.072E-03 8.357E+00 5.272E-03 8.195E+03 8.204E+03 
1.200E-03 8.244E+00 6.346E-03 6.394E+03 6.402E+03 
1.500E-03 7.958E+00 8.969E-03 3.911E+03 3.919E+03 
2.000E-03 7.446E+00 1.342E-02 1.989E+03 1.997E+03 
2.500E-03 6.939E+00 1.777E-02 1.151E+03 1.157E+03 
3.000E-03 6.463E+00 2.190E-02 7.355E+02 7.420E+02 
3.500E-03 6.026E+00 2.575E-02 4.979E+02 5.040E+02 
4.000E-03 5.628E+00 2.932E-02 3.551E+02 3.608E+02 
4.500E-03 5.268E+00 3.260E-02 2.623E+02 2.676E+02 
4.557E-03 5.229E+00 3.296E-02 2.539E+02 2.591E+02 
4.557E-03 5.229E+00 3.296E-02 7.498E+02 7.550E+02 
4.702E-03 5.133E+00 3.387E-02 7.027E+02 7.079E+02 
4.852E-03 5.035E+00 3.479E-02 6.587E+02 6.637E+02 
4.852E-03 5.035E+00 3.479E-02 8.883E+02 8.934E+02 
5.000E-03 4.940E+00 3.568E-02 8.380E+02 8.430E+02 
5.188E-03 4.821E+00 3.679E-02 7.616E+02 7.665E+02 
5.188E-03 4.821E+00 3.679E-02 8.788E+02 8.837E+02 
5.500E-03 4.634E+00 3.857E-02 7.605E+02 7.652E+02 
6.000E-03 4.356E+00 4.129E-02 6.131E+02 6.175E+02 
6.500E-03 4.100E+00 4.388E-02 4.972E+02 5.013E+02 
7.000E-03 3.863E+00 4.636E-02 4.095E+02 4.134E+02 
7.500E-03 3.646E+00 4.875E-02 3.418E+02 3.455E+02 
8.000E-03 3.446E+00 5.106E-02 2.886E+02 2.921E+02 
8.500E-03 3.263E+00 5.330E-02 2.458E+02 2.491E+02 
9.000E-03 3.094E+00 5.546E-02 2.112E+02 2.144E+02 
9.500E-03 2.940E+00 5.754E-02 1.830E+02 1.860E+02 
1.000E-02 2.798E+00 5.955E-02 1.597E+02 1.626E+02 
1.050E-02 2.668E+00 6.149E-02 1.399E+02 1.427E+02 
1.100E-02 2.549E+00 6.335E-02 1.234E+02 1.260E+02 
1.150E-02 2.438E+00 6.514E-02 1.093E+02 1.118E+02 
1.200E-02 2.335E+00 6.686E-02 9.743E+01 9.983E+01 
1.250E-02 2.239E+00 6.851E-02 8.722E+01 8.952E+01 
1.300E-02 2.149E+00 7.009E-02 7.842E+01 8.064E+01 
1.350E-02 2.066E+00 7.160E-02 7.079E+01 7.293E+01 
1.400E-02 1.987E+00 7.306E-02 6.414E+01 6.620E+01 
1.450E-02 1.913E+00 7.445E-02 5.832E+01 6.031E+01 
1.500E-02 1.843E+00 7.578E-02 5.320E+01 5.511E+01 
1.550E-02 1.777E+00 7.706E-02 4.859E+01 5.045E+01 
1.600E-02 1.715E+00 7.828E-02 4.451E+01 4.631E+01 
1.650E-02 1.656E+00 7.945E-02 4.089E+01 4.262E+01 
1.700E-02 1.600E+00 8.058E-02 3.765E+01 3.933E+01 
1.750E-02 1.546E+00 8.166E-02 3.475E+01 3.638E+01 
1.800E-02 1.495E+00 8.269E-02 3.215E+01 3.373E+01 
1.850E-02 1.446E+00 8.369E-02 2.981E+01 3.134E+01 
1.900E-02 1.400E+00 8.465E-02 2.769E+01 2.918E+01 
1.950E-02 1.355E+00 8.557E-02 2.578E+01 2.722E+01 
2.000E-02 1.312E+00 8.646E-02 2.404E+01 2.543E+01 
2.050E-02 1.271E+00 8.732E-02 2.243E+01 2.379E+01 
2.100E-02 1.232E+00 8.815E-02 2.096E+01 2.228E+01 
2.150E-02 1.194E+00 8.895E-02 1.963E+01 2.091E+01 
2.200E-02 1.158E+00 8.972E-02 1.840E+01 1.965E+01 
2.250E-02 1.123E+00 9.046E-02 1.728E+01 1.849E+01 
2.300E-02 1.090E+00 9.118E-02 1.625E+01 1.743E+01 
2.350E-02 1.058E+00 9.188E-02 1.530E+01 1.645E+01 
2.400E-02 1.027E+00 9.255E-02 1.442E+01 1.554E+01 
2.450E-02 9.982E-01 9.320E-02 1.361E+01 1.470E+01 
2.500E-02 9.702E-01 9.382E-02 1.286E+01 1.393E+01 
2.550E-02 9.433E-01 9.443E-02 1.217E+01 1.320E+01 
2.600E-02 9.175E-01 9.502E-02 1.152E+01 1.254E+01 
2.650E-02 8.928E-01 9.558E-02 1.092E+01 1.191E+01 
2.700E-02 8.691E-01 9.613E-02 1.037E+01 1.133E+01 
2.750E-02 8.463E-01 9.667E-02 9.847E+00 1.079E+01 
2.800E-02 8.245E-01 9.718E-02 9.362E+00 1.028E+01 
2.850E-02 8.035E-01 9.768E-02 8.909E+00 9.810E+00 
2.900E-02 7.834E-01 9.816E-02 8.485E+00 9.367E+00 
2.950E-02 7.641E-01 9.863E-02 8.088E+00 8.951E+00 
3.000E-02 7.455E-01 9.908E-02 7.716E+00 8.561E+00 
3.050E-02 7.276E-01 9.952E-02 7.364E+00 8.191E+00 
3.100E-02 7.105E-01 9.995E-02 7.033E+00 7.843E+00 
3.150E-02 6.939E-01 1.004E-01 6.722E+00 7.516E+00 
3.200E-02 6.780E-01 1.008E-01 6.429E+00 7.208E+00 