1.000E-03 1.327E+01 4.807E-03 6.600E+03 6.613E+03 
1.081E-03 1.317E+01 5.322E-03 5.723E+03 5.736E+03 
1.168E-03 1.306E+01 5.871E-03 4.965E+03 4.978E+03 
1.168E-03 1.306E+01 5.871E-03 5.035E+03 5.048E+03 
1.200E-03 1.302E+01 6.064E-03 4.782E+03 4.795E+03 
1.329E-03 1.286E+01 6.841E-03 3.927E+03 3.940E+03 
1.329E-03 1.286E+01 6.841E-03 4.005E+03 4.017E+03 
1.500E-03 1.263E+01 7.885E-03 3.148E+03 3.161E+03 
2.000E-03 1.196E+01 1.086E-02 1.730E+03 1.741E+03 
2.500E-03 1.132E+01 1.375E-02 1.057E+03 1.069E+03 
3.000E-03 1.071E+01 1.656E-02 7.072E+02 7.179E+02 
3.332E-03 1.032E+01 1.837E-02 5.567E+02 5.670E+02 
3.332E-03 1.032E+01 1.837E-02 1.383E+03 1.394E+03 
3.410E-03 1.023E+01 1.880E-02 1.297E+03 1.307E+03 
3.491E-03 1.014E+01 1.922E-02 1.215E+03 1.226E+03 
3.491E-03 1.014E+01 1.922E-02 1.739E+03 1.749E+03 
3.500E-03 1.013E+01 1.927E-02 1.728E+03 1.738E+03 
4.000E-03 9.590E+00 2.186E-02 1.243E+03 1.253E+03 
4.046E-03 9.543E+00 2.209E-02 1.208E+03 1.217E+03 
4.046E-03 9.543E+00 2.209E-02 1.405E+03 1.415E+03 
4.500E-03 9.090E+00 2.431E-02 1.077E+03 1.086E+03 
4.830E-03 8.777E+00 2.587E-02 9.016E+02 9.104E+02 
4.830E-03 8.777E+00 2.587E-02 9.566E+02 9.654E+02 
5.000E-03 8.624E+00 2.665E-02 8.790E+02 8.877E+02 
5.182E-03 8.461E+00 2.746E-02 8.045E+02 8.130E+02 
5.182E-03 8.461E+00 2.746E-02 8.393E+02 8.478E+02 
5.500E-03 8.188E+00 2.882E-02 7.258E+02 7.340E+02 
6.000E-03 7.789E+00 3.088E-02 5.868E+02 5.946E+02 
6.500E-03 7.414E+00 3.285E-02 4.811E+02 4.885E+02 
7.000E-03 7.063E+00 3.474E-02 4.002E+02 4.073E+02 
7.500E-03 6.734E+00 3.655E-02 3.372E+02 3.440E+02 
8.000E-03 6.426E+00 3.831E-02 2.873E+02 2.938E+02 
8.500E-03 6.138E+00 4.001E-02 2.465E+02 2.527E+02 
9.000E-03 5.868E+00 4.166E-02 2.134E+02 2.193E+02 
9.500E-03 5.615E+00 4.327E-02 1.861E+02 1.918E+02 
1.000E-02 5.378E+00 4.482E-02 1.635E+02 1.689E+02 
1.050E-02 5.154E+00 4.633E-02 1.443E+02 1.495E+02 
1.100E-02 4.944E+00 4.779E-02 1.280E+02 1.330E+02 
1.150E-02 4.747E+00 4.920E-02 1.142E+02 1.190E+02 
1.200E-02 4.560E+00 5.057E-02 1.024E+02 1.070E+02 
1.250E-02 4.384E+00 5.189E-02 9.219E+01 9.662E+01 
1.300E-02 4.218E+00 5.317E-02 8.335E+01 8.762E+01 
1.350E-02 4.061E+00 5.440E-02 7.565E+01 7.977E+01 
1.400E-02 3.913E+00 5.558E-02 6.891E+01 7.288E+01 
1.450E-02 3.772E+00 5.673E-02 6.297E+01 6.680E+01 
1.500E-02 3.639E+00 5.782E-02 5.772E+01 6.142E+01 
1.550E-02 3.512E+00 5.888E-02 5.302E+01 5.659E+01 
1.600E-02 3.392E+00 5.990E-02 4.883E+01 5.228E+01 
1.630E-02 3.322E+00 6.050E-02 4.653E+01 4.992E+01 
1.630E-02 3.322E+00 6.050E-02 1.122E+02 1.156E+02 
1.650E-02 3.277E+00 6.089E-02 1.086E+02 1.119E+02 
1.700E-02 3.167E+00 6.184E-02 1.001E+02 1.033E+02 
1.750E-02 3.063E+00 6.277E-02 9.252E+01 9.565E+01 
1.800E-02 2.964E+00 6.366E-02 8.570E+01 8.872E+01 
1.850E-02 2.869E+00 6.452E-02 7.954E+01 8.248E+01 
1.900E-02 2.780E+00 6.535E-02 7.398E+01 7.683E+01 
1.950E-02 2.695E+00 6.614E-02 6.894E+01 7.170E+01 
1.969E-02 2.663E+00 6.644E-02 6.712E+01 6.984E+01 
1.969E-02 2.663E+00 6.644E-02 9.598E+01 9.870E+01 
2.000E-02 2.613E+00 6.691E-02 9.099E+01 9.367E+01 
2.047E-02 2.539E+00 6.763E-02 8.591E+01 8.851E+01 
2.047E-02 2.539E+00 6.763E-02 9.919E+01 1.018E+02 
2.050E-02 2.535E+00 6.768E-02 9.885E+01 1.014E+02 
2.100E-02 2.459E+00 6.843E-02 9.293E+01 9.546E+01 
2.150E-02 2.387E+00 6.916E-02 8.750E+01 8.996E+01 
2.200E-02 2.318E+00 6.988E-02 8.250E+01 8.489E+01 
2.250E-02 2.252E+00 7.057E-02 7.789E+01 8.021E+01 
2.300E-02 2.189E+00 7.124E-02 7.363E+01 7.589E+01 
2.350E-02 2.129E+00 7.190E-02 6.968E+01 7.188E+01 
2.400E-02 2.071E+00 7.254E-02 6.603E+01 6.817E+01 
2.450E-02 2.016E+00 7.316E-02 6.263E+01 6.472E+01 
2.500E-02 1.963E+00 7.376E-02 5.948E+01 6.151E+01 
2.550E-02 1.913E+00 7.435E-02 5.654E+01 5.852E+01 
2.600E-02 1.864E+00 7.493E-02 5.379E+01 5.573E+01 
2.650E-02 1.817E+00 7.549E-02 5.123E+01 5.313E+01 
2.700E-02 1.773E+00 7.603E-02 4.884E+01 5.069E+01 
2.750E-02 1.730E+00 7.657E-02 4.660E+01 4.841E+01 
2.800E-02 1.688E+00 7.709E-02 4.450E+01 4.626E+01 
2.850E-02 1.649E+00 7.760E-02 4.253E+01 4.425E+01 
2.900E-02 1.611E+00 7.809E-02 4.068E+01 4.236E+01 
2.950E-02 1.574E+00 7.858E-02 3.893E+01 4.059E+01 
3.000E-02 1.539E+00 7.905E-02 3.729E+01 3.891E+01 
3.050E-02 1.505E+00 7.952E-02 3.571E+01 3.730E+01 
3.100E-02 1.472E+00 7.997E-02 3.422E+01 3.577E+01 
3.150E-02 1.440E+00 8.041E-02 3.281E+01 3.433E+01 
3.200E-02 1.410E+00 8.085E-02 3.148E+01 3.297E+01 