1.000E-03 1.282E+01 3.190E-03 5.813E+03 5.826E+03 
1.047E-03 1.278E+01 3.447E-03 5.341E+03 5.353E+03 
1.097E-03 1.272E+01 3.727E-03 4.901E+03 4.914E+03 
1.097E-03 1.272E+01 3.727E-03 5.004E+03 5.017E+03 
1.200E-03 1.262E+01 4.319E-03 4.195E+03 4.208E+03 
1.500E-03 1.228E+01 6.114E-03 2.706E+03 2.719E+03 
2.000E-03 1.166E+01 9.193E-03 1.478E+03 1.490E+03 
2.500E-03 1.103E+01 1.226E-02 9.018E+02 9.128E+02 
2.892E-03 1.055E+01 1.460E-02 6.529E+02 6.634E+02 
2.892E-03 1.055E+01 1.460E-02 2.309E+03 2.320E+03 
3.000E-03 1.042E+01 1.523E-02 1.543E+03 1.554E+03 
3.021E-03 1.039E+01 1.535E-02 1.514E+03 1.524E+03 
3.021E-03 1.039E+01 1.535E-02 2.459E+03 2.470E+03 
3.500E-03 9.845E+00 1.803E-02 1.522E+03 1.532E+03 
3.538E-03 9.803E+00 1.824E-02 1.469E+03 1.479E+03 
3.538E-03 9.803E+00 1.824E-02 1.700E+03 1.710E+03 
4.000E-03 9.309E+00 2.066E-02 1.257E+03 1.266E+03 
4.159E-03 9.146E+00 2.146E-02 1.139E+03 1.148E+03 
4.159E-03 9.146E+00 2.146E-02 1.208E+03 1.217E+03 
4.317E-03 8.990E+00 2.223E-02 1.104E+03 1.113E+03 
4.482E-03 8.832E+00 2.301E-02 1.008E+03 1.017E+03 
4.482E-03 8.832E+00 2.301E-02 1.052E+03 1.061E+03 
4.500E-03 8.815E+00 2.310E-02 1.042E+03 1.051E+03 
5.000E-03 8.352E+00 2.541E-02 8.080E+02 8.164E+02 
5.500E-03 7.922E+00 2.760E-02 6.395E+02 6.474E+02 
6.000E-03 7.522E+00 2.970E-02 5.165E+02 5.240E+02 
6.500E-03 7.147E+00 3.173E-02 4.227E+02 4.299E+02 
7.000E-03 6.797E+00 3.371E-02 3.512E+02 3.580E+02 
7.500E-03 6.470E+00 3.562E-02 2.955E+02 3.020E+02 
8.000E-03 6.165E+00 3.749E-02 2.514E+02 2.576E+02 
8.500E-03 5.881E+00 3.929E-02 2.155E+02 2.214E+02 
9.000E-03 5.616E+00 4.105E-02 1.863E+02 1.920E+02 
9.500E-03 5.367E+00 4.274E-02 1.624E+02 1.678E+02 
1.000E-02 5.135E+00 4.438E-02 1.425E+02 1.477E+02 
1.050E-02 4.916E+00 4.595E-02 1.256E+02 1.306E+02 
1.100E-02 4.712E+00 4.747E-02 1.114E+02 1.161E+02 
1.150E-02 4.519E+00 4.893E-02 9.928E+01 1.038E+02 
1.200E-02 4.338E+00 5.034E-02 8.893E+01 9.332E+01 
1.250E-02 4.167E+00 5.170E-02 8.002E+01 8.424E+01 
1.300E-02 4.006E+00 5.300E-02 7.231E+01 7.637E+01 
1.350E-02 3.854E+00 5.425E-02 6.558E+01 6.949E+01 
1.400E-02 3.710E+00 5.546E-02 5.970E+01 6.346E+01 
1.450E-02 3.574E+00 5.661E-02 5.452E+01 5.815E+01 
1.462E-02 3.542E+00 5.688E-02 5.338E+01 5.698E+01 
1.462E-02 3.542E+00 5.688E-02 1.308E+02 1.344E+02 
1.500E-02 3.445E+00 5.772E-02 1.224E+02 1.259E+02 
1.550E-02 3.321E+00 5.879E-02 1.119E+02 1.153E+02 
1.600E-02 3.202E+00 5.982E-02 1.027E+02 1.060E+02 
1.650E-02 3.089E+00 6.081E-02 9.447E+01 9.762E+01 
1.700E-02 2.982E+00 6.178E-02 8.711E+01 9.016E+01 
1.734E-02 2.913E+00 6.241E-02 8.259E+01 8.557E+01 
1.734E-02 2.913E+00 6.241E-02 1.155E+02 1.185E+02 
1.750E-02 2.881E+00 6.272E-02 1.129E+02 1.159E+02 
1.800E-02 2.787E+00 6.363E-02 1.055E+02 1.084E+02 
1.805E-02 2.778E+00 6.372E-02 1.048E+02 1.077E+02 
1.805E-02 2.778E+00 6.372E-02 1.212E+02 1.241E+02 
1.850E-02 2.697E+00 6.451E-02 1.138E+02 1.165E+02 
1.900E-02 2.611E+00 6.537E-02 1.062E+02 1.089E+02 
1.950E-02 2.530E+00 6.621E-02 9.938E+01 1.020E+02 
2.000E-02 2.452E+00 6.702E-02 9.312E+01 9.564E+01 
2.050E-02 2.378E+00 6.782E-02 8.734E+01 8.979E+01 
2.100E-02 2.307E+00 6.859E-02 8.206E+01 8.443E+01 
2.150E-02 2.239E+00 6.934E-02 7.720E+01 7.951E+01 
2.200E-02 2.174E+00 7.008E-02 7.273E+01 7.498E+01 
2.250E-02 2.112E+00 7.079E-02 6.862E+01 7.080E+01 
2.300E-02 2.053E+00 7.149E-02 6.482E+01 6.694E+01 
2.350E-02 1.997E+00 7.217E-02 6.130E+01 6.337E+01 
2.400E-02 1.943E+00 7.283E-02 5.805E+01 6.006E+01 
2.450E-02 1.891E+00 7.347E-02 5.502E+01 5.699E+01 
2.500E-02 1.841E+00 7.410E-02 5.222E+01 5.413E+01 
2.550E-02 1.793E+00 7.472E-02 4.960E+01 5.147E+01 
2.600E-02 1.748E+00 7.532E-02 4.717E+01 4.899E+01 
2.650E-02 1.704E+00 7.590E-02 4.490E+01 4.668E+01 
2.700E-02 1.662E+00 7.647E-02 4.277E+01 4.451E+01 
2.750E-02 1.622E+00 7.703E-02 4.079E+01 4.248E+01 
2.800E-02 1.583E+00 7.757E-02 3.892E+01 4.058E+01 
2.850E-02 1.546E+00 7.810E-02 3.718E+01 3.880E+01 
2.900E-02 1.510E+00 7.861E-02 3.554E+01 3.713E+01 
2.950E-02 1.475E+00 7.912E-02 3.400E+01 3.555E+01 
3.000E-02 1.442E+00 7.961E-02 3.255E+01 3.407E+01 
3.050E-02 1.410E+00 8.009E-02 3.115E+01 3.264E+01 
3.100E-02 1.380E+00 8.056E-02 2.984E+01 3.130E+01 
3.150E-02 1.350E+00 8.102E-02 2.860E+01 3.003E+01 
3.200E-02 1.321E+00 8.146E-02 2.743E+01 2.883E+01 