70.819    .49180
68.893    .29010
80.255    .11120
79.822    .05750
82.492    .04940
11.995    .39020
11.563    .34330
14.265    .11100
14.162    .08910
14.768    .03690
12.560    .01780
12.446    .01190
11.823    .78640
13.830    .16540
10.651    .02160
13.410    .00560
14.199    .01910
14.090    .00110
11.358    .00080
9.989    .69810
9.898    .07940
11.924    .13840
11.904    .01540
8.721    .03980
11.842    .00980
12.163    .00200
12.277    .01720