1.000E-03 9.691E+00 6.225E-03 2.047E+03 2.056E+03 
1.013E-03 9.679E+00 6.329E-03 1.998E+03 2.008E+03 
1.027E-03 9.666E+00 6.441E-03 1.949E+03 1.959E+03 
1.027E-03 9.666E+00 6.441E-03 2.544E+03 2.554E+03 
1.039E-03 9.654E+00 6.540E-03 3.848E+03 3.857E+03 
1.051E-03 9.641E+00 6.641E-03 5.793E+03 5.803E+03 
1.051E-03 9.641E+00 6.641E-03 7.194E+03 7.203E+03 
1.200E-03 9.491E+00 7.804E-03 6.365E+03 6.374E+03 
1.357E-03 9.334E+00 9.005E-03 5.681E+03 5.690E+03 
1.357E-03 9.334E+00 9.005E-03 6.545E+03 6.555E+03 
1.413E-03 9.277E+00 9.441E-03 5.977E+03 5.986E+03 
1.471E-03 9.213E+00 9.895E-03 5.456E+03 5.466E+03 
1.471E-03 9.213E+00 9.895E-03 5.789E+03 5.798E+03 
1.500E-03 9.180E+00 1.011E-02 5.544E+03 5.553E+03 
1.653E-03 9.018E+00 1.129E-02 4.488E+03 4.497E+03 
1.653E-03 9.018E+00 1.129E-02 4.692E+03 4.701E+03 
2.000E-03 8.660E+00 1.392E-02 3.039E+03 3.048E+03 
2.500E-03 8.145E+00 1.766E-02 1.784E+03 1.792E+03 
3.000E-03 7.642E+00 2.130E-02 1.154E+03 1.162E+03 
3.500E-03 7.160E+00 2.479E-02 7.866E+02 7.938E+02 
4.000E-03 6.707E+00 2.812E-02 5.643E+02 5.711E+02 
4.500E-03 6.287E+00 3.130E-02 4.184E+02 4.247E+02 
5.000E-03 5.901E+00 3.431E-02 3.201E+02 3.260E+02 
5.500E-03 5.549E+00 3.715E-02 2.504E+02 2.559E+02 
6.000E-03 5.224E+00 3.982E-02 2.001E+02 2.053E+02 
6.459E-03 4.945E+00 4.214E-02 1.651E+02 1.701E+02 
6.459E-03 4.945E+00 4.214E-02 4.629E+02 4.679E+02 
6.500E-03 4.922E+00 4.234E-02 4.556E+02 4.606E+02 
7.000E-03 4.649E+00 4.474E-02 3.775E+02 3.822E+02 
7.013E-03 4.642E+00 4.480E-02 3.758E+02 3.805E+02 
7.013E-03 4.642E+00 4.480E-02 5.128E+02 5.175E+02 
7.217E-03 4.538E+00 4.573E-02 4.776E+02 4.822E+02 
7.428E-03 4.434E+00 4.667E-02 4.451E+02 4.496E+02 
7.428E-03 4.434E+00 4.667E-02 5.141E+02 5.185E+02 
7.500E-03 4.399E+00 4.699E-02 5.018E+02 5.063E+02 
8.000E-03 4.164E+00 4.916E-02 4.272E+02 4.314E+02 
8.500E-03 3.947E+00 5.125E-02 3.655E+02 3.695E+02 
9.000E-03 3.747E+00 5.324E-02 3.155E+02 3.193E+02 
9.500E-03 3.562E+00 5.516E-02 2.745E+02 2.781E+02 
1.000E-02 3.391E+00 5.702E-02 2.406E+02 2.440E+02 
1.050E-02 3.231E+00 5.881E-02 2.113E+02 2.146E+02 
1.100E-02 3.083E+00 6.054E-02 1.867E+02 1.898E+02 
1.150E-02 2.944E+00 6.223E-02 1.659E+02 1.689E+02 
1.200E-02 2.816E+00 6.385E-02 1.481E+02 1.510E+02 
1.250E-02 2.696E+00 6.542E-02 1.329E+02 1.357E+02 
1.300E-02 2.585E+00 6.695E-02 1.197E+02 1.224E+02 
1.350E-02 2.481E+00 6.842E-02 1.083E+02 1.108E+02 
1.400E-02 2.384E+00 6.985E-02 9.831E+01 1.008E+02 
1.450E-02 2.293E+00 7.122E-02 8.955E+01 9.191E+01 
1.500E-02 2.208E+00 7.256E-02 8.183E+01 8.411E+01 
1.550E-02 2.129E+00 7.385E-02 7.486E+01 7.706E+01 
1.600E-02 2.054E+00 7.510E-02 6.868E+01 7.081E+01 
1.650E-02 1.984E+00 7.630E-02 6.318E+01 6.524E+01 
1.700E-02 1.918E+00 7.746E-02 5.827E+01 6.026E+01 
1.750E-02 1.855E+00 7.859E-02 5.386E+01 5.579E+01 
1.800E-02 1.795E+00 7.968E-02 4.990E+01 5.177E+01 
1.850E-02 1.739E+00 8.072E-02 4.632E+01 4.814E+01 
1.900E-02 1.685E+00 8.174E-02 4.309E+01 4.486E+01 
1.950E-02 1.633E+00 8.271E-02 4.016E+01 4.187E+01 
2.000E-02 1.584E+00 8.365E-02 3.749E+01 3.916E+01 
2.050E-02 1.537E+00 8.456E-02 3.502E+01 3.664E+01 
2.100E-02 1.492E+00 8.544E-02 3.277E+01 3.435E+01 
2.150E-02 1.449E+00 8.628E-02 3.071E+01 3.224E+01 
2.200E-02 1.408E+00 8.710E-02 2.882E+01 3.031E+01 
2.250E-02 1.368E+00 8.788E-02 2.709E+01 2.854E+01 
2.300E-02 1.330E+00 8.864E-02 2.549E+01 2.691E+01 
2.350E-02 1.293E+00 8.938E-02 2.402E+01 2.541E+01 
2.400E-02 1.258E+00 9.008E-02 2.267E+01 2.401E+01 
2.450E-02 1.224E+00 9.077E-02 2.141E+01 2.273E+01 
2.500E-02 1.192E+00 9.143E-02 2.025E+01 2.153E+01 
2.550E-02 1.161E+00 9.207E-02 1.917E+01 2.043E+01 
2.600E-02 1.131E+00 9.269E-02 1.817E+01 1.940E+01 
2.650E-02 1.102E+00 9.328E-02 1.724E+01 1.844E+01 
2.700E-02 1.074E+00 9.386E-02 1.638E+01 1.754E+01 
2.750E-02 1.047E+00 9.442E-02 1.557E+01 1.671E+01 
2.800E-02 1.021E+00 9.496E-02 1.481E+01 1.593E+01 
2.850E-02 9.956E-01 9.548E-02 1.410E+01 1.520E+01 
2.900E-02 9.714E-01 9.599E-02 1.344E+01 1.451E+01 
2.950E-02 9.481E-01 9.648E-02 1.282E+01 1.387E+01 
3.000E-02 9.255E-01 9.695E-02 1.224E+01 1.327E+01 
3.050E-02 9.037E-01 9.741E-02 1.169E+01 1.269E+01 
3.100E-02 8.826E-01 9.786E-02 1.117E+01 1.215E+01 
3.150E-02 8.622E-01 9.829E-02 1.068E+01 1.164E+01 
3.200E-02 8.425E-01 9.870E-02 1.022E+01 1.116E+01 