Punto p1, p2, p3, p4

Rectangulo rect, cuad

p1 = new Punto()
p4 = new Punto(1,2)
p3 = new Punto(2,0)
p4 = new Punto(1,5)

rect = new Rectangulo(p1,p2,p3,p4)
cuad = new Rectangulo(p1,1,1)

print(area())
