Handle,Title,Body (HTML),Vendor,Type,Tags,Published,Option1 Name,Option1 Value,Option2 Name,Option2 Value,Option3 Name,Option3 Value,Variant SKU,Variant Grams,Variant Inventory Tracker,Variant Inventory Qty,Variant Inventory Policy,Variant Fulfillment Service,Variant Price,Variant Compare At Price,Variant Requires Shipping,Variant Taxable,Variant Barcode,Image Src,Image Position,Image Alt Text,Gift Card,SEO Title,SEO Description,Google Shopping / Google Product Category,Google Shopping / Gender,Google Shopping / Age Group,Google Shopping / MPN,Google Shopping / AdWords Grouping,Google Shopping / AdWords Labels,Google Shopping / Condition,Google Shopping / Custom Product,Google Shopping / Custom Label 0,Google Shopping / Custom Label 1,Google Shopping / Custom Label 2,Google Shopping / Custom Label 3,Google Shopping / Custom Label 4,Variant Image,Variant Weight Unit,Variant Tax Code
azalea-del-diavolo-arancio-tardivo-pianta-in-vaso,Azalea del diavolo 'Arancio tardivo' - Pianta in vaso,"Pianta in vaso di diametro 18cm, altezza totale del prodotto (pianta e vaso) alla consegna 30-40cm. La spedizione avviene in imballaggio protettivo specifico per piante. Acidofila sempreverde con fioritura primaverile di un intenso color salmone. ",Vivai Gigli,Pianta in vaso,"Piante, Acidofile, yg_data:cultivar:azalea-del-diavolo-arancio-tardivo",TRUE,Diametro del vaso,18,,,,,,2000,shopify,1000,deny,Vivai Gigli,15,,TRUE,TRUE,,https://www.vivaigigli.it/wp-content/uploads/2018/10/Azalea_del_Diavolo_ArancioTardivo.jpg,1,,FALSE,,,,,,,,,,,,,,,,,kg,
azalea-del-diavolo-bella-di-anna-pianta-in-vaso,Azalea del diavolo 'Bella di Anna' - Pianta in vaso,"Pianta in vaso di diametro 18cm, altezza totale del prodotto (pianta e vaso) alla consegna 30-40cm. La spedizione avviene in imballaggio protettivo specifico per piante. Acidofila sempreverde con fioritura primaverile di un intenso color rosa e dai petali molto numerosi.",Vivai Gigli,Pianta in vaso,"Piante, Acidofile, yg_data:cultivar:azalea-del-diavolo-bella-di-anna",TRUE,Diametro del vaso,18,,,,,,2000,shopify,1000,deny,Vivai Gigli,15,,TRUE,TRUE,,https://www.vivaigigli.it/wp-content/uploads/2018/10/Azalea_del_Diavolo_BELLADIANNA.jpg,1,,FALSE,,,,,,,,,,,,,,,,,kg,
