VendorProductId,Title,Body (HTML),Type,Tags,Published,Option1 Name,Option1 Value,Variant SKU,Variant Grams,Variant Price,Image Src,Image Position,Image Alt Text
1,Abelia Grandiflora in vaso da 16cm,Descrizione della Abelia Grandiflora in vaso da 16 cm,Pianta in vaso,"Pianta in vaso, Pacco, yg:cultivar:abelia-grandiflora",TRUE,Diametro vaso,16 cm,123,2000,20,https://cdn.shopify.com/s/files/1/0014/5368/6854/products/uytuyt.png?v=1532078025,1,Immagine Abelia in vaso
2,Rosa canina - 12 semi,Descrizione dei semi della rosa canina,Semi,"Semi, yg:cultivar:rosa-canina",FALSE,Numero semi,100,456,1000,9.9,https://shop.unquadratodigiardino.it/1654-thickbox_default/rosa-canina-alba-.jpg,1,Immagine Rosa canina - semi
