<?xml version="1.0" encoding="UTF-8" standalone="no"?>
<!-- Created with Inkscape (http://www.inkscape.org/) -->

<svg
   xmlns:dc="http://purl.org/dc/elements/1.1/"
   xmlns:cc="http://creativecommons.org/ns#"
   xmlns:rdf="http://www.w3.org/1999/02/22-rdf-syntax-ns#"
   xmlns:svg="http://www.w3.org/2000/svg"
   xmlns="http://www.w3.org/2000/svg"
   xmlns:sodipodi="http://sodipodi.sourceforge.net/DTD/sodipodi-0.dtd"
   xmlns:inkscape="http://www.inkscape.org/namespaces/inkscape"
   width="210mm"
   height="297mm"
   viewBox="0 0 744.09448819 1052.3622047"
   id="svg2"
   version="1.1"
   inkscape:version="0.91 r13725"
   sodipodi:docname="signals.svg">
  <defs
     id="defs4">
    <clipPath
       id="clip"
       style="font-size:13.33329964px;line-height:19.04759979px;fill:#ffffff">
      <rect
         y="0"
         x="0"
         width="867"
         height="84.5"
         style="font-size:13.33329964px;line-height:19.04759979px;fill:#ffffff"
         id="rect7" />
    </clipPath>
    <clipPath
       id="clip-5"
       style="font-size:13.33329964px;line-height:19.04759979px;fill:#ffffff">
      <rect
         y="0"
         x="0"
         width="867"
         height="84.5"
         style="font-size:13.33329964px;line-height:19.04759979px;fill:#ffffff"
         id="rect7-9" />
    </clipPath>
    <clipPath
       id="clip-8"
       style="font-size:13.33329964px;line-height:19.04759979px;fill:#ffffff">
      <rect
         y="0"
         x="0"
         width="867"
         height="84.5"
         style="font-size:13.33329964px;line-height:19.04759979px;fill:#ffffff"
         id="rect7-4" />
    </clipPath>
    <clipPath
       id="clip-4"
       style="font-size:13.33329964px;line-height:19.04759979px;fill:#ffffff">
      <rect
         y="0"
         x="0"
         width="867"
         height="84.5"
         style="font-size:13.33329964px;line-height:19.04759979px;fill:#ffffff"
         id="rect7-6" />
    </clipPath>
  </defs>
  <sodipodi:namedview
     id="base"
     pagecolor="#ffffff"
     bordercolor="#666666"
     borderopacity="1.0"
     inkscape:pageopacity="0.0"
     inkscape:pageshadow="2"
     inkscape:zoom="0.86970594"
     inkscape:cx="-774.28401"
     inkscape:cy="887.48435"
     inkscape:document-units="px"
     inkscape:current-layer="g11"
     showgrid="false"
     inkscape:window-width="1366"
     inkscape:window-height="705"
     inkscape:window-x="-8"
     inkscape:window-y="-8"
     inkscape:window-maximized="1" />
  <metadata
     id="metadata7">
    <rdf:RDF>
      <cc:Work
         rdf:about="">
        <dc:format>image/svg+xml</dc:format>
        <dc:type
           rdf:resource="http://purl.org/dc/dcmitype/StillImage" />
        <dc:title></dc:title>
      </cc:Work>
    </rdf:RDF>
  </metadata>
  <g
     inkscape:label="Camada 1"
     inkscape:groupmode="layer"
     id="layer1">
    <g
       id="g4484">
      <g
         id="g11"
         style="font-size:13.33329964px;line-height:19.04759979px;fill:#ffffff"
         clip-path="url(#clip)"
         transform="translate(-1162.38,33.291205)">
        <path
           id="path13"
           style="font-size:13.33329964px;line-height:19.04759979px;fill:none;stroke:#000000;stroke-opacity:1;stroke-width:1;stroke-miterlimit:4;stroke-dasharray:none"
           d="m 0,46.5 c 6.1515152,0 24.606061,0 36.909091,0 12.30303,0 24.738485,-2.58048 36.909091,-3.85 12.170606,-1.26952 24.738485,-2.58048 36.909088,-3.85 12.17061,-1.26952 24.73849,-2.58048 36.90909,-3.85 12.17061,-1.26952 24.73849,-2.58048 36.90909,-3.85 12.17061,-1.26952 24.73849,-2.58048 36.9091,-3.85 12.1706,-1.26952 24.73848,-2.58048 36.90909,-3.85 12.1706,-1.26952 24.73848,-2.58048 36.90909,-3.85 12.1706,-1.26952 24.73848,-2.58048 36.90909,-3.85 12.1706,-1.26952 24.73848,-2.58048 36.90909,-3.85 C 381.26152,10.58048 393.69697,8 406,8 c 12.30303,0 24.73848,2.58048 36.90909,3.85 12.17061,1.26952 24.73849,2.58048 36.90909,3.85 12.17061,1.26952 24.73849,2.58048 36.90909,3.85 12.17061,1.26952 24.73849,2.58048 36.90909,3.85 12.17061,1.26952 24.73849,2.58048 36.90909,3.85 12.17061,1.26952 24.73849,2.58048 36.9091,3.85 12.1706,1.26952 24.73848,2.58048 36.90909,3.85 12.1706,1.26952 24.73848,2.58048 36.90909,3.85 12.1706,1.26952 24.73848,2.58048 36.90909,3.85 12.1706,1.26952 24.60606,3.85 36.90909,3.85 12.30303,0 30.75757,0 36.90909,0"
           class="vis-line"
           inkscape:connector-curvature="0" />
        <circle
           id="circle15"
           style="font-size:13.33329964px;line-height:19.04759979px;opacity:0.9;fill:#3b4cc0;fill-opacity:1;stroke:#333333;stroke-opacity:0.8"
           r="4"
           cy="46.5"
           cx="812"
           class="vis-marks" />
        <circle
           id="circle17"
           style="font-size:13.33329964px;line-height:19.04759979px;opacity:0.9;fill:#3b4cc0;fill-opacity:1;stroke:#333333;stroke-opacity:0.8"
           r="4"
           cy="46.5"
           cx="0"
           class="vis-marks" />
        <circle
           id="circle19"
           style="font-size:13.33329964px;line-height:19.04759979px;opacity:0.9;fill:#3b4cc0;fill-opacity:1;stroke:#333333;stroke-opacity:0.8"
           r="4"
           cy="46.5"
           cx="36.909092"
           class="vis-marks" />
        <circle
           id="circle21"
           style="font-size:13.33329964px;line-height:19.04759979px;opacity:0.9;fill:#3b4cc0;fill-opacity:1;stroke:#333333;stroke-opacity:0.8"
           r="4"
           cy="46.5"
           cx="775.09088"
           class="vis-marks" />
        <circle
           id="circle23"
           style="font-size:13.33329964px;line-height:19.04759979px;opacity:0.9;fill:#3b4cc0;stroke:#333333;stroke-opacity:0.8"
           r="4"
           cy="11.85"
           cx="442.90909"
           class="vis-marks" />
        <circle
           id="circle25"
           style="font-size:13.33329964px;line-height:19.04759979px;opacity:0.9;fill:#3b4cc0;stroke:#333333;stroke-opacity:0.8"
           r="4"
           cy="8"
           cx="406"
           class="vis-marks" />
        <circle
           id="circle27"
           style="font-size:13.33329964px;line-height:19.04759979px;opacity:0.9;fill:#3b4cc0;stroke:#333333;stroke-opacity:0.8"
           r="4"
           cy="19.549999"
           cx="516.72729"
           class="vis-marks" />
        <circle
           id="circle29"
           style="font-size:13.33329964px;line-height:19.04759979px;opacity:0.9;fill:#3b4cc0;stroke:#333333;stroke-opacity:0.8"
           r="4"
           cy="27.25"
           cx="221.45454"
           class="vis-marks" />
        <circle
           id="circle31"
           style="font-size:13.33329964px;line-height:19.04759979px;opacity:0.9;fill:#3b4cc0;stroke:#333333;stroke-opacity:0.8"
           r="4"
           cy="23.4"
           cx="553.63635"
           class="vis-marks" />
        <circle
           id="circle33"
           style="font-size:13.33329964px;line-height:19.04759979px;opacity:0.9;fill:#3b4cc0;stroke:#333333;stroke-opacity:0.8"
           r="4"
           cy="19.549999"
           cx="295.27274"
           class="vis-marks" />
        <circle
           id="circle35"
           style="font-size:13.33329964px;line-height:19.04759979px;opacity:0.9;fill:#3b4cc0;stroke:#333333;stroke-opacity:0.8"
           r="4"
           cy="27.25"
           cx="590.54547"
           class="vis-marks" />
        <circle
           id="circle37"
           style="font-size:13.33329964px;line-height:19.04759979px;opacity:0.9;fill:#3b4cc0;stroke:#333333;stroke-opacity:0.8"
           r="4"
           cy="11.85"
           cx="369.09091"
           class="vis-marks" />
        <circle
           id="circle39"
           style="font-size:13.33329964px;line-height:19.04759979px;opacity:0.9;fill:#3b4cc0;stroke:#333333;stroke-opacity:0.8"
           r="4"
           cy="31.1"
           cx="627.45453"
           class="vis-marks" />
        <circle
           id="circle41"
           style="font-size:13.33329964px;line-height:19.04759979px;opacity:0.9;fill:#3b4cc0;stroke:#333333;stroke-opacity:0.8"
           r="4"
           cy="38.799999"
           cx="110.72727"
           class="vis-marks" />
        <circle
           id="circle43"
           style="font-size:13.33329964px;line-height:19.04759979px;opacity:0.9;fill:#3b4cc0;stroke:#333333;stroke-opacity:0.8"
           r="4"
           cy="34.950001"
           cx="147.63637"
           class="vis-marks" />
        <circle
           id="circle45"
           style="font-size:13.33329964px;line-height:19.04759979px;opacity:0.9;fill:#3b4cc0;stroke:#333333;stroke-opacity:0.8"
           r="4"
           cy="38.799999"
           cx="701.27271"
           class="vis-marks" />
        <circle
           id="circle47"
           style="font-size:13.33329964px;line-height:19.04759979px;opacity:0.9;fill:#3b4cc0;stroke:#333333;stroke-opacity:0.8"
           r="4"
           cy="34.950001"
           cx="664.36365"
           class="vis-marks" />
        <circle
           id="circle49"
           style="font-size:13.33329964px;line-height:19.04759979px;opacity:0.9;fill:#3b4cc0;stroke:#333333;stroke-opacity:0.8"
           r="4"
           cy="15.7"
           cx="479.81818"
           class="vis-marks" />
        <circle
           id="circle51"
           style="font-size:13.33329964px;line-height:19.04759979px;opacity:0.9;fill:#3b4cc0;stroke:#333333;stroke-opacity:0.8"
           r="4"
           cy="31.1"
           cx="184.54546"
           class="vis-marks" />
        <circle
           id="circle53"
           style="font-size:13.33329964px;line-height:19.04759979px;opacity:0.9;fill:#3b4cc0;stroke:#333333;stroke-opacity:0.8"
           r="4"
           cy="15.7"
           cx="332.18182"
           class="vis-marks" />
        <circle
           id="circle55"
           style="font-size:13.33329964px;line-height:19.04759979px;opacity:0.9;fill:#3b4cc0;stroke:#333333;stroke-opacity:0.8"
           r="4"
           cy="23.4"
           cx="258.36365"
           class="vis-marks" />
        <circle
           id="circle57"
           style="font-size:13.33329964px;line-height:19.04759979px;opacity:0.9;fill:#3b4cc0;fill-opacity:1;stroke:#333333;stroke-opacity:0.8"
           r="4"
           cy="42.650002"
           cx="73.818184"
           class="vis-marks" />
        <circle
           id="circle59"
           style="font-size:13.33329964px;line-height:19.04759979px;opacity:0.9;fill:#3b4cc0;fill-opacity:1;stroke:#333333;stroke-opacity:0.8"
           r="4"
           cy="42.650002"
           cx="738.18182"
           class="vis-marks" />
      </g>
      <g
         id="g61"
         style="font-size:13.33329964px;line-height:19.04759979px;fill:#ffffff"
         transform="translate(-1162.4388,33.280749)">
        <g
           id="g63"
           style="font-size:13.33329964px;line-height:19.04759979px;fill:none;stroke:#000000;stroke-width:0.40000001px;stroke-opacity:1"
           transform="translate(0,46.499936)"
           class="x vis-axis">
          <g
             id="g65"
             style="font-size:13.33329964px;line-height:19.04759979px;fill:none;stroke:#000000;stroke-width:0.40000001px;stroke-opacity:1"
             class="tick">
            <line
               id="line67"
               style="font-size:13.33329964px;line-height:19.04759979px;fill:none;stroke:#000000;stroke-width:0.40000001px;stroke-opacity:1"
               x2="0"
               y2="6"
               x1="0"
               y1="0" />
            <text
               sodipodi:linespacing="125%"
               id="text69"
               style="font-style:normal;font-variant:normal;font-weight:normal;font-stretch:normal;font-size:12.5px;line-height:125%;font-family:sans-serif;-inkscape-font-specification:'sans-serif, Normal';text-align:center;writing-mode:lr-tb;text-anchor:middle;white-space:nowrap;display:block;fill:#000000;stroke:#000000;stroke-width:0.40000001px;fill-opacity:1;stroke-opacity:1"
               x="0"
               y="19"
               dy="0">0</text>
          </g>
          <g
             id="g71"
             style="font-size:13.33329964px;line-height:19.04759979px;fill:none;stroke:#000000;stroke-width:0.40000001px;stroke-opacity:1"
             transform="translate(73.818182,0)"
             class="tick">
            <line
               id="line73"
               style="font-size:13.33329964px;line-height:19.04759979px;fill:none;stroke:#000000;stroke-width:0.40000001px;stroke-opacity:1"
               x2="0"
               y2="6"
               x1="0"
               y1="0" />
            <text
               sodipodi:linespacing="125%"
               id="text75"
               style="font-style:normal;font-variant:normal;font-weight:normal;font-stretch:normal;font-size:12.5px;line-height:125%;font-family:sans-serif;-inkscape-font-specification:'sans-serif, Normal';text-align:center;writing-mode:lr-tb;text-anchor:middle;white-space:nowrap;display:block;fill:#000000;stroke:#000000;stroke-width:0.40000001px;stroke-opacity:1;fill-opacity:1"
               x="0"
               y="19"
               dy="0">2</text>
          </g>
          <g
             id="g77"
             style="font-size:13.33329964px;line-height:19.04759979px;fill:none;stroke:#000000;stroke-width:0.40000001px;stroke-opacity:1"
             transform="translate(147.63636,0)"
             class="tick">
            <line
               id="line79"
               style="font-size:13.33329964px;line-height:19.04759979px;fill:none;stroke:#000000;stroke-width:0.40000001px;stroke-opacity:1"
               x2="0"
               y2="6"
               x1="0"
               y1="0" />
            <text
               sodipodi:linespacing="125%"
               id="text81"
               style="font-style:normal;font-variant:normal;font-weight:normal;font-stretch:normal;font-size:12.5px;line-height:125%;font-family:sans-serif;-inkscape-font-specification:'sans-serif, Normal';text-align:center;writing-mode:lr-tb;text-anchor:middle;white-space:nowrap;display:block;fill:#000000;stroke:#000000;stroke-width:0.40000001px;stroke-opacity:1;fill-opacity:1"
               x="0"
               y="19"
               dy="0">4</text>
          </g>
          <g
             id="g83"
             style="font-size:13.33329964px;line-height:19.04759979px;fill:none;stroke:#000000;stroke-width:0.40000001px;stroke-opacity:1"
             transform="translate(221.45455,0)"
             class="tick">
            <line
               id="line85"
               style="font-size:13.33329964px;line-height:19.04759979px;fill:none;stroke:#000000;stroke-width:0.40000001px;stroke-opacity:1"
               x2="0"
               y2="6"
               x1="0"
               y1="0" />
            <text
               sodipodi:linespacing="125%"
               id="text87"
               style="font-style:normal;font-variant:normal;font-weight:normal;font-stretch:normal;font-size:12.5px;line-height:125%;font-family:sans-serif;-inkscape-font-specification:'sans-serif, Normal';text-align:center;writing-mode:lr-tb;text-anchor:middle;white-space:nowrap;display:block;fill:#000000;stroke:#000000;stroke-width:0.40000001px;stroke-opacity:1;fill-opacity:1"
               x="0"
               y="19"
               dy="0">6</text>
          </g>
          <g
             id="g89"
             style="font-size:13.33329964px;line-height:19.04759979px;fill:none;stroke:#000000;stroke-width:0.40000001px;stroke-opacity:1"
             transform="translate(295.27273,0)"
             class="tick">
            <line
               id="line91"
               style="font-size:13.33329964px;line-height:19.04759979px;fill:none;stroke:#000000;stroke-width:0.40000001px;stroke-opacity:1"
               x2="0"
               y2="6"
               x1="0"
               y1="0" />
            <text
               sodipodi:linespacing="125%"
               id="text93"
               style="font-style:normal;font-variant:normal;font-weight:normal;font-stretch:normal;font-size:12.5px;line-height:125%;font-family:sans-serif;-inkscape-font-specification:'sans-serif, Normal';text-align:center;writing-mode:lr-tb;text-anchor:middle;white-space:nowrap;display:block;fill:#000000;stroke:#000000;stroke-width:0.40000001px;stroke-opacity:1;fill-opacity:1"
               x="0"
               y="19"
               dy="0">8</text>
          </g>
          <g
             id="g95"
             style="font-size:13.33329964px;line-height:19.04759979px;fill:none;stroke:#000000;stroke-width:0.40000001px;stroke-opacity:1"
             transform="translate(369.09091,0)"
             class="tick">
            <line
               id="line97"
               style="font-size:13.33329964px;line-height:19.04759979px;fill:none;stroke:#000000;stroke-width:0.40000001px;stroke-opacity:1"
               x2="0"
               y2="6"
               x1="0"
               y1="0" />
            <text
               sodipodi:linespacing="125%"
               id="text99"
               style="font-style:normal;font-variant:normal;font-weight:normal;font-stretch:normal;font-size:12.5px;line-height:125%;font-family:sans-serif;-inkscape-font-specification:'sans-serif, Normal';text-align:center;writing-mode:lr-tb;text-anchor:middle;white-space:nowrap;display:block;fill:#000000;stroke:#000000;stroke-width:0.40000001px;stroke-opacity:1;fill-opacity:1"
               x="0"
               y="19"
               dy="0">10</text>
          </g>
          <g
             id="g101"
             style="font-size:13.33329964px;line-height:19.04759979px;fill:none;stroke:#000000;stroke-width:0.40000001px;stroke-opacity:1"
             transform="translate(442.90909,0)"
             class="tick">
            <line
               id="line103"
               style="font-size:13.33329964px;line-height:19.04759979px;fill:none;stroke:#000000;stroke-width:0.40000001px;stroke-opacity:1"
               x2="0"
               y2="6"
               x1="0"
               y1="0" />
            <text
               sodipodi:linespacing="125%"
               id="text105"
               style="font-style:normal;font-variant:normal;font-weight:normal;font-stretch:normal;font-size:12.5px;line-height:125%;font-family:sans-serif;-inkscape-font-specification:'sans-serif, Normal';text-align:center;writing-mode:lr-tb;text-anchor:middle;white-space:nowrap;display:block;fill:#000000;stroke:#000000;stroke-width:0.40000001px;stroke-opacity:1;fill-opacity:1"
               x="0"
               y="19"
               dy="0">12</text>
          </g>
          <g
             id="g107"
             style="font-size:13.33329964px;line-height:19.04759979px;fill:none;stroke:#000000;stroke-width:0.40000001px;stroke-opacity:1"
             transform="translate(516.72727,0)"
             class="tick">
            <line
               id="line109"
               style="font-size:13.33329964px;line-height:19.04759979px;fill:none;stroke:#000000;stroke-width:0.40000001px;stroke-opacity:1"
               x2="0"
               y2="6"
               x1="0"
               y1="0" />
            <text
               sodipodi:linespacing="125%"
               id="text111"
               style="font-style:normal;font-variant:normal;font-weight:normal;font-stretch:normal;font-size:12.5px;line-height:125%;font-family:sans-serif;-inkscape-font-specification:'sans-serif, Normal';text-align:center;writing-mode:lr-tb;text-anchor:middle;white-space:nowrap;display:block;fill:#000000;stroke:#000000;stroke-width:0.40000001px;stroke-opacity:1;fill-opacity:1"
               x="0"
               y="19"
               dy="0">14</text>
          </g>
          <g
             id="g113"
             style="font-size:13.33329964px;line-height:19.04759979px;fill:none;stroke:#000000;stroke-width:0.40000001px;stroke-opacity:1"
             transform="translate(590.54545,0)"
             class="tick">
            <line
               id="line115"
               style="font-size:13.33329964px;line-height:19.04759979px;fill:none;stroke:#000000;stroke-width:0.40000001px;stroke-opacity:1"
               x2="0"
               y2="6"
               x1="0"
               y1="0" />
            <text
               sodipodi:linespacing="125%"
               id="text117"
               style="font-style:normal;font-variant:normal;font-weight:normal;font-stretch:normal;font-size:12.5px;line-height:125%;font-family:sans-serif;-inkscape-font-specification:'sans-serif, Normal';text-align:center;writing-mode:lr-tb;text-anchor:middle;white-space:nowrap;display:block;fill:#000000;stroke:#000000;stroke-width:0.40000001px;stroke-opacity:1;fill-opacity:1"
               x="0"
               y="19"
               dy="0">16</text>
          </g>
          <g
             id="g119"
             style="font-size:13.33329964px;line-height:19.04759979px;fill:none;stroke:#000000;stroke-width:0.40000001px;stroke-opacity:1"
             transform="translate(664.36364,0)"
             class="tick">
            <line
               id="line121"
               style="font-size:13.33329964px;line-height:19.04759979px;fill:none;stroke:#000000;stroke-width:0.40000001px;stroke-opacity:1"
               x2="0"
               y2="6"
               x1="0"
               y1="0" />
            <text
               sodipodi:linespacing="125%"
               id="text123"
               style="font-style:normal;font-variant:normal;font-weight:normal;font-stretch:normal;font-size:12.5px;line-height:125%;font-family:sans-serif;-inkscape-font-specification:'sans-serif, Normal';text-align:center;writing-mode:lr-tb;text-anchor:middle;white-space:nowrap;display:block;fill:#000000;stroke:#000000;stroke-width:0.40000001px;stroke-opacity:1;fill-opacity:1"
               x="0"
               y="19"
               dy="0">18</text>
          </g>
          <g
             id="g125"
             style="font-size:13.33329964px;line-height:19.04759979px;fill:none;stroke:#000000;stroke-width:0.40000001px;stroke-opacity:1"
             transform="translate(738.18182,0)"
             class="tick">
            <line
               id="line127"
               style="font-size:13.33329964px;line-height:19.04759979px;fill:none;stroke:#000000;stroke-width:0.40000001px;stroke-opacity:1"
               x2="0"
               y2="6"
               x1="0"
               y1="0" />
            <text
               sodipodi:linespacing="125%"
               id="text129"
               style="font-style:normal;font-variant:normal;font-weight:normal;font-stretch:normal;font-size:12.5px;line-height:125%;font-family:sans-serif;-inkscape-font-specification:'sans-serif, Normal';text-align:center;writing-mode:lr-tb;text-anchor:middle;white-space:nowrap;display:block;fill:#000000;stroke:#000000;stroke-width:0.40000001px;stroke-opacity:1;fill-opacity:1"
               x="0"
               y="19"
               dy="0">20</text>
          </g>
          <g
             id="g131"
             style="font-size:13.33329964px;line-height:19.04759979px;fill:none;stroke:#000000;stroke-width:0.40000001px;stroke-opacity:1"
             transform="translate(812,0)"
             class="tick">
            <line
               id="line133"
               style="font-size:13.33329964px;line-height:19.04759979px;fill:none;stroke:#000000;stroke-width:0.40000001px;stroke-opacity:1"
               x2="0"
               y2="6"
               x1="0"
               y1="0" />
            <text
               sodipodi:linespacing="125%"
               id="text135"
               style="font-style:normal;font-variant:normal;font-weight:normal;font-stretch:normal;font-size:12.5px;line-height:125%;font-family:sans-serif;-inkscape-font-specification:'sans-serif, Normal';text-align:center;writing-mode:lr-tb;text-anchor:middle;white-space:nowrap;display:block;fill:#000000;stroke:#000000;stroke-width:0.40000001px;stroke-opacity:1;fill-opacity:1"
               x="0"
               y="19"
               dy="0">22</text>
          </g>
          <path
             id="path137"
             style="font-size:13.33329964px;line-height:19.04759979px;fill:none;stroke:#000000;stroke-width:0.40000001px;stroke-opacity:1"
             d="m 0,6 0,-6 812,0 0,6"
             class="domain"
             inkscape:connector-curvature="0" />
        </g>
        <g
           id="g139"
           style="font-size:13.33329964px;line-height:19.04759979px;fill:none;stroke:#000000;stroke-width:0.40000001px;stroke-opacity:1"
           class="y vis-axis">
          <g
             id="g141"
             style="font-size:13.33329964px;line-height:19.04759979px;fill:none;stroke:#000000;stroke-width:0.40000001px;stroke-opacity:1"
             transform="translate(0,46.5)"
             class="tick">
            <text
               sodipodi:linespacing="125%"
               id="text145"
               style="font-style:normal;font-variant:normal;font-weight:normal;font-stretch:normal;font-size:12.5px;line-height:125%;font-family:sans-serif;-inkscape-font-specification:'sans-serif, Normal';text-align:end;writing-mode:lr-tb;text-anchor:end;white-space:nowrap;display:block;fill:#000000;stroke:#000000;stroke-width:0.40000001px;fill-opacity:1;stroke-opacity:1"
               y="4"
               x="-3"
               dy="0">0</text>
          </g>
          <g
             id="g147"
             style="font-size:13.33329964px;line-height:19.04759979px;fill:none;stroke:#000000;stroke-width:0.40000001px;stroke-opacity:1"
             transform="translate(0,38.8)"
             class="tick" />
          <g
             id="g153"
             style="font-size:13.33329964px;line-height:19.04759979px;fill:none;stroke:#000000;stroke-width:0.40000001px;stroke-opacity:1"
             transform="translate(0,31.1)"
             class="tick" />
          <g
             id="g159"
             style="font-size:13.33329964px;line-height:19.04759979px;fill:none;stroke:#000000;stroke-width:0.40000001px;stroke-opacity:1"
             transform="translate(0,23.4)"
             class="tick" />
          <g
             id="g165"
             style="font-size:13.33329964px;line-height:19.04759979px;fill:none;stroke:#000000;stroke-width:0.40000001px;stroke-opacity:1"
             transform="translate(0,15.7)"
             class="tick" />
          <g
             id="g171"
             style="font-size:13.33329964px;line-height:19.04759979px;fill:none;stroke:#000000;stroke-width:0.40000001px;stroke-opacity:1"
             transform="translate(0,8)"
             class="tick">
            <line
               id="line173"
               style="font-size:13.33329964px;line-height:19.04759979px;fill:none;stroke:#000000;stroke-width:0.40000001px;stroke-opacity:1"
               y2="0"
               x2="812"
               x1="0"
               y1="0" />
            <text
               sodipodi:linespacing="125%"
               id="text175"
               style="font-style:normal;font-variant:normal;font-weight:normal;font-stretch:normal;font-size:12.5px;line-height:125%;font-family:sans-serif;-inkscape-font-specification:'sans-serif, Normal';text-align:end;writing-mode:lr-tb;text-anchor:end;white-space:nowrap;display:block;fill:#000000;stroke:#000000;stroke-width:0.40000001px;fill-opacity:1;stroke-opacity:1"
               y="4"
               x="-3"
               dy="0">10</text>
          </g>
          <path
             id="path177"
             style="font-size:13.33329964px;line-height:19.04759979px;fill:none;stroke:#000000;stroke-width:0.40000001px;stroke-opacity:1"
             d="m 0,8 0,0 0,38.5 0,0"
             class="domain"
             inkscape:connector-curvature="0" />
        </g>
      </g>
    </g>
    <g
       id="g4811"
       transform="translate(-43.7473,-436.34372)">
      <g
         id="g11-7"
         style="font-size:13.33329964px;line-height:19.04759979px;fill:#ffffff"
         clip-path="url(#clip-5)"
         transform="translate(-1118.794,568.0202)">
        <path
           id="path13-3"
           style="font-size:13.33329964px;line-height:19.04759979px;fill:none;stroke:#000000;stroke-opacity:1"
           d="m 0,46.5 c 6.1515152,0 24.606061,0 36.909091,0 12.30303,0 24.606061,0 36.909091,0 12.30303,0 24.60606,0 36.909088,0 12.30303,0 24.60606,0 36.90909,0 12.30303,0 24.60606,0 36.90909,0 12.30303,0 24.60607,0 36.9091,0 12.30303,0 25.11918,-5.240382 36.90909,-7.7 11.7899,-2.459618 25.11918,-5.240382 36.90909,-7.7 11.7899,-2.459618 25.11919,-5.240382 36.90909,-7.7 11.7899,-2.459618 25.11919,-5.240382 36.90909,-7.7 C 380.88081,13.240382 393.69697,8 406,8 c 12.30303,0 25.11919,5.240382 36.90909,7.7 11.7899,2.459618 25.11919,5.240382 36.90909,7.7 11.7899,2.459618 25.11919,5.240382 36.90909,7.7 11.78991,2.459618 25.11919,5.240382 36.90909,7.7 11.78991,2.459618 24.60606,7.7 36.90909,7.7 12.30303,0 24.60607,0 36.9091,0 12.30303,0 24.60606,0 36.90909,0 12.30303,0 24.60606,0 36.90909,0 12.30303,0 24.60606,0 36.90909,0 12.30303,0 24.60606,0 36.90909,0 12.30303,0 30.75757,0 36.90909,0"
           class="vis-line"
           inkscape:connector-curvature="0" />
        <circle
           id="circle15-4"
           style="font-size:13.33329964px;line-height:19.04759979px;opacity:0.9;fill:#3b4cc0;fill-opacity:1;stroke:#333333;stroke-opacity:0.8"
           r="4"
           cy="46.5"
           cx="812"
           class="vis-marks" />
        <circle
           id="circle17-1"
           style="font-size:13.33329964px;line-height:19.04759979px;opacity:0.9;fill:#3b4cc0;fill-opacity:1;stroke:#333333;stroke-opacity:0.8"
           r="4"
           cy="46.5"
           cx="0"
           class="vis-marks" />
        <circle
           id="circle19-3"
           style="font-size:13.33329964px;line-height:19.04759979px;opacity:0.9;fill:#3b4cc0;fill-opacity:1;stroke:#333333;stroke-opacity:0.8"
           r="4"
           cy="46.5"
           cx="701.27271"
           class="vis-marks" />
        <circle
           id="circle21-0"
           style="font-size:13.33329964px;line-height:19.04759979px;opacity:0.9;fill:#3b4cc0;fill-opacity:1;stroke:#333333;stroke-opacity:0.8"
           r="4"
           cy="46.5"
           cx="590.54547"
           class="vis-marks" />
        <circle
           id="circle23-6"
           style="font-size:13.33329964px;line-height:19.04759979px;opacity:0.9;fill:#3b4cc0;fill-opacity:1;stroke:#333333;stroke-opacity:0.8"
           r="4"
           cy="46.5"
           cx="73.818184"
           class="vis-marks" />
        <circle
           id="circle25-9"
           style="font-size:13.33329964px;line-height:19.04759979px;opacity:0.9;fill:#3b4cc0;fill-opacity:1;stroke:#333333;stroke-opacity:0.8"
           r="4"
           cy="46.5"
           cx="627.45453"
           class="vis-marks" />
        <circle
           id="circle27-1"
           style="font-size:13.33329964px;line-height:19.04759979px;opacity:0.9;fill:#3b4cc0;fill-opacity:1;stroke:#333333;stroke-opacity:0.8"
           r="4"
           cy="46.5"
           cx="110.72727"
           class="vis-marks" />
        <circle
           id="circle29-9"
           style="font-size:13.33329964px;line-height:19.04759979px;opacity:0.9;fill:#3b4cc0;fill-opacity:1;stroke:#333333;stroke-opacity:0.8"
           r="4"
           cy="46.5"
           cx="36.909092"
           class="vis-marks" />
        <circle
           id="circle31-2"
           style="font-size:13.33329964px;line-height:19.04759979px;opacity:0.9;fill:#3b4cc0;fill-opacity:1;stroke:#333333;stroke-opacity:0.8"
           r="4"
           cy="46.5"
           cx="664.36365"
           class="vis-marks" />
        <circle
           id="circle33-6"
           style="font-size:13.33329964px;line-height:19.04759979px;opacity:0.9;fill:#3b4cc0;fill-opacity:1;stroke:#333333;stroke-opacity:0.8"
           r="4"
           cy="46.5"
           cx="147.63637"
           class="vis-marks" />
        <circle
           id="circle35-5"
           style="font-size:13.33329964px;line-height:19.04759979px;opacity:0.9;fill:#3b4cc0;fill-opacity:1;stroke:#333333;stroke-opacity:0.8"
           r="4"
           cy="46.5"
           cx="738.18182"
           class="vis-marks" />
        <circle
           id="circle37-7"
           style="font-size:13.33329964px;line-height:19.04759979px;opacity:0.9;fill:#3b4cc0;fill-opacity:1;stroke:#333333;stroke-opacity:0.8"
           r="4"
           cy="46.5"
           cx="775.09088"
           class="vis-marks" />
        <circle
           id="circle39-9"
           style="font-size:13.33329964px;line-height:19.04759979px;opacity:0.9;fill:#3b4cc0;fill-opacity:1;stroke:#333333;stroke-opacity:0.8"
           r="4"
           cy="46.5"
           cx="221.45454"
           class="vis-marks" />
        <circle
           id="circle41-7"
           style="font-size:13.33329964px;line-height:19.04759979px;opacity:0.9;fill:#3b4cc0;fill-opacity:1;stroke:#333333;stroke-opacity:0.8"
           r="4"
           cy="46.5"
           cx="184.54546"
           class="vis-marks" />
        <circle
           id="circle43-7"
           style="font-size:13.33329964px;line-height:19.04759979px;opacity:0.9;fill:#3b4cc0;stroke:#333333;stroke-opacity:0.8"
           r="4"
           cy="15.7"
           cx="442.90909"
           class="vis-marks" />
        <circle
           id="circle45-1"
           style="font-size:13.33329964px;line-height:19.04759979px;opacity:0.9;fill:#3b4cc0;stroke:#333333;stroke-opacity:0.8"
           r="4"
           cy="8"
           cx="406"
           class="vis-marks" />
        <circle
           id="circle47-8"
           style="font-size:13.33329964px;line-height:19.04759979px;opacity:0.9;fill:#3b4cc0;stroke:#333333;stroke-opacity:0.8"
           r="4"
           cy="38.799999"
           cx="258.36365"
           class="vis-marks" />
        <circle
           id="circle49-4"
           style="font-size:13.33329964px;line-height:19.04759979px;opacity:0.9;fill:#3b4cc0;stroke:#333333;stroke-opacity:0.8"
           r="4"
           cy="31.1"
           cx="295.27274"
           class="vis-marks" />
        <circle
           id="circle51-8"
           style="font-size:13.33329964px;line-height:19.04759979px;opacity:0.9;fill:#3b4cc0;stroke:#333333;stroke-opacity:0.8"
           r="4"
           cy="23.4"
           cx="332.18182"
           class="vis-marks" />
        <circle
           id="circle53-1"
           style="font-size:13.33329964px;line-height:19.04759979px;opacity:0.9;fill:#3b4cc0;stroke:#333333;stroke-opacity:0.8"
           r="4"
           cy="15.7"
           cx="369.09091"
           class="vis-marks" />
        <circle
           id="circle55-2"
           style="font-size:13.33329964px;line-height:19.04759979px;opacity:0.9;fill:#3b4cc0;stroke:#333333;stroke-opacity:0.8"
           r="4"
           cy="23.4"
           cx="479.81818"
           class="vis-marks" />
        <circle
           id="circle57-5"
           style="font-size:13.33329964px;line-height:19.04759979px;opacity:0.9;fill:#3b4cc0;stroke:#333333;stroke-opacity:0.8"
           r="4"
           cy="31.1"
           cx="516.72729"
           class="vis-marks" />
        <circle
           id="circle59-1"
           style="font-size:13.33329964px;line-height:19.04759979px;opacity:0.9;fill:#3b4cc0;stroke:#333333;stroke-opacity:0.8"
           r="4"
           cy="38.799999"
           cx="553.63635"
           class="vis-marks" />
      </g>
      <g
         id="g61-7"
         style="font-size:13.33329964px;line-height:19.04759979px;fill:#ffffff"
         transform="translate(-1118.6915,568.00323)">
        <g
           id="g63-9"
           style="font-size:13.33329964px;line-height:19.04759979px;fill:none;stroke:#000000;stroke-width:0.40000001px;stroke-opacity:1"
           transform="translate(0,46.500175)"
           class="x vis-axis">
          <g
             id="g65-3"
             style="font-size:13.33329964px;line-height:19.04759979px;fill:none;stroke:#000000;stroke-width:0.40000001px;stroke-opacity:1"
             class="tick">
            <line
               id="line67-6"
               style="font-size:13.33329964px;line-height:19.04759979px;fill:none;stroke:#000000;stroke-width:0.40000001px;stroke-opacity:1"
               x2="0"
               y2="6"
               x1="0"
               y1="0" />
            <text
               sodipodi:linespacing="125%"
               id="text69-5"
               style="font-style:normal;font-variant:normal;font-weight:normal;font-stretch:normal;font-size:12.5px;line-height:125%;font-family:sans-serif;-inkscape-font-specification:'sans-serif, Normal';text-align:center;writing-mode:lr-tb;text-anchor:middle;white-space:nowrap;display:block;fill:#000000;stroke:#000000;stroke-width:0.40000001px;fill-opacity:1;stroke-opacity:1"
               x="0"
               y="19"
               dy="0">0</text>
          </g>
          <g
             id="g71-0"
             style="font-size:13.33329964px;line-height:19.04759979px;fill:none;stroke:#000000;stroke-width:0.40000001px;stroke-opacity:1"
             transform="translate(73.818182,0)"
             class="tick">
            <line
               id="line73-5"
               style="font-size:13.33329964px;line-height:19.04759979px;fill:none;stroke:#000000;stroke-width:0.40000001px;stroke-opacity:1"
               x2="0"
               y2="6"
               x1="0"
               y1="0" />
            <text
               sodipodi:linespacing="125%"
               id="text75-7"
               style="font-style:normal;font-variant:normal;font-weight:normal;font-stretch:normal;font-size:12.5px;line-height:125%;font-family:sans-serif;-inkscape-font-specification:'sans-serif, Normal';text-align:center;writing-mode:lr-tb;text-anchor:middle;white-space:nowrap;display:block;fill:#000000;stroke:#000000;stroke-width:0.40000001px;stroke-opacity:1;fill-opacity:1"
               x="0"
               y="19"
               dy="0">2</text>
          </g>
          <g
             id="g77-8"
             style="font-size:13.33329964px;line-height:19.04759979px;fill:none;stroke:#000000;stroke-width:0.40000001px;stroke-opacity:1"
             transform="translate(147.63636,0)"
             class="tick">
            <line
               id="line79-5"
               style="font-size:13.33329964px;line-height:19.04759979px;fill:none;stroke:#000000;stroke-width:0.40000001px;stroke-opacity:1"
               x2="0"
               y2="6"
               x1="0"
               y1="0" />
            <text
               sodipodi:linespacing="125%"
               id="text81-8"
               style="font-style:normal;font-variant:normal;font-weight:normal;font-stretch:normal;font-size:12.5px;line-height:125%;font-family:sans-serif;-inkscape-font-specification:'sans-serif, Normal';text-align:center;writing-mode:lr-tb;text-anchor:middle;white-space:nowrap;display:block;fill:#000000;stroke:#000000;stroke-width:0.40000001px;stroke-opacity:1;fill-opacity:1"
               x="0"
               y="19"
               dy="0">4</text>
          </g>
          <g
             id="g83-5"
             style="font-size:13.33329964px;line-height:19.04759979px;fill:none;stroke:#000000;stroke-width:0.40000001px;stroke-opacity:1"
             transform="translate(221.45455,0)"
             class="tick">
            <line
               id="line85-4"
               style="font-size:13.33329964px;line-height:19.04759979px;fill:none;stroke:#000000;stroke-width:0.40000001px;stroke-opacity:1"
               x2="0"
               y2="6"
               x1="0"
               y1="0" />
            <text
               sodipodi:linespacing="125%"
               id="text87-2"
               style="font-style:normal;font-variant:normal;font-weight:normal;font-stretch:normal;font-size:12.5px;line-height:125%;font-family:sans-serif;-inkscape-font-specification:'sans-serif, Normal';text-align:center;writing-mode:lr-tb;text-anchor:middle;white-space:nowrap;display:block;fill:#000000;stroke:#000000;stroke-width:0.40000001px;stroke-opacity:1;fill-opacity:1"
               x="0"
               y="19"
               dy="0">6</text>
          </g>
          <g
             id="g89-5"
             style="font-size:13.33329964px;line-height:19.04759979px;fill:none;stroke:#000000;stroke-width:0.40000001px;stroke-opacity:1"
             transform="translate(295.27273,0)"
             class="tick">
            <line
               id="line91-4"
               style="font-size:13.33329964px;line-height:19.04759979px;fill:none;stroke:#000000;stroke-width:0.40000001px;stroke-opacity:1"
               x2="0"
               y2="6"
               x1="0"
               y1="0" />
            <text
               sodipodi:linespacing="125%"
               id="text93-3"
               style="font-style:normal;font-variant:normal;font-weight:normal;font-stretch:normal;font-size:12.5px;line-height:125%;font-family:sans-serif;-inkscape-font-specification:'sans-serif, Normal';text-align:center;writing-mode:lr-tb;text-anchor:middle;white-space:nowrap;display:block;fill:#000000;stroke:#000000;stroke-width:0.40000001px;stroke-opacity:1;fill-opacity:1"
               x="0"
               y="19"
               dy="0">8</text>
          </g>
          <g
             id="g95-1"
             style="font-size:13.33329964px;line-height:19.04759979px;fill:none;stroke:#000000;stroke-width:0.40000001px;stroke-opacity:1"
             transform="translate(369.09091,0)"
             class="tick">
            <line
               id="line97-8"
               style="font-size:13.33329964px;line-height:19.04759979px;fill:none;stroke:#000000;stroke-width:0.40000001px;stroke-opacity:1"
               x2="0"
               y2="6"
               x1="0"
               y1="0" />
            <text
               sodipodi:linespacing="125%"
               id="text99-6"
               style="font-style:normal;font-variant:normal;font-weight:normal;font-stretch:normal;font-size:12.5px;line-height:125%;font-family:sans-serif;-inkscape-font-specification:'sans-serif, Normal';text-align:center;writing-mode:lr-tb;text-anchor:middle;white-space:nowrap;display:block;fill:#000000;stroke:#000000;stroke-width:0.40000001px;stroke-opacity:1;fill-opacity:1"
               x="0"
               y="19"
               dy="0">10</text>
          </g>
          <g
             id="g101-9"
             style="font-size:13.33329964px;line-height:19.04759979px;fill:none;stroke:#000000;stroke-width:0.40000001px;stroke-opacity:1"
             transform="translate(442.90909,0)"
             class="tick">
            <line
               id="line103-9"
               style="font-size:13.33329964px;line-height:19.04759979px;fill:none;stroke:#000000;stroke-width:0.40000001px;stroke-opacity:1"
               x2="0"
               y2="6"
               x1="0"
               y1="0" />
            <text
               sodipodi:linespacing="125%"
               id="text105-7"
               style="font-style:normal;font-variant:normal;font-weight:normal;font-stretch:normal;font-size:12.5px;line-height:125%;font-family:sans-serif;-inkscape-font-specification:'sans-serif, Normal';text-align:center;writing-mode:lr-tb;text-anchor:middle;white-space:nowrap;display:block;fill:#000000;stroke:#000000;stroke-width:0.40000001px;stroke-opacity:1;fill-opacity:1"
               x="0"
               y="19"
               dy="0">12</text>
          </g>
          <g
             id="g107-9"
             style="font-size:13.33329964px;line-height:19.04759979px;fill:none;stroke:#000000;stroke-width:0.40000001px;stroke-opacity:1"
             transform="translate(516.72727,0)"
             class="tick">
            <line
               id="line109-2"
               style="font-size:13.33329964px;line-height:19.04759979px;fill:none;stroke:#000000;stroke-width:0.40000001px;stroke-opacity:1"
               x2="0"
               y2="6"
               x1="0"
               y1="0" />
            <text
               sodipodi:linespacing="125%"
               id="text111-3"
               style="font-style:normal;font-variant:normal;font-weight:normal;font-stretch:normal;font-size:12.5px;line-height:125%;font-family:sans-serif;-inkscape-font-specification:'sans-serif, Normal';text-align:center;writing-mode:lr-tb;text-anchor:middle;white-space:nowrap;display:block;fill:#000000;stroke:#000000;stroke-width:0.40000001px;stroke-opacity:1;fill-opacity:1"
               x="0"
               y="19"
               dy="0">14</text>
          </g>
          <g
             id="g113-4"
             style="font-size:13.33329964px;line-height:19.04759979px;fill:none;stroke:#000000;stroke-width:0.40000001px;stroke-opacity:1"
             transform="translate(590.54545,0)"
             class="tick">
            <line
               id="line115-4"
               style="font-size:13.33329964px;line-height:19.04759979px;fill:none;stroke:#000000;stroke-width:0.40000001px;stroke-opacity:1"
               x2="0"
               y2="6"
               x1="0"
               y1="0" />
            <text
               sodipodi:linespacing="125%"
               id="text117-8"
               style="font-style:normal;font-variant:normal;font-weight:normal;font-stretch:normal;font-size:12.5px;line-height:125%;font-family:sans-serif;-inkscape-font-specification:'sans-serif, Normal';text-align:center;writing-mode:lr-tb;text-anchor:middle;white-space:nowrap;display:block;fill:#000000;stroke:#000000;stroke-width:0.40000001px;stroke-opacity:1;fill-opacity:1"
               x="0"
               y="19"
               dy="0">16</text>
          </g>
          <g
             id="g119-5"
             style="font-size:13.33329964px;line-height:19.04759979px;fill:none;stroke:#000000;stroke-width:0.40000001px;stroke-opacity:1"
             transform="translate(664.36364,0)"
             class="tick">
            <line
               id="line121-0"
               style="font-size:13.33329964px;line-height:19.04759979px;fill:none;stroke:#000000;stroke-width:0.40000001px;stroke-opacity:1"
               x2="0"
               y2="6"
               x1="0"
               y1="0" />
            <text
               sodipodi:linespacing="125%"
               id="text123-0"
               style="font-style:normal;font-variant:normal;font-weight:normal;font-stretch:normal;font-size:12.5px;line-height:125%;font-family:sans-serif;-inkscape-font-specification:'sans-serif, Normal';text-align:center;writing-mode:lr-tb;text-anchor:middle;white-space:nowrap;display:block;fill:#000000;stroke:#000000;stroke-width:0.40000001px;stroke-opacity:1;fill-opacity:1"
               x="0"
               y="19"
               dy="0">18</text>
          </g>
          <g
             id="g125-8"
             style="font-size:13.33329964px;line-height:19.04759979px;fill:none;stroke:#000000;stroke-width:0.40000001px;stroke-opacity:1"
             transform="translate(738.18182,0)"
             class="tick">
            <line
               id="line127-6"
               style="font-size:13.33329964px;line-height:19.04759979px;fill:none;stroke:#000000;stroke-width:0.40000001px;stroke-opacity:1"
               x2="0"
               y2="6"
               x1="0"
               y1="0" />
            <text
               sodipodi:linespacing="125%"
               id="text129-5"
               style="font-style:normal;font-variant:normal;font-weight:normal;font-stretch:normal;font-size:12.5px;line-height:125%;font-family:sans-serif;-inkscape-font-specification:'sans-serif, Normal';text-align:center;writing-mode:lr-tb;text-anchor:middle;white-space:nowrap;display:block;fill:#000000;stroke:#000000;stroke-width:0.40000001px;stroke-opacity:1;fill-opacity:1"
               x="0"
               y="19"
               dy="0">20</text>
          </g>
          <g
             id="g131-4"
             style="font-size:13.33329964px;line-height:19.04759979px;fill:none;stroke:#000000;stroke-width:0.40000001px;stroke-opacity:1"
             transform="translate(812,0)"
             class="tick">
            <line
               id="line133-0"
               style="font-size:13.33329964px;line-height:19.04759979px;fill:none;stroke:#000000;stroke-width:0.40000001px;stroke-opacity:1"
               x2="0"
               y2="6"
               x1="0"
               y1="0" />
            <text
               sodipodi:linespacing="125%"
               id="text135-6"
               style="font-style:normal;font-variant:normal;font-weight:normal;font-stretch:normal;font-size:12.5px;line-height:125%;font-family:sans-serif;-inkscape-font-specification:'sans-serif, Normal';text-align:center;writing-mode:lr-tb;text-anchor:middle;white-space:nowrap;display:block;fill:#000000;stroke:#000000;stroke-width:0.40000001px;stroke-opacity:1;fill-opacity:1"
               x="0"
               y="19"
               dy="0">22</text>
          </g>
          <path
             id="path137-8"
             style="font-size:13.33329964px;line-height:19.04759979px;fill:none;stroke:#000000;stroke-width:0.40000001px;stroke-opacity:1"
             d="m 0,6 0,-6 812,0 0,6"
             class="domain"
             inkscape:connector-curvature="0" />
        </g>
        <g
           id="g139-7"
           style="font-size:13.33329964px;line-height:19.04759979px;fill:none;stroke:#000000;stroke-width:0.40000001px;stroke-opacity:1"
           class="y vis-axis">
          <g
             id="g141-3"
             style="font-size:13.33329964px;line-height:19.04759979px;fill:none;stroke:#000000;stroke-width:0.40000001px;stroke-opacity:1"
             transform="translate(0,46.5)"
             class="tick">
            <text
               sodipodi:linespacing="125%"
               id="text145-0"
               style="font-style:normal;font-variant:normal;font-weight:normal;font-stretch:normal;font-size:12.5px;line-height:125%;font-family:sans-serif;-inkscape-font-specification:'sans-serif, Normal';text-align:end;writing-mode:lr-tb;text-anchor:end;white-space:nowrap;display:block;fill:#000000;stroke:#000000;stroke-width:0.40000001px;fill-opacity:1;stroke-opacity:1"
               y="4"
               x="-3"
               dy="0">0</text>
          </g>
          <g
             id="g147-3"
             style="font-size:13.33329964px;line-height:19.04759979px;fill:none;stroke:#000000;stroke-width:0.40000001px;stroke-opacity:1"
             transform="translate(0,38.8)"
             class="tick" />
          <g
             id="g153-5"
             style="font-size:13.33329964px;line-height:19.04759979px;fill:none;stroke:#000000;stroke-width:0.40000001px;stroke-opacity:1"
             transform="translate(0,31.1)"
             class="tick" />
          <g
             id="g159-1"
             style="font-size:13.33329964px;line-height:19.04759979px;fill:none;stroke:#000000;stroke-width:0.40000001px;stroke-opacity:1"
             transform="translate(0,23.4)"
             class="tick" />
          <g
             id="g165-0"
             style="font-size:13.33329964px;line-height:19.04759979px;fill:none;stroke:#000000;stroke-width:0.40000001px;stroke-opacity:1"
             transform="translate(0,15.7)"
             class="tick" />
          <g
             id="g171-6"
             style="font-size:13.33329964px;line-height:19.04759979px;fill:none;stroke:#000000;stroke-width:0.40000001px;stroke-opacity:1"
             transform="translate(0,8)"
             class="tick">
            <line
               id="line173-6"
               style="font-size:13.33329964px;line-height:19.04759979px;fill:none;stroke:#000000;stroke-width:0.40000001px;stroke-opacity:1"
               y2="0"
               x2="812"
               x1="0"
               y1="0" />
            <text
               sodipodi:linespacing="125%"
               id="text175-2"
               style="font-style:normal;font-variant:normal;font-weight:normal;font-stretch:normal;font-size:12.5px;line-height:125%;font-family:sans-serif;-inkscape-font-specification:'sans-serif, Normal';text-align:end;writing-mode:lr-tb;text-anchor:end;white-space:nowrap;display:block;fill:#000000;stroke:#000000;stroke-width:0.40000001px;fill-opacity:1;stroke-opacity:1"
               y="4"
               x="-3"
               dy="0">10</text>
          </g>
          <path
             id="path177-6"
             style="font-size:13.33329964px;line-height:19.04759979px;fill:none;stroke:#000000;stroke-width:0.40000001px;stroke-opacity:1"
             d="m 0,8 0,0 0,38.5 0,0"
             class="domain"
             inkscape:connector-curvature="0" />
        </g>
      </g>
    </g>
    <g
       transform="translate(-1151.3571,352.82651)"
       style="font-size:13.33329964px;line-height:19.04759979px;fill:#ffffff"
       id="g61-1">
      <g
         class="x vis-axis"
         transform="translate(0,51.5)"
         style="font-size:13.33329964px;line-height:19.04759979px;fill:none;stroke:#666666;stroke-width:0.40000001px"
         id="g63-7">
        <g
           class="tick"
           style="font-size:13.33329964px;line-height:19.04759979px;fill:none;stroke:#666666;stroke-width:0.40000001px"
           id="g65-6" />
      </g>
    </g>
    <g
       id="g4893"
       transform="translate(-11.0817,-113.43729)">
      <g
         transform="translate(-31.3389,-224.75517)"
         id="g5938">
        <g
           transform="translate(-1120.0182,566.23073)"
           clip-path="url(#clip-4)"
           style="font-size:13.33329964px;line-height:19.04759979px;fill:#ffffff"
           id="g11-5">
          <path
             inkscape:connector-curvature="0"
             class="vis-line"
             d="m 0,46.5 c 6.1515152,0 24.606061,0 36.909091,0 12.30303,0 24.606061,0 36.909091,0 12.30303,0 24.60606,0 36.909088,0 12.30303,0 24.60606,0 36.90909,0 12.30303,0 24.60606,0 36.90909,0 12.30303,0 24.60607,0 36.9091,0 12.30303,0 24.60606,0 36.90909,0 12.30303,0 24.60606,0 36.90909,0 12.30303,0 24.60606,0 36.90909,0 12.30303,0 24.60606,0 36.90909,0 C 381.39394,46.5 393.69697,8 406,8 c 12.30303,0 24.60606,38.5 36.90909,38.5 12.30303,0 24.60606,0 36.90909,0 12.30303,0 24.60606,0 36.90909,0 12.30303,0 24.60606,0 36.90909,0 12.30303,0 24.60606,0 36.90909,0 12.30303,0 24.60607,0 36.9091,0 12.30303,0 24.60606,0 36.90909,0 12.30303,0 24.60606,0 36.90909,0 12.30303,0 24.60606,0 36.90909,0 12.30303,0 24.60606,0 36.90909,0 12.30303,0 30.75757,0 36.90909,0"
             style="font-size:13.33329964px;line-height:19.04759979px;fill:none;stroke:#000000;stroke-opacity:1"
             id="path13-9" />
          <circle
             class="vis-marks"
             cx="812"
             cy="46.5"
             r="4"
             style="font-size:13.33329964px;line-height:19.04759979px;opacity:0.9;fill:#3b4cc0;fill-opacity:1;stroke:#333333;stroke-opacity:0.8"
             id="circle15-3" />
          <circle
             class="vis-marks"
             cx="0"
             cy="46.5"
             r="4"
             style="font-size:13.33329964px;line-height:19.04759979px;opacity:0.9;fill:#3b4cc0;fill-opacity:1;stroke:#333333;stroke-opacity:0.8"
             id="circle17-16" />
          <circle
             class="vis-marks"
             cx="442.90909"
             cy="46.5"
             r="4"
             style="font-size:13.33329964px;line-height:19.04759979px;opacity:0.9;fill:#3b4cc0;fill-opacity:1;stroke:#333333;stroke-opacity:0.8"
             id="circle19-9" />
          <circle
             class="vis-marks"
             cx="73.818184"
             cy="46.5"
             r="4"
             style="font-size:13.33329964px;line-height:19.04759979px;opacity:0.9;fill:#3b4cc0;fill-opacity:1;stroke:#333333;stroke-opacity:0.8"
             id="circle21-05" />
          <circle
             class="vis-marks"
             cx="479.81818"
             cy="46.5"
             r="4"
             style="font-size:13.33329964px;line-height:19.04759979px;opacity:0.9;fill:#3b4cc0;fill-opacity:1;stroke:#333333;stroke-opacity:0.8"
             id="circle23-5" />
          <circle
             class="vis-marks"
             cx="147.63637"
             cy="46.5"
             r="4"
             style="font-size:13.33329964px;line-height:19.04759979px;opacity:0.9;fill:#3b4cc0;fill-opacity:1;stroke:#333333;stroke-opacity:0.8"
             id="circle25-7" />
          <circle
             class="vis-marks"
             cx="516.72729"
             cy="46.5"
             r="4"
             style="font-size:13.33329964px;line-height:19.04759979px;opacity:0.9;fill:#3b4cc0;fill-opacity:1;stroke:#333333;stroke-opacity:0.8"
             id="circle27-9" />
          <circle
             class="vis-marks"
             cx="221.45454"
             cy="46.5"
             r="4"
             style="font-size:13.33329964px;line-height:19.04759979px;opacity:0.9;fill:#3b4cc0;fill-opacity:1;stroke:#333333;stroke-opacity:0.8"
             id="circle29-4" />
          <circle
             class="vis-marks"
             cx="553.63635"
             cy="46.5"
             r="4"
             style="font-size:13.33329964px;line-height:19.04759979px;opacity:0.9;fill:#3b4cc0;fill-opacity:1;stroke:#333333;stroke-opacity:0.8"
             id="circle31-6" />
          <circle
             class="vis-marks"
             cx="295.27274"
             cy="46.5"
             r="4"
             style="font-size:13.33329964px;line-height:19.04759979px;opacity:0.9;fill:#3b4cc0;fill-opacity:1;stroke:#333333;stroke-opacity:0.8"
             id="circle33-8" />
          <circle
             class="vis-marks"
             cx="590.54547"
             cy="46.5"
             r="4"
             style="font-size:13.33329964px;line-height:19.04759979px;opacity:0.9;fill:#3b4cc0;fill-opacity:1;stroke:#333333;stroke-opacity:0.8"
             id="circle35-4" />
          <circle
             class="vis-marks"
             cx="369.09091"
             cy="46.5"
             r="4"
             style="font-size:13.33329964px;line-height:19.04759979px;opacity:0.9;fill:#3b4cc0;fill-opacity:1;stroke:#333333;stroke-opacity:0.8"
             id="circle37-9" />
          <circle
             class="vis-marks"
             cx="627.45453"
             cy="46.5"
             r="4"
             style="font-size:13.33329964px;line-height:19.04759979px;opacity:0.9;fill:#3b4cc0;fill-opacity:1;stroke:#333333;stroke-opacity:0.8"
             id="circle39-3" />
          <circle
             class="vis-marks"
             cx="110.72727"
             cy="46.5"
             r="4"
             style="font-size:13.33329964px;line-height:19.04759979px;opacity:0.9;fill:#3b4cc0;fill-opacity:1;stroke:#333333;stroke-opacity:0.8"
             id="circle41-6" />
          <circle
             class="vis-marks"
             cx="775.09088"
             cy="46.5"
             r="4"
             style="font-size:13.33329964px;line-height:19.04759979px;opacity:0.9;fill:#3b4cc0;fill-opacity:1;stroke:#333333;stroke-opacity:0.8"
             id="circle43-3" />
          <circle
             class="vis-marks"
             cx="738.18182"
             cy="46.5"
             r="4"
             style="font-size:13.33329964px;line-height:19.04759979px;opacity:0.9;fill:#3b4cc0;fill-opacity:1;stroke:#333333;stroke-opacity:0.8"
             id="circle45-5" />
          <circle
             class="vis-marks"
             cx="701.27271"
             cy="46.5"
             r="4"
             style="font-size:13.33329964px;line-height:19.04759979px;opacity:0.9;fill:#3b4cc0;fill-opacity:1;stroke:#333333;stroke-opacity:0.8"
             id="circle47-6" />
          <circle
             class="vis-marks"
             cx="664.36365"
             cy="46.5"
             r="4"
             style="font-size:13.33329964px;line-height:19.04759979px;opacity:0.9;fill:#3b4cc0;fill-opacity:1;stroke:#333333;stroke-opacity:0.8"
             id="circle49-8" />
          <circle
             class="vis-marks"
             cx="184.54546"
             cy="46.5"
             r="4"
             style="font-size:13.33329964px;line-height:19.04759979px;opacity:0.9;fill:#3b4cc0;fill-opacity:1;stroke:#333333;stroke-opacity:0.8"
             id="circle51-9" />
          <circle
             class="vis-marks"
             cx="36.909092"
             cy="46.5"
             r="4"
             style="font-size:13.33329964px;line-height:19.04759979px;opacity:0.9;fill:#3b4cc0;fill-opacity:1;stroke:#333333;stroke-opacity:0.8"
             id="circle53-0" />
          <circle
             class="vis-marks"
             cx="332.18182"
             cy="46.5"
             r="4"
             style="font-size:13.33329964px;line-height:19.04759979px;opacity:0.9;fill:#3b4cc0;fill-opacity:1;stroke:#333333;stroke-opacity:0.8"
             id="circle55-3" />
          <circle
             class="vis-marks"
             cx="258.36365"
             cy="46.5"
             r="4"
             style="font-size:13.33329964px;line-height:19.04759979px;opacity:0.9;fill:#3b4cc0;fill-opacity:1;stroke:#333333;stroke-opacity:0.8"
             id="circle57-1" />
          <circle
             class="vis-marks"
             cx="406"
             cy="8"
             r="4"
             style="font-size:13.33329964px;line-height:19.04759979px;opacity:0.9;fill:#3b4cc0;fill-opacity:1;stroke:#333333;stroke-opacity:0.8"
             id="circle59-5" />
        </g>
        <g
           transform="translate(-1120.0182,566.23073)"
           style="font-size:13.33329964px;line-height:19.04759979px;fill:#ffffff"
           id="g61-3">
          <g
             class="x vis-axis"
             transform="translate(0,46.500415)"
             style="font-size:13.33329964px;line-height:19.04759979px;fill:none;stroke:#000000;stroke-width:0.40000001px;stroke-opacity:1"
             id="g63-96">
            <g
               class="tick"
               style="font-size:13.33329964px;line-height:19.04759979px;fill:none;stroke:#000000;stroke-width:0.40000001px;stroke-opacity:1"
               id="g65-31">
              <line
                 y1="0"
                 x1="0"
                 y2="6"
                 x2="0"
                 style="font-size:13.33329964px;line-height:19.04759979px;fill:none;stroke:#000000;stroke-width:0.40000001px;stroke-opacity:1"
                 id="line67-5" />
              <text
                 dy="0"
                 y="19"
                 x="0"
                 style="font-style:normal;font-variant:normal;font-weight:normal;font-stretch:normal;font-size:12.5px;line-height:125%;font-family:sans-serif;-inkscape-font-specification:'sans-serif, Normal';text-align:center;writing-mode:lr-tb;text-anchor:middle;white-space:nowrap;display:block;fill:#000000;stroke:#000000;stroke-width:0.40000001px;fill-opacity:1;stroke-opacity:1"
                 id="text69-3"
                 sodipodi:linespacing="125%">0</text>
            </g>
            <g
               class="tick"
               transform="translate(73.818182,0)"
               style="font-size:13.33329964px;line-height:19.04759979px;fill:none;stroke:#000000;stroke-width:0.40000001px;stroke-opacity:1"
               id="g71-3">
              <line
                 y1="0"
                 x1="0"
                 y2="6"
                 x2="0"
                 style="font-size:13.33329964px;line-height:19.04759979px;fill:none;stroke:#000000;stroke-width:0.40000001px;stroke-opacity:1"
                 id="line73-9" />
              <text
                 dy="0"
                 y="19"
                 x="0"
                 style="font-style:normal;font-variant:normal;font-weight:normal;font-stretch:normal;font-size:12.5px;line-height:125%;font-family:sans-serif;-inkscape-font-specification:'sans-serif, Normal';text-align:center;writing-mode:lr-tb;text-anchor:middle;white-space:nowrap;display:block;fill:#000000;stroke:#000000;stroke-width:0.40000001px;stroke-opacity:1;fill-opacity:1"
                 id="text75-1"
                 sodipodi:linespacing="125%">2</text>
            </g>
            <g
               class="tick"
               transform="translate(147.63636,0)"
               style="font-size:13.33329964px;line-height:19.04759979px;fill:none;stroke:#000000;stroke-width:0.40000001px;stroke-opacity:1"
               id="g77-0">
              <line
                 y1="0"
                 x1="0"
                 y2="6"
                 x2="0"
                 style="font-size:13.33329964px;line-height:19.04759979px;fill:none;stroke:#000000;stroke-width:0.40000001px;stroke-opacity:1"
                 id="line79-7" />
              <text
                 dy="0"
                 y="19"
                 x="0"
                 style="font-style:normal;font-variant:normal;font-weight:normal;font-stretch:normal;font-size:12.5px;line-height:125%;font-family:sans-serif;-inkscape-font-specification:'sans-serif, Normal';text-align:center;writing-mode:lr-tb;text-anchor:middle;white-space:nowrap;display:block;fill:#000000;stroke:#000000;stroke-width:0.40000001px;stroke-opacity:1;fill-opacity:1"
                 id="text81-5"
                 sodipodi:linespacing="125%">4</text>
            </g>
            <g
               class="tick"
               transform="translate(221.45455,0)"
               style="font-size:13.33329964px;line-height:19.04759979px;fill:none;stroke:#000000;stroke-width:0.40000001px;stroke-opacity:1"
               id="g83-6">
              <line
                 y1="0"
                 x1="0"
                 y2="6"
                 x2="0"
                 style="font-size:13.33329964px;line-height:19.04759979px;fill:none;stroke:#000000;stroke-width:0.40000001px;stroke-opacity:1"
                 id="line85-9" />
              <text
                 dy="0"
                 y="19"
                 x="0"
                 style="font-style:normal;font-variant:normal;font-weight:normal;font-stretch:normal;font-size:12.5px;line-height:125%;font-family:sans-serif;-inkscape-font-specification:'sans-serif, Normal';text-align:center;writing-mode:lr-tb;text-anchor:middle;white-space:nowrap;display:block;fill:#000000;stroke:#000000;stroke-width:0.40000001px;stroke-opacity:1;fill-opacity:1"
                 id="text87-0"
                 sodipodi:linespacing="125%">6</text>
            </g>
            <g
               class="tick"
               transform="translate(295.27273,0)"
               style="font-size:13.33329964px;line-height:19.04759979px;fill:none;stroke:#000000;stroke-width:0.40000001px;stroke-opacity:1"
               id="g89-58">
              <line
                 y1="0"
                 x1="0"
                 y2="6"
                 x2="0"
                 style="font-size:13.33329964px;line-height:19.04759979px;fill:none;stroke:#000000;stroke-width:0.40000001px;stroke-opacity:1"
                 id="line91-7" />
              <text
                 dy="0"
                 y="19"
                 x="0"
                 style="font-style:normal;font-variant:normal;font-weight:normal;font-stretch:normal;font-size:12.5px;line-height:125%;font-family:sans-serif;-inkscape-font-specification:'sans-serif, Normal';text-align:center;writing-mode:lr-tb;text-anchor:middle;white-space:nowrap;display:block;fill:#000000;stroke:#000000;stroke-width:0.40000001px;stroke-opacity:1;fill-opacity:1"
                 id="text93-30"
                 sodipodi:linespacing="125%">8</text>
            </g>
            <g
               class="tick"
               transform="translate(369.09091,0)"
               style="font-size:13.33329964px;line-height:19.04759979px;fill:none;stroke:#000000;stroke-width:0.40000001px;stroke-opacity:1"
               id="g95-7">
              <line
                 y1="0"
                 x1="0"
                 y2="6"
                 x2="0"
                 style="font-size:13.33329964px;line-height:19.04759979px;fill:none;stroke:#000000;stroke-width:0.40000001px;stroke-opacity:1"
                 id="line97-6" />
              <text
                 dy="0"
                 y="19"
                 x="0"
                 style="font-style:normal;font-variant:normal;font-weight:normal;font-stretch:normal;font-size:12.5px;line-height:125%;font-family:sans-serif;-inkscape-font-specification:'sans-serif, Normal';text-align:center;writing-mode:lr-tb;text-anchor:middle;white-space:nowrap;display:block;fill:#000000;stroke:#000000;stroke-width:0.40000001px;stroke-opacity:1;fill-opacity:1"
                 id="text99-7"
                 sodipodi:linespacing="125%">10</text>
            </g>
            <g
               class="tick"
               transform="translate(442.90909,0)"
               style="font-size:13.33329964px;line-height:19.04759979px;fill:none;stroke:#000000;stroke-width:0.40000001px;stroke-opacity:1"
               id="g101-97">
              <line
                 y1="0"
                 x1="0"
                 y2="6"
                 x2="0"
                 style="font-size:13.33329964px;line-height:19.04759979px;fill:none;stroke:#000000;stroke-width:0.40000001px;stroke-opacity:1"
                 id="line103-6" />
              <text
                 dy="0"
                 y="19"
                 x="0"
                 style="font-style:normal;font-variant:normal;font-weight:normal;font-stretch:normal;font-size:12.5px;line-height:125%;font-family:sans-serif;-inkscape-font-specification:'sans-serif, Normal';text-align:center;writing-mode:lr-tb;text-anchor:middle;white-space:nowrap;display:block;fill:#000000;stroke:#000000;stroke-width:0.40000001px;stroke-opacity:1;fill-opacity:1"
                 id="text105-70"
                 sodipodi:linespacing="125%">12</text>
            </g>
            <g
               class="tick"
               transform="translate(516.72727,0)"
               style="font-size:13.33329964px;line-height:19.04759979px;fill:none;stroke:#000000;stroke-width:0.40000001px;stroke-opacity:1"
               id="g107-0">
              <line
                 y1="0"
                 x1="0"
                 y2="6"
                 x2="0"
                 style="font-size:13.33329964px;line-height:19.04759979px;fill:none;stroke:#000000;stroke-width:0.40000001px;stroke-opacity:1"
                 id="line109-26" />
              <text
                 dy="0"
                 y="19"
                 x="0"
                 style="font-style:normal;font-variant:normal;font-weight:normal;font-stretch:normal;font-size:12.5px;line-height:125%;font-family:sans-serif;-inkscape-font-specification:'sans-serif, Normal';text-align:center;writing-mode:lr-tb;text-anchor:middle;white-space:nowrap;display:block;fill:#000000;stroke:#000000;stroke-width:0.40000001px;stroke-opacity:1;fill-opacity:1"
                 id="text111-5"
                 sodipodi:linespacing="125%">14</text>
            </g>
            <g
               class="tick"
               transform="translate(590.54545,0)"
               style="font-size:13.33329964px;line-height:19.04759979px;fill:none;stroke:#000000;stroke-width:0.40000001px;stroke-opacity:1"
               id="g113-3">
              <line
                 y1="0"
                 x1="0"
                 y2="6"
                 x2="0"
                 style="font-size:13.33329964px;line-height:19.04759979px;fill:none;stroke:#000000;stroke-width:0.40000001px;stroke-opacity:1"
                 id="line115-6" />
              <text
                 dy="0"
                 y="19"
                 x="0"
                 style="font-style:normal;font-variant:normal;font-weight:normal;font-stretch:normal;font-size:12.5px;line-height:125%;font-family:sans-serif;-inkscape-font-specification:'sans-serif, Normal';text-align:center;writing-mode:lr-tb;text-anchor:middle;white-space:nowrap;display:block;fill:#000000;stroke:#000000;stroke-width:0.40000001px;stroke-opacity:1;fill-opacity:1"
                 id="text117-4"
                 sodipodi:linespacing="125%">16</text>
            </g>
            <g
               class="tick"
               transform="translate(664.36364,0)"
               style="font-size:13.33329964px;line-height:19.04759979px;fill:none;stroke:#000000;stroke-width:0.40000001px;stroke-opacity:1"
               id="g119-6">
              <line
                 y1="0"
                 x1="0"
                 y2="6"
                 x2="0"
                 style="font-size:13.33329964px;line-height:19.04759979px;fill:none;stroke:#000000;stroke-width:0.40000001px;stroke-opacity:1"
                 id="line121-4" />
              <text
                 dy="0"
                 y="19"
                 x="0"
                 style="font-style:normal;font-variant:normal;font-weight:normal;font-stretch:normal;font-size:12.5px;line-height:125%;font-family:sans-serif;-inkscape-font-specification:'sans-serif, Normal';text-align:center;writing-mode:lr-tb;text-anchor:middle;white-space:nowrap;display:block;fill:#000000;stroke:#000000;stroke-width:0.40000001px;stroke-opacity:1;fill-opacity:1"
                 id="text123-2"
                 sodipodi:linespacing="125%">18</text>
            </g>
            <g
               class="tick"
               transform="translate(738.18182,0)"
               style="font-size:13.33329964px;line-height:19.04759979px;fill:none;stroke:#000000;stroke-width:0.40000001px;stroke-opacity:1"
               id="g125-3">
              <line
                 y1="0"
                 x1="0"
                 y2="6"
                 x2="0"
                 style="font-size:13.33329964px;line-height:19.04759979px;fill:none;stroke:#000000;stroke-width:0.40000001px;stroke-opacity:1"
                 id="line127-7" />
              <text
                 dy="0"
                 y="19"
                 x="0"
                 style="font-style:normal;font-variant:normal;font-weight:normal;font-stretch:normal;font-size:12.5px;line-height:125%;font-family:sans-serif;-inkscape-font-specification:'sans-serif, Normal';text-align:center;writing-mode:lr-tb;text-anchor:middle;white-space:nowrap;display:block;fill:#000000;stroke:#000000;stroke-width:0.40000001px;stroke-opacity:1;fill-opacity:1"
                 id="text129-1"
                 sodipodi:linespacing="125%">20</text>
            </g>
            <g
               class="tick"
               transform="translate(812,0)"
               style="font-size:13.33329964px;line-height:19.04759979px;fill:none;stroke:#000000;stroke-width:0.40000001px;stroke-opacity:1"
               id="g131-6">
              <line
                 y1="0"
                 x1="0"
                 y2="6"
                 x2="0"
                 style="font-size:13.33329964px;line-height:19.04759979px;fill:none;stroke:#000000;stroke-width:0.40000001px;stroke-opacity:1"
                 id="line133-7" />
              <text
                 dy="0"
                 y="19"
                 x="0"
                 style="font-style:normal;font-variant:normal;font-weight:normal;font-stretch:normal;font-size:12.5px;line-height:125%;font-family:sans-serif;-inkscape-font-specification:'sans-serif, Normal';text-align:center;writing-mode:lr-tb;text-anchor:middle;white-space:nowrap;display:block;fill:#000000;stroke:#000000;stroke-width:0.40000001px;stroke-opacity:1;fill-opacity:1"
                 id="text135-64"
                 sodipodi:linespacing="125%">22</text>
            </g>
            <path
               inkscape:connector-curvature="0"
               class="domain"
               d="m 0,6 0,-6 812,0 0,6"
               style="font-size:13.33329964px;line-height:19.04759979px;fill:none;stroke:#000000;stroke-width:0.40000001px;stroke-opacity:1"
               id="path137-5" />
          </g>
          <g
             class="y vis-axis"
             style="font-size:13.33329964px;line-height:19.04759979px;fill:none;stroke:#000000;stroke-width:0.40000001px;stroke-opacity:1"
             id="g139-1">
            <g
               class="tick"
               transform="translate(0,46.5)"
               style="font-size:13.33329964px;line-height:19.04759979px;fill:none;stroke:#000000;stroke-width:0.40000001px;stroke-opacity:1"
               id="g141-1">
              <text
                 dy="0"
                 x="-3"
                 y="4"
                 style="font-style:normal;font-variant:normal;font-weight:normal;font-stretch:normal;font-size:12.5px;line-height:125%;font-family:sans-serif;-inkscape-font-specification:'sans-serif, Normal';text-align:end;writing-mode:lr-tb;text-anchor:end;white-space:nowrap;display:block;fill:#000000;stroke:#000000;stroke-width:0.40000001px;fill-opacity:1;stroke-opacity:1"
                 id="text145-2"
                 sodipodi:linespacing="125%">0</text>
            </g>
            <g
               class="tick"
               transform="translate(0,38.8)"
               style="font-size:13.33329964px;line-height:19.04759979px;fill:none;stroke:#000000;stroke-width:0.40000001px;stroke-opacity:1"
               id="g147-32" />
            <g
               class="tick"
               transform="translate(0,31.1)"
               style="font-size:13.33329964px;line-height:19.04759979px;fill:none;stroke:#000000;stroke-width:0.40000001px;stroke-opacity:1"
               id="g153-8" />
            <g
               class="tick"
               transform="translate(0,23.4)"
               style="font-size:13.33329964px;line-height:19.04759979px;fill:none;stroke:#000000;stroke-width:0.40000001px;stroke-opacity:1"
               id="g159-4" />
            <g
               class="tick"
               transform="translate(0,15.7)"
               style="font-size:13.33329964px;line-height:19.04759979px;fill:none;stroke:#000000;stroke-width:0.40000001px;stroke-opacity:1"
               id="g165-8" />
            <g
               class="tick"
               transform="translate(0,8)"
               style="font-size:13.33329964px;line-height:19.04759979px;fill:none;stroke:#000000;stroke-width:0.40000001px;stroke-opacity:1"
               id="g171-7">
              <line
                 y1="0"
                 x1="0"
                 x2="812"
                 y2="0"
                 style="font-size:13.33329964px;line-height:19.04759979px;fill:none;stroke:#000000;stroke-width:0.40000001px;stroke-opacity:1"
                 id="line173-3" />
              <text
                 dy="0"
                 x="-3"
                 y="4"
                 style="font-style:normal;font-variant:normal;font-weight:normal;font-stretch:normal;font-size:12.5px;line-height:125%;font-family:sans-serif;-inkscape-font-specification:'sans-serif, Normal';text-align:end;writing-mode:lr-tb;text-anchor:end;white-space:nowrap;display:block;fill:#000000;stroke:#000000;stroke-width:0.40000001px;fill-opacity:1;stroke-opacity:1"
                 id="text175-6"
                 sodipodi:linespacing="125%">10</text>
            </g>
            <path
               inkscape:connector-curvature="0"
               class="domain"
               d="m 0,8 0,0 0,38.5 0,0"
               style="font-size:13.33329964px;line-height:19.04759979px;fill:none;stroke:#000000;stroke-width:0.40000001px;stroke-opacity:1"
               id="path177-3" />
          </g>
        </g>
      </g>
    </g>
    <text
       xml:space="preserve"
       style="font-style:normal;font-variant:normal;font-weight:normal;font-stretch:normal;font-size:25px;line-height:125%;font-family:'Times New Roman';-inkscape-font-specification:'Times New Roman, Normal';text-align:center;letter-spacing:0px;word-spacing:0px;writing-mode:lr-tb;text-anchor:middle;fill:#000000;fill-opacity:1;stroke:none;stroke-width:1px;stroke-linecap:butt;stroke-linejoin:miter;stroke-opacity:1"
       x="-1197.2086"
       y="73.665848"
       id="text4388"
       sodipodi:linespacing="125%"><tspan
         sodipodi:role="line"
         id="tspan4390"
         x="-1197.2086"
         y="73.665848">f<tspan
   style="font-size:64.99999762%;baseline-shift:sub"
   id="tspan4395">1</tspan></tspan></text>
    <text
       xml:space="preserve"
       style="font-style:normal;font-variant:normal;font-weight:normal;font-stretch:normal;font-size:25px;line-height:125%;font-family:'Times New Roman';-inkscape-font-specification:'Times New Roman, Normal';text-align:center;letter-spacing:0px;word-spacing:0px;writing-mode:lr-tb;text-anchor:middle;fill:#000000;fill-opacity:1;stroke:none;stroke-width:1px;stroke-linecap:butt;stroke-linejoin:miter;stroke-opacity:1"
       x="-1198.2157"
       y="172.04472"
       id="text4392"
       sodipodi:linespacing="125%"><tspan
         sodipodi:role="line"
         id="tspan4394"
         x="-1198.2157"
         y="172.04472">f<tspan
   style="font-size:64.99999762%;baseline-shift:sub"
   id="tspan4397">2</tspan></tspan></text>
    <text
       xml:space="preserve"
       style="font-style:normal;font-variant:normal;font-weight:normal;font-stretch:normal;font-size:25px;line-height:125%;font-family:'Times New Roman';-inkscape-font-specification:'Times New Roman, Normal';text-align:center;letter-spacing:0px;word-spacing:0px;writing-mode:lr-tb;text-anchor:middle;fill:#000000;fill-opacity:1;stroke:none;stroke-width:1px;stroke-linecap:butt;stroke-linejoin:miter;stroke-opacity:1"
       x="-1197.6969"
       y="268.3284"
       id="text4396"
       sodipodi:linespacing="125%"><tspan
         sodipodi:role="line"
         id="tspan4398"
         x="-1197.6969"
         y="268.3284">f<tspan
   style="font-size:64.99999762%;baseline-shift:sub"
   id="tspan4399">3</tspan></tspan></text>
  </g>
</svg>
