<?xml version="1.0" encoding="UTF-8" standalone="no"?>
<!-- Created with Inkscape (http://www.inkscape.org/) -->

<svg
   xmlns:dc="http://purl.org/dc/elements/1.1/"
   xmlns:cc="http://creativecommons.org/ns#"
   xmlns:rdf="http://www.w3.org/1999/02/22-rdf-syntax-ns#"
   xmlns:svg="http://www.w3.org/2000/svg"
   xmlns="http://www.w3.org/2000/svg"
   xmlns:sodipodi="http://sodipodi.sourceforge.net/DTD/sodipodi-0.dtd"
   xmlns:inkscape="http://www.inkscape.org/namespaces/inkscape"
   width="210mm"
   height="297mm"
   viewBox="0 0 744.09448819 1052.3622047"
   id="svg2"
   version="1.1"
   inkscape:version="0.91 r13725"
   sodipodi:docname="comet_graph_nodes.svg">
  <defs
     id="defs4">
    <clipPath
       id="clipPath4152"
       clipPathUnits="userSpaceOnUse">
      <path
         inkscape:connector-curvature="0"
         id="path4154"
         d="m 0,0 576,0 0,430.2 -576,0 L 0,0 Z" />
    </clipPath>
    <clipPath
       id="clipPath4240"
       clipPathUnits="userSpaceOnUse">
      <path
         inkscape:connector-curvature="0"
         id="path4242"
         d="m 0,0 576,0 0,430.2 -576,0 L 0,0 Z" />
    </clipPath>
    <clipPath
       id="clipPath4250"
       clipPathUnits="userSpaceOnUse">
      <path
         inkscape:connector-curvature="0"
         id="path4252"
         d="m -2.8386128,-2.8386128 5.6772256,0 0,5.6772256 -5.6772256,0 0,-5.6772256 z" />
    </clipPath>
    <clipPath
       id="clipPath4262"
       clipPathUnits="userSpaceOnUse">
      <path
         inkscape:connector-curvature="0"
         id="path4264"
         d="m -2.8386128,-2.8386128 5.6772256,0 0,5.6772256 -5.6772256,0 0,-5.6772256 z" />
    </clipPath>
    <clipPath
       id="clipPath4274"
       clipPathUnits="userSpaceOnUse">
      <path
         inkscape:connector-curvature="0"
         id="path4276"
         d="m -2.8386128,-2.8386128 5.6772256,0 0,5.6772256 -5.6772256,0 0,-5.6772256 z" />
    </clipPath>
    <clipPath
       id="clipPath4286"
       clipPathUnits="userSpaceOnUse">
      <path
         inkscape:connector-curvature="0"
         id="path4288"
         d="m -2.8386128,-2.8386128 5.6772256,0 0,5.6772256 -5.6772256,0 0,-5.6772256 z" />
    </clipPath>
    <clipPath
       id="clipPath4298"
       clipPathUnits="userSpaceOnUse">
      <path
         inkscape:connector-curvature="0"
         id="path4300"
         d="m -2.8386128,-2.8386128 5.6772256,0 0,5.6772256 -5.6772256,0 0,-5.6772256 z" />
    </clipPath>
    <clipPath
       id="clipPath4310"
       clipPathUnits="userSpaceOnUse">
      <path
         inkscape:connector-curvature="0"
         id="path4312"
         d="m -2.8386128,-2.8386128 5.6772256,0 0,5.6772256 -5.6772256,0 0,-5.6772256 z" />
    </clipPath>
    <clipPath
       id="clipPath4322"
       clipPathUnits="userSpaceOnUse">
      <path
         inkscape:connector-curvature="0"
         id="path4324"
         d="m -2.8386128,-2.8386128 5.6772256,0 0,5.6772256 -5.6772256,0 0,-5.6772256 z" />
    </clipPath>
    <clipPath
       id="clipPath4334"
       clipPathUnits="userSpaceOnUse">
      <path
         inkscape:connector-curvature="0"
         id="path4336"
         d="m -2.8386128,-2.8386128 5.6772256,0 0,5.6772256 -5.6772256,0 0,-5.6772256 z" />
    </clipPath>
    <clipPath
       id="clipPath4346"
       clipPathUnits="userSpaceOnUse">
      <path
         inkscape:connector-curvature="0"
         id="path4348"
         d="m -2.8386128,-2.8386128 5.6772256,0 0,5.6772256 -5.6772256,0 0,-5.6772256 z" />
    </clipPath>
    <clipPath
       id="clipPath4358"
       clipPathUnits="userSpaceOnUse">
      <path
         inkscape:connector-curvature="0"
         id="path4360"
         d="m -2.8386128,-2.8386128 5.6772256,0 0,5.6772256 -5.6772256,0 0,-5.6772256 z" />
    </clipPath>
    <clipPath
       id="clipPath4370"
       clipPathUnits="userSpaceOnUse">
      <path
         inkscape:connector-curvature="0"
         id="path4372"
         d="m -2.8386128,-2.8386128 5.6772256,0 0,5.6772256 -5.6772256,0 0,-5.6772256 z" />
    </clipPath>
    <clipPath
       id="clipPath4382"
       clipPathUnits="userSpaceOnUse">
      <path
         inkscape:connector-curvature="0"
         id="path4384"
         d="m -2.8386128,-2.8386128 5.6772256,0 0,5.6772256 -5.6772256,0 0,-5.6772256 z" />
    </clipPath>
    <clipPath
       id="clipPath4394"
       clipPathUnits="userSpaceOnUse">
      <path
         inkscape:connector-curvature="0"
         id="path4396"
         d="m -2.8386128,-2.8386128 5.6772256,0 0,5.6772256 -5.6772256,0 0,-5.6772256 z" />
    </clipPath>
    <clipPath
       id="clipPath4406"
       clipPathUnits="userSpaceOnUse">
      <path
         inkscape:connector-curvature="0"
         id="path4408"
         d="m -2.8386128,-2.8386128 5.6772256,0 0,5.6772256 -5.6772256,0 0,-5.6772256 z" />
    </clipPath>
    <clipPath
       id="clipPath4418"
       clipPathUnits="userSpaceOnUse">
      <path
         inkscape:connector-curvature="0"
         id="path4420"
         d="m -2.8386128,-2.8386128 5.6772256,0 0,5.6772256 -5.6772256,0 0,-5.6772256 z" />
    </clipPath>
    <clipPath
       id="clipPath4430"
       clipPathUnits="userSpaceOnUse">
      <path
         inkscape:connector-curvature="0"
         id="path4432"
         d="m -2.8386128,-2.8386128 5.6772256,0 0,5.6772256 -5.6772256,0 0,-5.6772256 z" />
    </clipPath>
    <clipPath
       id="clipPath4442"
       clipPathUnits="userSpaceOnUse">
      <path
         inkscape:connector-curvature="0"
         id="path4444"
         d="m -2.8386128,-2.8386128 5.6772256,0 0,5.6772256 -5.6772256,0 0,-5.6772256 z" />
    </clipPath>
    <clipPath
       id="clipPath4454"
       clipPathUnits="userSpaceOnUse">
      <path
         inkscape:connector-curvature="0"
         id="path4456"
         d="m -2.8386128,-2.8386128 5.6772256,0 0,5.6772256 -5.6772256,0 0,-5.6772256 z" />
    </clipPath>
    <clipPath
       id="clipPath4466"
       clipPathUnits="userSpaceOnUse">
      <path
         inkscape:connector-curvature="0"
         id="path4468"
         d="m -2.8386128,-2.8386128 5.6772256,0 0,5.6772256 -5.6772256,0 0,-5.6772256 z" />
    </clipPath>
    <clipPath
       id="clipPath4478"
       clipPathUnits="userSpaceOnUse">
      <path
         inkscape:connector-curvature="0"
         id="path4480"
         d="m -2.8386128,-2.8386128 5.6772256,0 0,5.6772256 -5.6772256,0 0,-5.6772256 z" />
    </clipPath>
    <clipPath
       id="clipPath4490"
       clipPathUnits="userSpaceOnUse">
      <path
         inkscape:connector-curvature="0"
         id="path4492"
         d="m -2.8386128,-2.8386128 5.6772256,0 0,5.6772256 -5.6772256,0 0,-5.6772256 z" />
    </clipPath>
    <clipPath
       id="clipPath4502"
       clipPathUnits="userSpaceOnUse">
      <path
         inkscape:connector-curvature="0"
         id="path4504"
         d="m -2.8386128,-2.8386128 5.6772256,0 0,5.6772256 -5.6772256,0 0,-5.6772256 z" />
    </clipPath>
    <clipPath
       id="clipPath4514"
       clipPathUnits="userSpaceOnUse">
      <path
         inkscape:connector-curvature="0"
         id="path4516"
         d="m -2.8386128,-2.8386128 5.6772256,0 0,5.6772256 -5.6772256,0 0,-5.6772256 z" />
    </clipPath>
    <clipPath
       id="clipPath4526"
       clipPathUnits="userSpaceOnUse">
      <path
         inkscape:connector-curvature="0"
         id="path4528"
         d="m -2.8386128,-2.8386128 5.6772256,0 0,5.6772256 -5.6772256,0 0,-5.6772256 z" />
    </clipPath>
    <clipPath
       id="clipPath4538"
       clipPathUnits="userSpaceOnUse">
      <path
         inkscape:connector-curvature="0"
         id="path4540"
         d="m -2.8386128,-2.8386128 5.6772256,0 0,5.6772256 -5.6772256,0 0,-5.6772256 z" />
    </clipPath>
    <clipPath
       id="clipPath4550"
       clipPathUnits="userSpaceOnUse">
      <path
         inkscape:connector-curvature="0"
         id="path4552"
         d="m -2.8386128,-2.8386128 5.6772256,0 0,5.6772256 -5.6772256,0 0,-5.6772256 z" />
    </clipPath>
    <clipPath
       id="clipPath4562"
       clipPathUnits="userSpaceOnUse">
      <path
         inkscape:connector-curvature="0"
         id="path4564"
         d="m -2.8386128,-2.8386128 5.6772256,0 0,5.6772256 -5.6772256,0 0,-5.6772256 z" />
    </clipPath>
    <clipPath
       id="clipPath4574"
       clipPathUnits="userSpaceOnUse">
      <path
         inkscape:connector-curvature="0"
         id="path4576"
         d="m -2.8386128,-2.8386128 5.6772256,0 0,5.6772256 -5.6772256,0 0,-5.6772256 z" />
    </clipPath>
    <clipPath
       id="clipPath4586"
       clipPathUnits="userSpaceOnUse">
      <path
         inkscape:connector-curvature="0"
         id="path4588"
         d="m -2.8386128,-2.8386128 5.6772256,0 0,5.6772256 -5.6772256,0 0,-5.6772256 z" />
    </clipPath>
    <clipPath
       id="clipPath4598"
       clipPathUnits="userSpaceOnUse">
      <path
         inkscape:connector-curvature="0"
         id="path4600"
         d="m -2.8386128,-2.8386128 5.6772256,0 0,5.6772256 -5.6772256,0 0,-5.6772256 z" />
    </clipPath>
    <clipPath
       id="clipPath4610"
       clipPathUnits="userSpaceOnUse">
      <path
         inkscape:connector-curvature="0"
         id="path4612"
         d="m -2.8386128,-2.8386128 5.6772256,0 0,5.6772256 -5.6772256,0 0,-5.6772256 z" />
    </clipPath>
    <clipPath
       id="clipPath4622"
       clipPathUnits="userSpaceOnUse">
      <path
         inkscape:connector-curvature="0"
         id="path4624"
         d="m -2.8386128,-2.8386128 5.6772256,0 0,5.6772256 -5.6772256,0 0,-5.6772256 z" />
    </clipPath>
    <clipPath
       id="clipPath4634"
       clipPathUnits="userSpaceOnUse">
      <path
         inkscape:connector-curvature="0"
         id="path4636"
         d="m -2.8386128,-2.8386128 5.6772256,0 0,5.6772256 -5.6772256,0 0,-5.6772256 z" />
    </clipPath>
    <clipPath
       id="clipPath4646"
       clipPathUnits="userSpaceOnUse">
      <path
         inkscape:connector-curvature="0"
         id="path4648"
         d="m -2.8386128,-2.8386128 5.6772256,0 0,5.6772256 -5.6772256,0 0,-5.6772256 z" />
    </clipPath>
    <clipPath
       id="clipPath4658"
       clipPathUnits="userSpaceOnUse">
      <path
         inkscape:connector-curvature="0"
         id="path4660"
         d="m -2.8386128,-2.8386128 5.6772256,0 0,5.6772256 -5.6772256,0 0,-5.6772256 z" />
    </clipPath>
    <clipPath
       id="clipPath4670"
       clipPathUnits="userSpaceOnUse">
      <path
         inkscape:connector-curvature="0"
         id="path4672"
         d="m -2.8386128,-2.8386128 5.6772256,0 0,5.6772256 -5.6772256,0 0,-5.6772256 z" />
    </clipPath>
    <clipPath
       id="clipPath4682"
       clipPathUnits="userSpaceOnUse">
      <path
         inkscape:connector-curvature="0"
         id="path4684"
         d="m -2.8386128,-2.8386128 5.6772256,0 0,5.6772256 -5.6772256,0 0,-5.6772256 z" />
    </clipPath>
    <clipPath
       id="clipPath4694"
       clipPathUnits="userSpaceOnUse">
      <path
         inkscape:connector-curvature="0"
         id="path4696"
         d="m -2.8386128,-2.8386128 5.6772256,0 0,5.6772256 -5.6772256,0 0,-5.6772256 z" />
    </clipPath>
    <clipPath
       id="clipPath4706"
       clipPathUnits="userSpaceOnUse">
      <path
         inkscape:connector-curvature="0"
         id="path4708"
         d="m -2.8386128,-2.8386128 5.6772256,0 0,5.6772256 -5.6772256,0 0,-5.6772256 z" />
    </clipPath>
    <clipPath
       id="clipPath4718"
       clipPathUnits="userSpaceOnUse">
      <path
         inkscape:connector-curvature="0"
         id="path4720"
         d="m -2.8386128,-2.8386128 5.6772256,0 0,5.6772256 -5.6772256,0 0,-5.6772256 z" />
    </clipPath>
    <clipPath
       id="clipPath4438"
       clipPathUnits="userSpaceOnUse">
      <path
         inkscape:connector-curvature="0"
         id="path4440"
         d="m 0,0 576,0 0,430.2 -576,0 L 0,0 Z" />
    </clipPath>
    <clipPath
       id="clipPath4526-5"
       clipPathUnits="userSpaceOnUse">
      <path
         inkscape:connector-curvature="0"
         id="path4528-0"
         d="m 0,0 576,0 0,430.2 -576,0 L 0,0 Z" />
    </clipPath>
    <clipPath
       id="clipPath4536"
       clipPathUnits="userSpaceOnUse">
      <path
         inkscape:connector-curvature="0"
         id="path4538"
         d="m -2.8386128,-2.8386128 5.6772256,0 0,5.6772256 -5.6772256,0 0,-5.6772256 z" />
    </clipPath>
    <clipPath
       id="clipPath4548"
       clipPathUnits="userSpaceOnUse">
      <path
         inkscape:connector-curvature="0"
         id="path4550"
         d="m -2.8386128,-2.8386128 5.6772256,0 0,5.6772256 -5.6772256,0 0,-5.6772256 z" />
    </clipPath>
    <clipPath
       id="clipPath4560"
       clipPathUnits="userSpaceOnUse">
      <path
         inkscape:connector-curvature="0"
         id="path4562"
         d="m -2.8386128,-2.8386128 5.6772256,0 0,5.6772256 -5.6772256,0 0,-5.6772256 z" />
    </clipPath>
    <clipPath
       id="clipPath4572"
       clipPathUnits="userSpaceOnUse">
      <path
         inkscape:connector-curvature="0"
         id="path4574"
         d="m -2.8386128,-2.8386128 5.6772256,0 0,5.6772256 -5.6772256,0 0,-5.6772256 z" />
    </clipPath>
    <clipPath
       id="clipPath4584"
       clipPathUnits="userSpaceOnUse">
      <path
         inkscape:connector-curvature="0"
         id="path4586"
         d="m -2.8386128,-2.8386128 5.6772256,0 0,5.6772256 -5.6772256,0 0,-5.6772256 z" />
    </clipPath>
    <clipPath
       id="clipPath4596"
       clipPathUnits="userSpaceOnUse">
      <path
         inkscape:connector-curvature="0"
         id="path4598"
         d="m -2.8386128,-2.8386128 5.6772256,0 0,5.6772256 -5.6772256,0 0,-5.6772256 z" />
    </clipPath>
    <clipPath
       id="clipPath4608"
       clipPathUnits="userSpaceOnUse">
      <path
         inkscape:connector-curvature="0"
         id="path4610"
         d="m -2.8386128,-2.8386128 5.6772256,0 0,5.6772256 -5.6772256,0 0,-5.6772256 z" />
    </clipPath>
    <clipPath
       id="clipPath4620"
       clipPathUnits="userSpaceOnUse">
      <path
         inkscape:connector-curvature="0"
         id="path4622"
         d="m -2.8386128,-2.8386128 5.6772256,0 0,5.6772256 -5.6772256,0 0,-5.6772256 z" />
    </clipPath>
    <clipPath
       id="clipPath4632"
       clipPathUnits="userSpaceOnUse">
      <path
         inkscape:connector-curvature="0"
         id="path4634"
         d="m -2.8386128,-2.8386128 5.6772256,0 0,5.6772256 -5.6772256,0 0,-5.6772256 z" />
    </clipPath>
    <clipPath
       id="clipPath4644"
       clipPathUnits="userSpaceOnUse">
      <path
         inkscape:connector-curvature="0"
         id="path4646"
         d="m -2.8386128,-2.8386128 5.6772256,0 0,5.6772256 -5.6772256,0 0,-5.6772256 z" />
    </clipPath>
    <clipPath
       id="clipPath4656"
       clipPathUnits="userSpaceOnUse">
      <path
         inkscape:connector-curvature="0"
         id="path4658"
         d="m -2.8386128,-2.8386128 5.6772256,0 0,5.6772256 -5.6772256,0 0,-5.6772256 z" />
    </clipPath>
    <clipPath
       id="clipPath4668"
       clipPathUnits="userSpaceOnUse">
      <path
         inkscape:connector-curvature="0"
         id="path4670"
         d="m -2.8386128,-2.8386128 5.6772256,0 0,5.6772256 -5.6772256,0 0,-5.6772256 z" />
    </clipPath>
    <clipPath
       id="clipPath4680"
       clipPathUnits="userSpaceOnUse">
      <path
         inkscape:connector-curvature="0"
         id="path4682"
         d="m -2.8386128,-2.8386128 5.6772256,0 0,5.6772256 -5.6772256,0 0,-5.6772256 z" />
    </clipPath>
    <clipPath
       id="clipPath4692"
       clipPathUnits="userSpaceOnUse">
      <path
         inkscape:connector-curvature="0"
         id="path4694"
         d="m -2.8386128,-2.8386128 5.6772256,0 0,5.6772256 -5.6772256,0 0,-5.6772256 z" />
    </clipPath>
    <clipPath
       id="clipPath4704"
       clipPathUnits="userSpaceOnUse">
      <path
         inkscape:connector-curvature="0"
         id="path4706"
         d="m -2.8386128,-2.8386128 5.6772256,0 0,5.6772256 -5.6772256,0 0,-5.6772256 z" />
    </clipPath>
    <clipPath
       id="clipPath4716"
       clipPathUnits="userSpaceOnUse">
      <path
         inkscape:connector-curvature="0"
         id="path4718"
         d="m -2.8386128,-2.8386128 5.6772256,0 0,5.6772256 -5.6772256,0 0,-5.6772256 z" />
    </clipPath>
    <clipPath
       id="clipPath4728"
       clipPathUnits="userSpaceOnUse">
      <path
         inkscape:connector-curvature="0"
         id="path4730"
         d="m -2.8386128,-2.8386128 5.6772256,0 0,5.6772256 -5.6772256,0 0,-5.6772256 z" />
    </clipPath>
    <clipPath
       id="clipPath4740"
       clipPathUnits="userSpaceOnUse">
      <path
         inkscape:connector-curvature="0"
         id="path4742"
         d="m -2.8386128,-2.8386128 5.6772256,0 0,5.6772256 -5.6772256,0 0,-5.6772256 z" />
    </clipPath>
    <clipPath
       id="clipPath4752"
       clipPathUnits="userSpaceOnUse">
      <path
         inkscape:connector-curvature="0"
         id="path4754"
         d="m -2.8386128,-2.8386128 5.6772256,0 0,5.6772256 -5.6772256,0 0,-5.6772256 z" />
    </clipPath>
    <clipPath
       id="clipPath4764"
       clipPathUnits="userSpaceOnUse">
      <path
         inkscape:connector-curvature="0"
         id="path4766"
         d="m -2.8386128,-2.8386128 5.6772256,0 0,5.6772256 -5.6772256,0 0,-5.6772256 z" />
    </clipPath>
    <clipPath
       id="clipPath4776"
       clipPathUnits="userSpaceOnUse">
      <path
         inkscape:connector-curvature="0"
         id="path4778"
         d="m -2.8386128,-2.8386128 5.6772256,0 0,5.6772256 -5.6772256,0 0,-5.6772256 z" />
    </clipPath>
    <clipPath
       id="clipPath4788"
       clipPathUnits="userSpaceOnUse">
      <path
         inkscape:connector-curvature="0"
         id="path4790"
         d="m -2.8386128,-2.8386128 5.6772256,0 0,5.6772256 -5.6772256,0 0,-5.6772256 z" />
    </clipPath>
    <clipPath
       id="clipPath4800"
       clipPathUnits="userSpaceOnUse">
      <path
         inkscape:connector-curvature="0"
         id="path4802"
         d="m -2.8386128,-2.8386128 5.6772256,0 0,5.6772256 -5.6772256,0 0,-5.6772256 z" />
    </clipPath>
    <clipPath
       id="clipPath4812"
       clipPathUnits="userSpaceOnUse">
      <path
         inkscape:connector-curvature="0"
         id="path4814"
         d="m -2.8386128,-2.8386128 5.6772256,0 0,5.6772256 -5.6772256,0 0,-5.6772256 z" />
    </clipPath>
    <clipPath
       id="clipPath4824"
       clipPathUnits="userSpaceOnUse">
      <path
         inkscape:connector-curvature="0"
         id="path4826"
         d="m -2.8386128,-2.8386128 5.6772256,0 0,5.6772256 -5.6772256,0 0,-5.6772256 z" />
    </clipPath>
    <clipPath
       id="clipPath4836"
       clipPathUnits="userSpaceOnUse">
      <path
         inkscape:connector-curvature="0"
         id="path4838"
         d="m -2.8386128,-2.8386128 5.6772256,0 0,5.6772256 -5.6772256,0 0,-5.6772256 z" />
    </clipPath>
    <clipPath
       id="clipPath4848"
       clipPathUnits="userSpaceOnUse">
      <path
         inkscape:connector-curvature="0"
         id="path4850"
         d="m -2.8386128,-2.8386128 5.6772256,0 0,5.6772256 -5.6772256,0 0,-5.6772256 z" />
    </clipPath>
    <clipPath
       id="clipPath4860"
       clipPathUnits="userSpaceOnUse">
      <path
         inkscape:connector-curvature="0"
         id="path4862"
         d="m -2.8386128,-2.8386128 5.6772256,0 0,5.6772256 -5.6772256,0 0,-5.6772256 z" />
    </clipPath>
    <clipPath
       id="clipPath4872"
       clipPathUnits="userSpaceOnUse">
      <path
         inkscape:connector-curvature="0"
         id="path4874"
         d="m -2.8386128,-2.8386128 5.6772256,0 0,5.6772256 -5.6772256,0 0,-5.6772256 z" />
    </clipPath>
    <clipPath
       id="clipPath4884"
       clipPathUnits="userSpaceOnUse">
      <path
         inkscape:connector-curvature="0"
         id="path4886"
         d="m -2.8386128,-2.8386128 5.6772256,0 0,5.6772256 -5.6772256,0 0,-5.6772256 z" />
    </clipPath>
    <clipPath
       id="clipPath4896"
       clipPathUnits="userSpaceOnUse">
      <path
         inkscape:connector-curvature="0"
         id="path4898"
         d="m -2.8386128,-2.8386128 5.6772256,0 0,5.6772256 -5.6772256,0 0,-5.6772256 z" />
    </clipPath>
    <clipPath
       id="clipPath4908"
       clipPathUnits="userSpaceOnUse">
      <path
         inkscape:connector-curvature="0"
         id="path4910"
         d="m -2.8386128,-2.8386128 5.6772256,0 0,5.6772256 -5.6772256,0 0,-5.6772256 z" />
    </clipPath>
    <clipPath
       id="clipPath4920"
       clipPathUnits="userSpaceOnUse">
      <path
         inkscape:connector-curvature="0"
         id="path4922"
         d="m -2.8386128,-2.8386128 5.6772256,0 0,5.6772256 -5.6772256,0 0,-5.6772256 z" />
    </clipPath>
    <clipPath
       id="clipPath4932"
       clipPathUnits="userSpaceOnUse">
      <path
         inkscape:connector-curvature="0"
         id="path4934"
         d="m -2.8386128,-2.8386128 5.6772256,0 0,5.6772256 -5.6772256,0 0,-5.6772256 z" />
    </clipPath>
    <clipPath
       id="clipPath4944"
       clipPathUnits="userSpaceOnUse">
      <path
         inkscape:connector-curvature="0"
         id="path4946"
         d="m -2.8386128,-2.8386128 5.6772256,0 0,5.6772256 -5.6772256,0 0,-5.6772256 z" />
    </clipPath>
    <clipPath
       id="clipPath4956"
       clipPathUnits="userSpaceOnUse">
      <path
         inkscape:connector-curvature="0"
         id="path4958"
         d="m -2.8386128,-2.8386128 5.6772256,0 0,5.6772256 -5.6772256,0 0,-5.6772256 z" />
    </clipPath>
    <clipPath
       id="clipPath4968"
       clipPathUnits="userSpaceOnUse">
      <path
         inkscape:connector-curvature="0"
         id="path4970"
         d="m -2.8386128,-2.8386128 5.6772256,0 0,5.6772256 -5.6772256,0 0,-5.6772256 z" />
    </clipPath>
    <clipPath
       id="clipPath4980"
       clipPathUnits="userSpaceOnUse">
      <path
         inkscape:connector-curvature="0"
         id="path4982"
         d="m -2.8386128,-2.8386128 5.6772256,0 0,5.6772256 -5.6772256,0 0,-5.6772256 z" />
    </clipPath>
    <clipPath
       id="clipPath4992"
       clipPathUnits="userSpaceOnUse">
      <path
         inkscape:connector-curvature="0"
         id="path4994"
         d="m -2.8386128,-2.8386128 5.6772256,0 0,5.6772256 -5.6772256,0 0,-5.6772256 z" />
    </clipPath>
    <clipPath
       id="clipPath5004"
       clipPathUnits="userSpaceOnUse">
      <path
         inkscape:connector-curvature="0"
         id="path5006"
         d="m -2.8386128,-2.8386128 5.6772256,0 0,5.6772256 -5.6772256,0 0,-5.6772256 z" />
    </clipPath>
    <clipPath
       id="clipPath4524"
       clipPathUnits="userSpaceOnUse">
      <path
         inkscape:connector-curvature="0"
         id="path4526"
         d="m 0,0 576,0 0,430.2 -576,0 L 0,0 Z" />
    </clipPath>
    <clipPath
       id="clipPath4562-6"
       clipPathUnits="userSpaceOnUse">
      <path
         inkscape:connector-curvature="0"
         id="path4564-7"
         d="m 0,0 576,0 0,430.2 -576,0 L 0,0 Z" />
    </clipPath>
    <clipPath
       id="clipPath4572-5"
       clipPathUnits="userSpaceOnUse">
      <path
         inkscape:connector-curvature="0"
         id="path4574-2"
         d="m -3.3122777,-3.3122777 6.6245554,0 0,6.6245554 -6.6245554,0 0,-6.6245554 z" />
    </clipPath>
    <clipPath
       id="clipPath4584-5"
       clipPathUnits="userSpaceOnUse">
      <path
         inkscape:connector-curvature="0"
         id="path4586-9"
         d="m -3.3122777,-3.3122777 6.6245554,0 0,6.6245554 -6.6245554,0 0,-6.6245554 z" />
    </clipPath>
    <clipPath
       id="clipPath4596-0"
       clipPathUnits="userSpaceOnUse">
      <path
         inkscape:connector-curvature="0"
         id="path4598-3"
         d="m -3.3122777,-3.3122777 6.6245554,0 0,6.6245554 -6.6245554,0 0,-6.6245554 z" />
    </clipPath>
    <clipPath
       id="clipPath4608-6"
       clipPathUnits="userSpaceOnUse">
      <path
         inkscape:connector-curvature="0"
         id="path4610-3"
         d="m -3.3122777,-3.3122777 6.6245554,0 0,6.6245554 -6.6245554,0 0,-6.6245554 z" />
    </clipPath>
    <clipPath
       id="clipPath4620-4"
       clipPathUnits="userSpaceOnUse">
      <path
         inkscape:connector-curvature="0"
         id="path4622-9"
         d="m -3.3122777,-3.3122777 6.6245554,0 0,6.6245554 -6.6245554,0 0,-6.6245554 z" />
    </clipPath>
    <clipPath
       id="clipPath4632-9"
       clipPathUnits="userSpaceOnUse">
      <path
         inkscape:connector-curvature="0"
         id="path4634-8"
         d="m -3.3122777,-3.3122777 6.6245554,0 0,6.6245554 -6.6245554,0 0,-6.6245554 z" />
    </clipPath>
    <clipPath
       id="clipPath4644-8"
       clipPathUnits="userSpaceOnUse">
      <path
         inkscape:connector-curvature="0"
         id="path4646-8"
         d="m -3.3122777,-3.3122777 6.6245554,0 0,6.6245554 -6.6245554,0 0,-6.6245554 z" />
    </clipPath>
    <clipPath
       id="clipPath4656-4"
       clipPathUnits="userSpaceOnUse">
      <path
         inkscape:connector-curvature="0"
         id="path4658-6"
         d="m -3.3122777,-3.3122777 6.6245554,0 0,6.6245554 -6.6245554,0 0,-6.6245554 z" />
    </clipPath>
    <clipPath
       id="clipPath4668-1"
       clipPathUnits="userSpaceOnUse">
      <path
         inkscape:connector-curvature="0"
         id="path4670-6"
         d="m -3.3122777,-3.3122777 6.6245554,0 0,6.6245554 -6.6245554,0 0,-6.6245554 z" />
    </clipPath>
    <clipPath
       id="clipPath4680-0"
       clipPathUnits="userSpaceOnUse">
      <path
         inkscape:connector-curvature="0"
         id="path4682-5"
         d="m -3.3122777,-3.3122777 6.6245554,0 0,6.6245554 -6.6245554,0 0,-6.6245554 z" />
    </clipPath>
    <clipPath
       id="clipPath4692-7"
       clipPathUnits="userSpaceOnUse">
      <path
         inkscape:connector-curvature="0"
         id="path4694-5"
         d="m -3.3122777,-3.3122777 6.6245554,0 0,6.6245554 -6.6245554,0 0,-6.6245554 z" />
    </clipPath>
    <clipPath
       id="clipPath4704-7"
       clipPathUnits="userSpaceOnUse">
      <path
         inkscape:connector-curvature="0"
         id="path4706-3"
         d="m -3.3122777,-3.3122777 6.6245554,0 0,6.6245554 -6.6245554,0 0,-6.6245554 z" />
    </clipPath>
    <clipPath
       id="clipPath4716-7"
       clipPathUnits="userSpaceOnUse">
      <path
         inkscape:connector-curvature="0"
         id="path4718-5"
         d="m -3.3122777,-3.3122777 6.6245554,0 0,6.6245554 -6.6245554,0 0,-6.6245554 z" />
    </clipPath>
    <clipPath
       id="clipPath4728-8"
       clipPathUnits="userSpaceOnUse">
      <path
         inkscape:connector-curvature="0"
         id="path4730-5"
         d="m -3.3122777,-3.3122777 6.6245554,0 0,6.6245554 -6.6245554,0 0,-6.6245554 z" />
    </clipPath>
    <clipPath
       id="clipPath4740-2"
       clipPathUnits="userSpaceOnUse">
      <path
         inkscape:connector-curvature="0"
         id="path4742-5"
         d="m -3.3122777,-3.3122777 6.6245554,0 0,6.6245554 -6.6245554,0 0,-6.6245554 z" />
    </clipPath>
    <clipPath
       id="clipPath4434"
       clipPathUnits="userSpaceOnUse">
      <path
         inkscape:connector-curvature="0"
         id="path4436"
         d="m 0,0 576,0 0,430.2 -576,0 L 0,0 Z" />
    </clipPath>
    <clipPath
       id="clipPath4472"
       clipPathUnits="userSpaceOnUse">
      <path
         inkscape:connector-curvature="0"
         id="path4474"
         d="m 0,0 576,0 0,430.2 -576,0 L 0,0 Z" />
    </clipPath>
    <clipPath
       id="clipPath4482"
       clipPathUnits="userSpaceOnUse">
      <path
         inkscape:connector-curvature="0"
         id="path4484"
         d="m -5.15,-5.15 10.3,0 0,10.3 -10.3,0 0,-10.3 z" />
    </clipPath>
    <clipPath
       id="clipPath4494"
       clipPathUnits="userSpaceOnUse">
      <path
         inkscape:connector-curvature="0"
         id="path4496"
         d="m -5.15,-5.15 10.3,0 0,10.3 -10.3,0 0,-10.3 z" />
    </clipPath>
    <clipPath
       id="clipPath4506"
       clipPathUnits="userSpaceOnUse">
      <path
         inkscape:connector-curvature="0"
         id="path4508"
         d="m -5.15,-5.15 10.3,0 0,10.3 -10.3,0 0,-10.3 z" />
    </clipPath>
    <clipPath
       id="clipPath4518"
       clipPathUnits="userSpaceOnUse">
      <path
         inkscape:connector-curvature="0"
         id="path4520"
         d="m -5.15,-5.15 10.3,0 0,10.3 -10.3,0 0,-10.3 z" />
    </clipPath>
    <clipPath
       id="clipPath4530"
       clipPathUnits="userSpaceOnUse">
      <path
         inkscape:connector-curvature="0"
         id="path4532"
         d="m -5.15,-5.15 10.3,0 0,10.3 -10.3,0 0,-10.3 z" />
    </clipPath>
    <clipPath
       id="clipPath4542"
       clipPathUnits="userSpaceOnUse">
      <path
         inkscape:connector-curvature="0"
         id="path4544"
         d="m -5.15,-5.15 10.3,0 0,10.3 -10.3,0 0,-10.3 z" />
    </clipPath>
    <clipPath
       id="clipPath4554"
       clipPathUnits="userSpaceOnUse">
      <path
         inkscape:connector-curvature="0"
         id="path4556"
         d="m -5.15,-5.15 10.3,0 0,10.3 -10.3,0 0,-10.3 z" />
    </clipPath>
    <clipPath
       id="clipPath4566"
       clipPathUnits="userSpaceOnUse">
      <path
         inkscape:connector-curvature="0"
         id="path4568"
         d="m -5.15,-5.15 10.3,0 0,10.3 -10.3,0 0,-10.3 z" />
    </clipPath>
    <clipPath
       id="clipPath4578"
       clipPathUnits="userSpaceOnUse">
      <path
         inkscape:connector-curvature="0"
         id="path4580"
         d="m -5.15,-5.15 10.3,0 0,10.3 -10.3,0 0,-10.3 z" />
    </clipPath>
    <clipPath
       id="clipPath4590"
       clipPathUnits="userSpaceOnUse">
      <path
         inkscape:connector-curvature="0"
         id="path4592"
         d="m -5.15,-5.15 10.3,0 0,10.3 -10.3,0 0,-10.3 z" />
    </clipPath>
    <clipPath
       id="clipPath4602"
       clipPathUnits="userSpaceOnUse">
      <path
         inkscape:connector-curvature="0"
         id="path4604"
         d="m -5.15,-5.15 10.3,0 0,10.3 -10.3,0 0,-10.3 z" />
    </clipPath>
    <clipPath
       id="clipPath4614"
       clipPathUnits="userSpaceOnUse">
      <path
         inkscape:connector-curvature="0"
         id="path4616"
         d="m -5.15,-5.15 10.3,0 0,10.3 -10.3,0 0,-10.3 z" />
    </clipPath>
    <clipPath
       id="clipPath4626"
       clipPathUnits="userSpaceOnUse">
      <path
         inkscape:connector-curvature="0"
         id="path4628"
         d="m -5.15,-5.15 10.3,0 0,10.3 -10.3,0 0,-10.3 z" />
    </clipPath>
    <clipPath
       id="clipPath4638"
       clipPathUnits="userSpaceOnUse">
      <path
         inkscape:connector-curvature="0"
         id="path4640"
         d="m -5.15,-5.15 10.3,0 0,10.3 -10.3,0 0,-10.3 z" />
    </clipPath>
    <clipPath
       id="clipPath4650"
       clipPathUnits="userSpaceOnUse">
      <path
         inkscape:connector-curvature="0"
         id="path4652"
         d="m -5.15,-5.15 10.3,0 0,10.3 -10.3,0 0,-10.3 z" />
    </clipPath>
    <clipPath
       id="clipPath4470"
       clipPathUnits="userSpaceOnUse">
      <path
         inkscape:connector-curvature="0"
         id="path4472"
         d="m 72,43.02 446.4,0 0,344.16 -446.4,0 0,-344.16 z" />
    </clipPath>
    <clipPath
       id="clipPath4480"
       clipPathUnits="userSpaceOnUse">
      <path
         inkscape:connector-curvature="0"
         id="path4482"
         d="m -3.75,-3.75 7.5,0 0,7.5 -7.5,0 0,-7.5 z" />
    </clipPath>
    <clipPath
       id="clipPath4492"
       clipPathUnits="userSpaceOnUse">
      <path
         inkscape:connector-curvature="0"
         id="path4494"
         d="m -3.75,-3.75 7.5,0 0,7.5 -7.5,0 0,-7.5 z" />
    </clipPath>
    <clipPath
       id="clipPath4504"
       clipPathUnits="userSpaceOnUse">
      <path
         inkscape:connector-curvature="0"
         id="path4506"
         d="m -3.75,-3.75 7.5,0 0,7.5 -7.5,0 0,-7.5 z" />
    </clipPath>
    <clipPath
       id="clipPath4516"
       clipPathUnits="userSpaceOnUse">
      <path
         inkscape:connector-curvature="0"
         id="path4518"
         d="m -3.75,-3.75 7.5,0 0,7.5 -7.5,0 0,-7.5 z" />
    </clipPath>
    <clipPath
       id="clipPath4528"
       clipPathUnits="userSpaceOnUse">
      <path
         inkscape:connector-curvature="0"
         id="path4530"
         d="m -3.75,-3.75 7.5,0 0,7.5 -7.5,0 0,-7.5 z" />
    </clipPath>
    <clipPath
       id="clipPath4540"
       clipPathUnits="userSpaceOnUse">
      <path
         inkscape:connector-curvature="0"
         id="path4542"
         d="m -3.75,-3.75 7.5,0 0,7.5 -7.5,0 0,-7.5 z" />
    </clipPath>
    <clipPath
       id="clipPath4552"
       clipPathUnits="userSpaceOnUse">
      <path
         inkscape:connector-curvature="0"
         id="path4554"
         d="m -3.75,-3.75 7.5,0 0,7.5 -7.5,0 0,-7.5 z" />
    </clipPath>
    <clipPath
       id="clipPath4564"
       clipPathUnits="userSpaceOnUse">
      <path
         inkscape:connector-curvature="0"
         id="path4566"
         d="m -3.75,-3.75 7.5,0 0,7.5 -7.5,0 0,-7.5 z" />
    </clipPath>
    <clipPath
       id="clipPath4576"
       clipPathUnits="userSpaceOnUse">
      <path
         inkscape:connector-curvature="0"
         id="path4578"
         d="m -3.75,-3.75 7.5,0 0,7.5 -7.5,0 0,-7.5 z" />
    </clipPath>
    <clipPath
       id="clipPath4588"
       clipPathUnits="userSpaceOnUse">
      <path
         inkscape:connector-curvature="0"
         id="path4590"
         d="m -3.75,-3.75 7.5,0 0,7.5 -7.5,0 0,-7.5 z" />
    </clipPath>
    <clipPath
       id="clipPath4600"
       clipPathUnits="userSpaceOnUse">
      <path
         inkscape:connector-curvature="0"
         id="path4602"
         d="m -3.75,-3.75 7.5,0 0,7.5 -7.5,0 0,-7.5 z" />
    </clipPath>
    <clipPath
       id="clipPath4612"
       clipPathUnits="userSpaceOnUse">
      <path
         inkscape:connector-curvature="0"
         id="path4614"
         d="m -3.75,-3.75 7.5,0 0,7.5 -7.5,0 0,-7.5 z" />
    </clipPath>
    <clipPath
       id="clipPath4624"
       clipPathUnits="userSpaceOnUse">
      <path
         inkscape:connector-curvature="0"
         id="path4626"
         d="m -3.75,-3.75 7.5,0 0,7.5 -7.5,0 0,-7.5 z" />
    </clipPath>
    <clipPath
       id="clipPath4636"
       clipPathUnits="userSpaceOnUse">
      <path
         inkscape:connector-curvature="0"
         id="path4638"
         d="m -3.75,-3.75 7.5,0 0,7.5 -7.5,0 0,-7.5 z" />
    </clipPath>
    <clipPath
       id="clipPath4648"
       clipPathUnits="userSpaceOnUse">
      <path
         inkscape:connector-curvature="0"
         id="path4650"
         d="m -3.75,-3.75 7.5,0 0,7.5 -7.5,0 0,-7.5 z" />
    </clipPath>
    <clipPath
       id="clipPath4728-5"
       clipPathUnits="userSpaceOnUse">
      <path
         inkscape:connector-curvature="0"
         id="path4730-0"
         d="m -184,-236 1472,0 0,1165 -1472,0 0,-1165 z" />
    </clipPath>
    <clipPath
       id="clipPath4750"
       clipPathUnits="userSpaceOnUse">
      <path
         inkscape:connector-curvature="0"
         id="path4752"
         d="m -184,-236 1472,0 0,1165 -1472,0 0,-1165 z" />
    </clipPath>
  </defs>
  <sodipodi:namedview
     id="base"
     pagecolor="#ffffff"
     bordercolor="#666666"
     borderopacity="1.0"
     inkscape:pageopacity="0.0"
     inkscape:pageshadow="2"
     inkscape:zoom="1.3410818"
     inkscape:cx="-757.09941"
     inkscape:cy="91.230395"
     inkscape:document-units="px"
     inkscape:current-layer="g4426"
     showgrid="false"
     inkscape:window-width="1366"
     inkscape:window-height="705"
     inkscape:window-x="-8"
     inkscape:window-y="-8"
     inkscape:window-maximized="1" />
  <metadata
     id="metadata7">
    <rdf:RDF>
      <cc:Work
         rdf:about="">
        <dc:format>image/svg+xml</dc:format>
        <dc:type
           rdf:resource="http://purl.org/dc/dcmitype/StillImage" />
        <dc:title></dc:title>
      </cc:Work>
    </rdf:RDF>
  </metadata>
  <g
     inkscape:label="Camada 1"
     inkscape:groupmode="layer"
     id="layer1">
    <g
       transform="matrix(1.25,0,0,-1.25,-874.28571,921.2372)"
       inkscape:label="comet_graph_nodes"
       id="g4144">
      <g
         transform="translate(-102.36505,-38.417226)"
         inkscape:label="comet_graph_nodes"
         id="g4430">
        <g
           transform="translate(-91.885914,-173.42572)"
           inkscape:label="figure_1"
           id="g4426">
          <g
             id="g4771">
            <g
               id="g4430-1">
              <g
                 id="g4432"
                 clip-path="url(#clipPath4434)">
                <path
                   d="m 144,215.1 58.24922,42.1442"
                   style="fill:none;stroke:#000000;stroke-width:1.5;stroke-linecap:butt;stroke-linejoin:round;stroke-miterlimit:10;stroke-dasharray:none;stroke-opacity:1"
                   id="path4438"
                   inkscape:connector-curvature="0" />
                <path
                   d="m 144,215.1 22.24922,68.19075"
                   style="fill:none;stroke:#000000;stroke-width:1.5;stroke-linecap:butt;stroke-linejoin:round;stroke-miterlimit:10;stroke-dasharray:none;stroke-opacity:1"
                   id="path4440-5"
                   inkscape:connector-curvature="0" />
                <path
                   d="m 144,215.1 -22.24922,68.19075"
                   style="fill:none;stroke:#000000;stroke-width:1.5;stroke-linecap:butt;stroke-linejoin:round;stroke-miterlimit:10;stroke-dasharray:none;stroke-opacity:1"
                   id="path4442"
                   inkscape:connector-curvature="0" />
                <path
                   d="M 144,215.1 85.750776,257.2442"
                   style="fill:none;stroke:#000000;stroke-width:1.5;stroke-linecap:butt;stroke-linejoin:round;stroke-miterlimit:10;stroke-dasharray:none;stroke-opacity:1"
                   id="path4444-0"
                   inkscape:connector-curvature="0" />
                <path
                   d="m 144,215.1 -72,0"
                   style="fill:none;stroke:#000000;stroke-width:1.5;stroke-linecap:butt;stroke-linejoin:round;stroke-miterlimit:10;stroke-dasharray:none;stroke-opacity:1"
                   id="path4446"
                   inkscape:connector-curvature="0" />
                <path
                   d="M 144,215.1 85.750776,172.9558"
                   style="fill:none;stroke:#000000;stroke-width:1.5;stroke-linecap:butt;stroke-linejoin:round;stroke-miterlimit:10;stroke-dasharray:none;stroke-opacity:1"
                   id="path4448"
                   inkscape:connector-curvature="0" />
                <path
                   d="M 144,215.1 121.75078,146.90925"
                   style="fill:none;stroke:#000000;stroke-width:1.5;stroke-linecap:butt;stroke-linejoin:round;stroke-miterlimit:10;stroke-dasharray:none;stroke-opacity:1"
                   id="path4450"
                   inkscape:connector-curvature="0" />
                <path
                   d="m 144,215.1 22.24922,-68.19075"
                   style="fill:none;stroke:#000000;stroke-width:1.5;stroke-linecap:butt;stroke-linejoin:round;stroke-miterlimit:10;stroke-dasharray:none;stroke-opacity:1"
                   id="path4452"
                   inkscape:connector-curvature="0" />
                <path
                   d="m 144,215.1 58.24922,-42.1442"
                   style="fill:none;stroke:#000000;stroke-width:1.5;stroke-linecap:butt;stroke-linejoin:round;stroke-miterlimit:10;stroke-dasharray:none;stroke-opacity:1"
                   id="path4454"
                   inkscape:connector-curvature="0" />
                <path
                   d="m 144,215.1 72,0"
                   style="fill:none;stroke:#000000;stroke-width:1.5;stroke-linecap:butt;stroke-linejoin:round;stroke-miterlimit:10;stroke-dasharray:none;stroke-opacity:1"
                   id="path4456-3"
                   inkscape:connector-curvature="0" />
                <path
                   d="m 216,215.1 72,0"
                   style="fill:none;stroke:#000000;stroke-width:1.5;stroke-linecap:butt;stroke-linejoin:round;stroke-miterlimit:10;stroke-dasharray:none;stroke-opacity:1"
                   id="path4458"
                   inkscape:connector-curvature="0" />
                <path
                   d="m 288,215.1 72,0"
                   style="fill:none;stroke:#000000;stroke-width:1.5;stroke-linecap:butt;stroke-linejoin:round;stroke-miterlimit:10;stroke-dasharray:none;stroke-opacity:1"
                   id="path4460"
                   inkscape:connector-curvature="0" />
                <path
                   d="m 360,215.1 72,0"
                   style="fill:none;stroke:#000000;stroke-width:1.5;stroke-linecap:butt;stroke-linejoin:round;stroke-miterlimit:10;stroke-dasharray:none;stroke-opacity:1"
                   id="path4462"
                   inkscape:connector-curvature="0" />
                <path
                   d="m 432,215.1 72,0"
                   style="fill:none;stroke:#000000;stroke-width:1.5;stroke-linecap:butt;stroke-linejoin:round;stroke-miterlimit:10;stroke-dasharray:none;stroke-opacity:1"
                   id="path4464"
                   inkscape:connector-curvature="0" />
                <g
                   id="g4466" />
              </g>
            </g>
            <g
               id="g4468">
              <g
                 id="g4470"
                 clip-path="url(#clipPath4472)">
                <g
                   id="g4476"
                   transform="translate(144,215.1)">
                  <g
                     id="g4478">
                    <g
                       id="g4480"
                       clip-path="url(#clipPath4482)">
                      <path
                         d="m 0,-5 c 1.3260155,0 2.5978994,0.5268315 3.5355339,1.4644661 C 4.4731685,-2.5978994 5,-1.3260155 5,0 5,1.3260155 4.4731685,2.5978994 3.5355339,3.5355339 2.5978994,4.4731685 1.3260155,5 0,5 -1.3260155,5 -2.5978994,4.4731685 -3.5355339,3.5355339 -4.4731685,2.5978994 -5,1.3260155 -5,0 -5,-1.3260155 -4.4731685,-2.5978994 -3.5355339,-3.5355339 -2.5978994,-4.4731685 -1.3260155,-5 0,-5 Z"
                         style="fill:#ff0000;fill-opacity:1;fill-rule:nonzero;stroke:#000000;stroke-width:0.15000001;stroke-linecap:butt;stroke-linejoin:round;stroke-miterlimit:10;stroke-dasharray:none;stroke-opacity:1"
                         id="path4486"
                         inkscape:connector-curvature="0" />
                    </g>
                  </g>
                  <g
                     id="g4488"
                     transform="translate(58.249224,42.144203)">
                    <g
                       id="g4490">
                      <g
                         id="g4492"
                         clip-path="url(#clipPath4494)">
                        <path
                           d="m 0,-5 c 1.3260155,0 2.5978994,0.5268315 3.5355339,1.4644661 C 4.4731685,-2.5978994 5,-1.3260155 5,0 5,1.3260155 4.4731685,2.5978994 3.5355339,3.5355339 2.5978994,4.4731685 1.3260155,5 0,5 -1.3260155,5 -2.5978994,4.4731685 -3.5355339,3.5355339 -4.4731685,2.5978994 -5,1.3260155 -5,0 -5,-1.3260155 -4.4731685,-2.5978994 -3.5355339,-3.5355339 -2.5978994,-4.4731685 -1.3260155,-5 0,-5 Z"
                           style="fill:#ff0000;fill-opacity:1;fill-rule:nonzero;stroke:#000000;stroke-width:0.15000001;stroke-linecap:butt;stroke-linejoin:round;stroke-miterlimit:10;stroke-dasharray:none;stroke-opacity:1"
                           id="path4498"
                           inkscape:connector-curvature="0" />
                      </g>
                    </g>
                    <g
                       id="g4500"
                       transform="translate(-36,26.04655)">
                      <g
                         id="g4502">
                        <g
                           id="g4504"
                           clip-path="url(#clipPath4506)">
                          <path
                             d="m 0,-5 c 1.3260155,0 2.5978994,0.5268315 3.5355339,1.4644661 C 4.4731685,-2.5978994 5,-1.3260155 5,0 5,1.3260155 4.4731685,2.5978994 3.5355339,3.5355339 2.5978994,4.4731685 1.3260155,5 0,5 -1.3260155,5 -2.5978994,4.4731685 -3.5355339,3.5355339 -4.4731685,2.5978994 -5,1.3260155 -5,0 -5,-1.3260155 -4.4731685,-2.5978994 -3.5355339,-3.5355339 -2.5978994,-4.4731685 -1.3260155,-5 0,-5 Z"
                             style="fill:#ff0000;fill-opacity:1;fill-rule:nonzero;stroke:#000000;stroke-width:0.15000001;stroke-linecap:butt;stroke-linejoin:round;stroke-miterlimit:10;stroke-dasharray:none;stroke-opacity:1"
                             id="path4510"
                             inkscape:connector-curvature="0" />
                        </g>
                      </g>
                      <g
                         id="g4512"
                         transform="translate(-44.498447,0)">
                        <g
                           id="g4514">
                          <g
                             id="g4516"
                             clip-path="url(#clipPath4518)">
                            <path
                               d="m 0,-5 c 1.3260155,0 2.5978994,0.5268315 3.5355339,1.4644661 C 4.4731685,-2.5978994 5,-1.3260155 5,0 5,1.3260155 4.4731685,2.5978994 3.5355339,3.5355339 2.5978994,4.4731685 1.3260155,5 0,5 -1.3260155,5 -2.5978994,4.4731685 -3.5355339,3.5355339 -4.4731685,2.5978994 -5,1.3260155 -5,0 -5,-1.3260155 -4.4731685,-2.5978994 -3.5355339,-3.5355339 -2.5978994,-4.4731685 -1.3260155,-5 0,-5 Z"
                               style="fill:#ff0000;fill-opacity:1;fill-rule:nonzero;stroke:#000000;stroke-width:0.15000001;stroke-linecap:butt;stroke-linejoin:round;stroke-miterlimit:10;stroke-dasharray:none;stroke-opacity:1"
                               id="path4522"
                               inkscape:connector-curvature="0" />
                          </g>
                        </g>
                        <g
                           id="g4524"
                           transform="translate(-36,-26.04655)">
                          <g
                             id="g4526">
                            <g
                               id="g4528"
                               clip-path="url(#clipPath4530)">
                              <path
                                 d="m 0,-5 c 1.3260155,0 2.5978994,0.5268315 3.5355339,1.4644661 C 4.4731685,-2.5978994 5,-1.3260155 5,0 5,1.3260155 4.4731685,2.5978994 3.5355339,3.5355339 2.5978994,4.4731685 1.3260155,5 0,5 -1.3260155,5 -2.5978994,4.4731685 -3.5355339,3.5355339 -4.4731685,2.5978994 -5,1.3260155 -5,0 -5,-1.3260155 -4.4731685,-2.5978994 -3.5355339,-3.5355339 -2.5978994,-4.4731685 -1.3260155,-5 0,-5 Z"
                                 style="fill:#ff0000;fill-opacity:1;fill-rule:nonzero;stroke:#000000;stroke-width:0.15000001;stroke-linecap:butt;stroke-linejoin:round;stroke-miterlimit:10;stroke-dasharray:none;stroke-opacity:1"
                                 id="path4534"
                                 inkscape:connector-curvature="0" />
                            </g>
                          </g>
                          <g
                             id="g4536"
                             transform="translate(-13.750776,-42.144203)">
                            <g
                               id="g4538">
                              <g
                                 id="g4540"
                                 clip-path="url(#clipPath4542)">
                                <path
                                   d="m 0,-5 c 1.3260155,0 2.5978994,0.5268315 3.5355339,1.4644661 C 4.4731685,-2.5978994 5,-1.3260155 5,0 5,1.3260155 4.4731685,2.5978994 3.5355339,3.5355339 2.5978994,4.4731685 1.3260155,5 0,5 -1.3260155,5 -2.5978994,4.4731685 -3.5355339,3.5355339 -4.4731685,2.5978994 -5,1.3260155 -5,0 -5,-1.3260155 -4.4731685,-2.5978994 -3.5355339,-3.5355339 -2.5978994,-4.4731685 -1.3260155,-5 0,-5 Z"
                                   style="fill:#ff0000;fill-opacity:1;fill-rule:nonzero;stroke:#000000;stroke-width:0.15000001;stroke-linecap:butt;stroke-linejoin:round;stroke-miterlimit:10;stroke-dasharray:none;stroke-opacity:1"
                                   id="path4546"
                                   inkscape:connector-curvature="0" />
                              </g>
                            </g>
                            <g
                               id="g4548"
                               transform="translate(13.750776,-42.144203)">
                              <g
                                 id="g4550">
                                <g
                                   id="g4552"
                                   clip-path="url(#clipPath4554)">
                                <path
                                   d="m 0,-5 c 1.3260155,0 2.5978994,0.5268315 3.5355339,1.4644661 C 4.4731685,-2.5978994 5,-1.3260155 5,0 5,1.3260155 4.4731685,2.5978994 3.5355339,3.5355339 2.5978994,4.4731685 1.3260155,5 0,5 -1.3260155,5 -2.5978994,4.4731685 -3.5355339,3.5355339 -4.4731685,2.5978994 -5,1.3260155 -5,0 -5,-1.3260155 -4.4731685,-2.5978994 -3.5355339,-3.5355339 -2.5978994,-4.4731685 -1.3260155,-5 0,-5 Z"
                                   style="fill:#ff0000;fill-opacity:1;fill-rule:nonzero;stroke:#000000;stroke-width:0.15000001;stroke-linecap:butt;stroke-linejoin:round;stroke-miterlimit:10;stroke-dasharray:none;stroke-opacity:1"
                                   id="path4558"
                                   inkscape:connector-curvature="0" />
                                </g>
                              </g>
                              <g
                                 id="g4560"
                                 transform="translate(36,-26.04655)">
                                <g
                                   id="g4562">
                                <g
                                   id="g4564"
                                   clip-path="url(#clipPath4566)">
                                <path
                                   d="m 0,-5 c 1.3260155,0 2.5978994,0.5268315 3.5355339,1.4644661 C 4.4731685,-2.5978994 5,-1.3260155 5,0 5,1.3260155 4.4731685,2.5978994 3.5355339,3.5355339 2.5978994,4.4731685 1.3260155,5 0,5 -1.3260155,5 -2.5978994,4.4731685 -3.5355339,3.5355339 -4.4731685,2.5978994 -5,1.3260155 -5,0 -5,-1.3260155 -4.4731685,-2.5978994 -3.5355339,-3.5355339 -2.5978994,-4.4731685 -1.3260155,-5 0,-5 Z"
                                   style="fill:#ff0000;fill-opacity:1;fill-rule:nonzero;stroke:#000000;stroke-width:0.15000001;stroke-linecap:butt;stroke-linejoin:round;stroke-miterlimit:10;stroke-dasharray:none;stroke-opacity:1"
                                   id="path4570"
                                   inkscape:connector-curvature="0" />
                                </g>
                                </g>
                                <g
                                   id="g4572"
                                   transform="translate(44.498447,0)">
                                <g
                                   id="g4574">
                                <g
                                   id="g4576"
                                   clip-path="url(#clipPath4578)">
                                <path
                                   d="m 0,-5 c 1.3260155,0 2.5978994,0.5268315 3.5355339,1.4644661 C 4.4731685,-2.5978994 5,-1.3260155 5,0 5,1.3260155 4.4731685,2.5978994 3.5355339,3.5355339 2.5978994,4.4731685 1.3260155,5 0,5 -1.3260155,5 -2.5978994,4.4731685 -3.5355339,3.5355339 -4.4731685,2.5978994 -5,1.3260155 -5,0 -5,-1.3260155 -4.4731685,-2.5978994 -3.5355339,-3.5355339 -2.5978994,-4.4731685 -1.3260155,-5 0,-5 Z"
                                   style="fill:#ff0000;fill-opacity:1;fill-rule:nonzero;stroke:#000000;stroke-width:0.15000001;stroke-linecap:butt;stroke-linejoin:round;stroke-miterlimit:10;stroke-dasharray:none;stroke-opacity:1"
                                   id="path4582"
                                   inkscape:connector-curvature="0" />
                                </g>
                                </g>
                                <g
                                   id="g4584"
                                   transform="translate(36,26.04655)">
                                <g
                                   id="g4586">
                                <g
                                   id="g4588"
                                   clip-path="url(#clipPath4590)">
                                <path
                                   d="m 0,-5 c 1.3260155,0 2.5978994,0.5268315 3.5355339,1.4644661 C 4.4731685,-2.5978994 5,-1.3260155 5,0 5,1.3260155 4.4731685,2.5978994 3.5355339,3.5355339 2.5978994,4.4731685 1.3260155,5 0,5 -1.3260155,5 -2.5978994,4.4731685 -3.5355339,3.5355339 -4.4731685,2.5978994 -5,1.3260155 -5,0 -5,-1.3260155 -4.4731685,-2.5978994 -3.5355339,-3.5355339 -2.5978994,-4.4731685 -1.3260155,-5 0,-5 Z"
                                   style="fill:#ff0000;fill-opacity:1;fill-rule:nonzero;stroke:#000000;stroke-width:0.15000001;stroke-linecap:butt;stroke-linejoin:round;stroke-miterlimit:10;stroke-dasharray:none;stroke-opacity:1"
                                   id="path4594"
                                   inkscape:connector-curvature="0" />
                                </g>
                                </g>
                                <g
                                   id="g4596"
                                   transform="translate(13.750776,42.144203)">
                                <g
                                   id="g4598">
                                <g
                                   id="g4600"
                                   clip-path="url(#clipPath4602)">
                                <path
                                   d="m 0,-5 c 1.3260155,0 2.5978994,0.5268315 3.5355339,1.4644661 C 4.4731685,-2.5978994 5,-1.3260155 5,0 5,1.3260155 4.4731685,2.5978994 3.5355339,3.5355339 2.5978994,4.4731685 1.3260155,5 0,5 -1.3260155,5 -2.5978994,4.4731685 -3.5355339,3.5355339 -4.4731685,2.5978994 -5,1.3260155 -5,0 -5,-1.3260155 -4.4731685,-2.5978994 -3.5355339,-3.5355339 -2.5978994,-4.4731685 -1.3260155,-5 0,-5 Z"
                                   style="fill:#ff0000;fill-opacity:1;fill-rule:nonzero;stroke:#000000;stroke-width:0.15000001;stroke-linecap:butt;stroke-linejoin:round;stroke-miterlimit:10;stroke-dasharray:none;stroke-opacity:1"
                                   id="path4606"
                                   inkscape:connector-curvature="0" />
                                </g>
                                </g>
                                <g
                                   id="g4608"
                                   transform="translate(72,0)">
                                <g
                                   id="g4610">
                                <g
                                   id="g4612"
                                   clip-path="url(#clipPath4614)">
                                <path
                                   d="m 0,-5 c 1.3260155,0 2.5978994,0.5268315 3.5355339,1.4644661 C 4.4731685,-2.5978994 5,-1.3260155 5,0 5,1.3260155 4.4731685,2.5978994 3.5355339,3.5355339 2.5978994,4.4731685 1.3260155,5 0,5 -1.3260155,5 -2.5978994,4.4731685 -3.5355339,3.5355339 -4.4731685,2.5978994 -5,1.3260155 -5,0 -5,-1.3260155 -4.4731685,-2.5978994 -3.5355339,-3.5355339 -2.5978994,-4.4731685 -1.3260155,-5 0,-5 Z"
                                   style="fill:#ff0000;fill-opacity:1;fill-rule:nonzero;stroke:#000000;stroke-width:0.15000001;stroke-linecap:butt;stroke-linejoin:round;stroke-miterlimit:10;stroke-dasharray:none;stroke-opacity:1"
                                   id="path4618"
                                   inkscape:connector-curvature="0" />
                                </g>
                                </g>
                                <g
                                   id="g4620"
                                   transform="translate(72,0)">
                                <g
                                   id="g4622">
                                <g
                                   id="g4624"
                                   clip-path="url(#clipPath4626)">
                                <path
                                   d="m 0,-5 c 1.3260155,0 2.5978994,0.5268315 3.5355339,1.4644661 C 4.4731685,-2.5978994 5,-1.3260155 5,0 5,1.3260155 4.4731685,2.5978994 3.5355339,3.5355339 2.5978994,4.4731685 1.3260155,5 0,5 -1.3260155,5 -2.5978994,4.4731685 -3.5355339,3.5355339 -4.4731685,2.5978994 -5,1.3260155 -5,0 -5,-1.3260155 -4.4731685,-2.5978994 -3.5355339,-3.5355339 -2.5978994,-4.4731685 -1.3260155,-5 0,-5 Z"
                                   style="fill:#ff0000;fill-opacity:1;fill-rule:nonzero;stroke:#000000;stroke-width:0.15000001;stroke-linecap:butt;stroke-linejoin:round;stroke-miterlimit:10;stroke-dasharray:none;stroke-opacity:1"
                                   id="path4630"
                                   inkscape:connector-curvature="0" />
                                </g>
                                </g>
                                <g
                                   id="g4632"
                                   transform="translate(72,0)">
                                <g
                                   id="g4634">
                                <g
                                   id="g4636"
                                   clip-path="url(#clipPath4638)">
                                <path
                                   d="m 0,-5 c 1.3260155,0 2.5978994,0.5268315 3.5355339,1.4644661 C 4.4731685,-2.5978994 5,-1.3260155 5,0 5,1.3260155 4.4731685,2.5978994 3.5355339,3.5355339 2.5978994,4.4731685 1.3260155,5 0,5 -1.3260155,5 -2.5978994,4.4731685 -3.5355339,3.5355339 -4.4731685,2.5978994 -5,1.3260155 -5,0 -5,-1.3260155 -4.4731685,-2.5978994 -3.5355339,-3.5355339 -2.5978994,-4.4731685 -1.3260155,-5 0,-5 Z"
                                   style="fill:#ff0000;fill-opacity:1;fill-rule:nonzero;stroke:#000000;stroke-width:0.15000001;stroke-linecap:butt;stroke-linejoin:round;stroke-miterlimit:10;stroke-dasharray:none;stroke-opacity:1"
                                   id="path4642"
                                   inkscape:connector-curvature="0" />
                                </g>
                                </g>
                                <g
                                   id="g4644"
                                   transform="translate(72,0)">
                                <g
                                   id="g4646">
                                <g
                                   id="g4648"
                                   clip-path="url(#clipPath4650)">
                                <path
                                   d="m 0,-5 c 1.3260155,0 2.5978994,0.5268315 3.5355339,1.4644661 C 4.4731685,-2.5978994 5,-1.3260155 5,0 5,1.3260155 4.4731685,2.5978994 3.5355339,3.5355339 2.5978994,4.4731685 1.3260155,5 0,5 -1.3260155,5 -2.5978994,4.4731685 -3.5355339,3.5355339 -4.4731685,2.5978994 -5,1.3260155 -5,0 -5,-1.3260155 -4.4731685,-2.5978994 -3.5355339,-3.5355339 -2.5978994,-4.4731685 -1.3260155,-5 0,-5 Z"
                                   style="fill:#ff0000;fill-opacity:1;fill-rule:nonzero;stroke:#000000;stroke-width:0.15000001;stroke-linecap:butt;stroke-linejoin:round;stroke-miterlimit:10;stroke-dasharray:none;stroke-opacity:1"
                                   id="path4654"
                                   inkscape:connector-curvature="0" />
                                </g>
                                </g>
                                </g>
                                </g>
                                </g>
                                </g>
                                </g>
                                </g>
                                </g>
                              </g>
                            </g>
                          </g>
                        </g>
                      </g>
                    </g>
                  </g>
                </g>
              </g>
            </g>
          </g>
          <g
             id="g5033"
             transform="translate(58.009421,217.90925)">
            <g
               transform="translate(-65.209421,-325.10533)"
               id="g4466-9">
              <g
                 clip-path="url(#clipPath4470)"
                 id="g4468-1">
                <g
                   transform="translate(75.981679,215.1)"
                   id="g4474">
                  <g
                     id="g4476-8">
                    <g
                       clip-path="url(#clipPath4480)"
                       id="g4478-0">
                      <path
                         inkscape:connector-curvature="0"
                         id="path4484-4"
                         style="fill:#000000;fill-opacity:1;fill-rule:nonzero;stroke:#000000;stroke-width:1.5;stroke-linecap:butt;stroke-linejoin:round;stroke-miterlimit:10;stroke-dasharray:none;stroke-opacity:1"
                         d="M -3,-3 3,3 M -3,3 3,-3" />
                    </g>
                  </g>
                  <g
                     transform="translate(4.4256873,0)"
                     id="g4486">
                    <g
                       id="g4488-4">
                      <g
                         clip-path="url(#clipPath4492)"
                         id="g4490-8">
                        <path
                           inkscape:connector-curvature="0"
                           id="path4496-3"
                           style="fill:#000000;fill-opacity:1;fill-rule:nonzero;stroke:#000000;stroke-width:1.5;stroke-linecap:butt;stroke-linejoin:round;stroke-miterlimit:10;stroke-dasharray:none;stroke-opacity:1"
                           d="M -3,-3 3,3 M -3,3 3,-3" />
                      </g>
                    </g>
                    <g
                       transform="translate(23.449263,0)"
                       id="g4498">
                      <g
                         id="g4500-3">
                        <g
                           clip-path="url(#clipPath4504)"
                           id="g4502-4">
                          <path
                             inkscape:connector-curvature="0"
                             id="path4508-1"
                             style="fill:#000000;fill-opacity:1;fill-rule:nonzero;stroke:#000000;stroke-width:1.5;stroke-linecap:butt;stroke-linejoin:round;stroke-miterlimit:10;stroke-dasharray:none;stroke-opacity:1"
                             d="M -3,-3 3,3 M -3,3 3,-3" />
                        </g>
                      </g>
                      <g
                         transform="translate(11.941836,0)"
                         id="g4510">
                        <g
                           id="g4512-1">
                          <g
                             clip-path="url(#clipPath4516)"
                             id="g4514-6">
                            <path
                               inkscape:connector-curvature="0"
                               id="path4520-6"
                               style="fill:#000000;fill-opacity:1;fill-rule:nonzero;stroke:#000000;stroke-width:1.5;stroke-linecap:butt;stroke-linejoin:round;stroke-miterlimit:10;stroke-dasharray:none;stroke-opacity:1"
                               d="M -3,-3 3,3 M -3,3 3,-3" />
                          </g>
                        </g>
                        <g
                           id="g4522">
                          <g
                             id="g4524-2">
                            <g
                               clip-path="url(#clipPath4528)"
                               id="g4526-0">
                              <path
                                 inkscape:connector-curvature="0"
                                 id="path4532-6"
                                 style="fill:#000000;fill-opacity:1;fill-rule:nonzero;stroke:#000000;stroke-width:1.5;stroke-linecap:butt;stroke-linejoin:round;stroke-miterlimit:10;stroke-dasharray:none;stroke-opacity:1"
                                 d="M -3,-3 3,3 M -3,3 3,-3" />
                            </g>
                          </g>
                          <g
                             id="g4534">
                            <g
                               id="g4536-4">
                              <g
                                 clip-path="url(#clipPath4540)"
                                 id="g4538-7">
                                <path
                                   inkscape:connector-curvature="0"
                                   id="path4544-7"
                                   style="fill:#000000;fill-opacity:1;fill-rule:nonzero;stroke:#000000;stroke-width:1.5;stroke-linecap:butt;stroke-linejoin:round;stroke-miterlimit:10;stroke-dasharray:none;stroke-opacity:1"
                                   d="M -3,-3 3,3 M -3,3 3,-3" />
                              </g>
                            </g>
                            <g
                               id="g4546">
                              <g
                                 id="g4548-7">
                                <g
                                   clip-path="url(#clipPath4552)"
                                   id="g4550-9">
                                <path
                                   inkscape:connector-curvature="0"
                                   id="path4556-9"
                                   style="fill:#000000;fill-opacity:1;fill-rule:nonzero;stroke:#000000;stroke-width:1.5;stroke-linecap:butt;stroke-linejoin:round;stroke-miterlimit:10;stroke-dasharray:none;stroke-opacity:1"
                                   d="M -3,-3 3,3 M -3,3 3,-3" />
                                </g>
                              </g>
                              <g
                                 id="g4558">
                                <g
                                   id="g4560-8">
                                <g
                                   clip-path="url(#clipPath4564)"
                                   id="g4562-3">
                                <path
                                   inkscape:connector-curvature="0"
                                   id="path4568-9"
                                   style="fill:#000000;fill-opacity:1;fill-rule:nonzero;stroke:#000000;stroke-width:1.5;stroke-linecap:butt;stroke-linejoin:round;stroke-miterlimit:10;stroke-dasharray:none;stroke-opacity:1"
                                   d="M -3,-3 3,3 M -3,3 3,-3" />
                                </g>
                                </g>
                                <g
                                   id="g4570">
                                <g
                                   id="g4572-7">
                                <g
                                   clip-path="url(#clipPath4576)"
                                   id="g4574-1">
                                <path
                                   inkscape:connector-curvature="0"
                                   id="path4580-9"
                                   style="fill:#000000;fill-opacity:1;fill-rule:nonzero;stroke:#000000;stroke-width:1.5;stroke-linecap:butt;stroke-linejoin:round;stroke-miterlimit:10;stroke-dasharray:none;stroke-opacity:1"
                                   d="M -3,-3 3,3 M -3,3 3,-3" />
                                </g>
                                </g>
                                <g
                                   id="g4582">
                                <g
                                   id="g4584-0">
                                <g
                                   clip-path="url(#clipPath4588)"
                                   id="g4586-6">
                                <path
                                   inkscape:connector-curvature="0"
                                   id="path4592-1"
                                   style="fill:#000000;fill-opacity:1;fill-rule:nonzero;stroke:#000000;stroke-width:1.5;stroke-linecap:butt;stroke-linejoin:round;stroke-miterlimit:10;stroke-dasharray:none;stroke-opacity:1"
                                   d="M -3,-3 3,3 M -3,3 3,-3" />
                                </g>
                                </g>
                                <g
                                   id="g4594">
                                <g
                                   id="g4596-6">
                                <g
                                   clip-path="url(#clipPath4600)"
                                   id="g4598-9">
                                <path
                                   inkscape:connector-curvature="0"
                                   id="path4604-1"
                                   style="fill:#000000;fill-opacity:1;fill-rule:nonzero;stroke:#000000;stroke-width:1.5;stroke-linecap:butt;stroke-linejoin:round;stroke-miterlimit:10;stroke-dasharray:none;stroke-opacity:1"
                                   d="M -3,-3 3,3 M -3,3 3,-3" />
                                </g>
                                </g>
                                <g
                                   transform="translate(27.811165,0)"
                                   id="g4606">
                                <g
                                   id="g4608-0">
                                <g
                                   clip-path="url(#clipPath4612)"
                                   id="g4610-7">
                                <path
                                   inkscape:connector-curvature="0"
                                   id="path4616-7"
                                   style="fill:#000000;fill-opacity:1;fill-rule:nonzero;stroke:#000000;stroke-width:1.5;stroke-linecap:butt;stroke-linejoin:round;stroke-miterlimit:10;stroke-dasharray:none;stroke-opacity:1"
                                   d="M -3,-3 3,3 M -3,3 3,-3" />
                                </g>
                                </g>
                                <g
                                   transform="translate(44.127296,0)"
                                   id="g4618">
                                <g
                                   id="g4620-1">
                                <g
                                   clip-path="url(#clipPath4624)"
                                   id="g4622-3">
                                <path
                                   inkscape:connector-curvature="0"
                                   id="path4628-6"
                                   style="fill:#000000;fill-opacity:1;fill-rule:nonzero;stroke:#000000;stroke-width:1.5;stroke-linecap:butt;stroke-linejoin:round;stroke-miterlimit:10;stroke-dasharray:none;stroke-opacity:1"
                                   d="M -3,-3 3,3 M -3,3 3,-3" />
                                </g>
                                </g>
                                <g
                                   transform="translate(34.459995,0)"
                                   id="g4630">
                                <g
                                   id="g4632-1">
                                <g
                                   clip-path="url(#clipPath4636)"
                                   id="g4634-6">
                                <path
                                   inkscape:connector-curvature="0"
                                   id="path4640-9"
                                   style="fill:#000000;fill-opacity:1;fill-rule:nonzero;stroke:#000000;stroke-width:1.5;stroke-linecap:butt;stroke-linejoin:round;stroke-miterlimit:10;stroke-dasharray:none;stroke-opacity:1"
                                   d="M -3,-3 3,3 M -3,3 3,-3" />
                                </g>
                                </g>
                                <g
                                   transform="translate(292.2214,0)"
                                   id="g4642">
                                <g
                                   id="g4644-4">
                                <g
                                   clip-path="url(#clipPath4648)"
                                   id="g4646-9">
                                <path
                                   inkscape:connector-curvature="0"
                                   id="path4652-7"
                                   style="fill:#000000;fill-opacity:1;fill-rule:nonzero;stroke:#000000;stroke-width:1.5;stroke-linecap:butt;stroke-linejoin:round;stroke-miterlimit:10;stroke-dasharray:none;stroke-opacity:1"
                                   d="M -3,-3 3,3 M -3,3 3,-3" />
                                </g>
                                </g>
                                </g>
                                </g>
                                </g>
                                </g>
                                </g>
                                </g>
                                </g>
                              </g>
                            </g>
                          </g>
                        </g>
                      </g>
                    </g>
                  </g>
                </g>
              </g>
            </g>
            <g
               transform="translate(-65.209421,-169.90533)"
               id="g4654">
              <path
                 inkscape:connector-curvature="0"
                 id="path4660-8"
                 style="fill:none;stroke:#000000;stroke-width:1;stroke-linecap:square;stroke-linejoin:miter;stroke-miterlimit:10;stroke-dasharray:none;stroke-opacity:1"
                 d="m 72,43.02 446.4,0" />
              <path
                 inkscape:connector-curvature="0"
                 id="path4664"
                 style="fill:#000000;fill-opacity:1;fill-rule:nonzero;stroke:#000000;stroke-width:0.5;stroke-linecap:butt;stroke-linejoin:round;stroke-miterlimit:10;stroke-dasharray:none;stroke-opacity:1"
                 d="m 75.981679,43.02 0,4" />
              <text
                 id="text4668"
                 style="font-variant:normal;font-weight:normal;font-size:20px;font-family:BitstreamVeraSans;-inkscape-font-specification:BitstreamVeraSans-Roman;writing-mode:lr-tb;fill:#000000;fill-opacity:1;fill-rule:nonzero;stroke:none"
                 transform="matrix(1,0,0,-1,70.942616,23.816875)">
                <tspan
                   id="tspan4670"
                   y="0"
                   x="0">0</tspan>
              </text>
              <path
                 inkscape:connector-curvature="0"
                 id="path4672-8"
                 style="fill:#000000;fill-opacity:1;fill-rule:nonzero;stroke:#000000;stroke-width:0.5;stroke-linecap:butt;stroke-linejoin:round;stroke-miterlimit:10;stroke-dasharray:none;stroke-opacity:1"
                 d="m 155.61525,43.02 0,4" />
              <text
                 id="text4676"
                 style="font-variant:normal;font-weight:normal;font-size:20px;font-family:BitstreamVeraSans;-inkscape-font-specification:BitstreamVeraSans-Roman;writing-mode:lr-tb;fill:#000000;fill-opacity:1;fill-rule:nonzero;stroke:none"
                 transform="matrix(1,0,0,-1,150.99025,23.816875)">
                <tspan
                   id="tspan4678"
                   y="0"
                   x="0">2</tspan>
              </text>
              <path
                 inkscape:connector-curvature="0"
                 id="path4680"
                 style="fill:#000000;fill-opacity:1;fill-rule:nonzero;stroke:#000000;stroke-width:0.5;stroke-linecap:butt;stroke-linejoin:round;stroke-miterlimit:10;stroke-dasharray:none;stroke-opacity:1"
                 d="m 235.24882,43.02 0,4" />
              <text
                 id="text4684"
                 style="font-variant:normal;font-weight:normal;font-size:20px;font-family:BitstreamVeraSans;-inkscape-font-specification:BitstreamVeraSans-Roman;writing-mode:lr-tb;fill:#000000;fill-opacity:1;fill-rule:nonzero;stroke:none"
                 transform="matrix(1,0,0,-1,229.93632,23.816875)">
                <tspan
                   id="tspan4686"
                   y="0"
                   x="0">4</tspan>
              </text>
              <path
                 inkscape:connector-curvature="0"
                 id="path4688"
                 style="fill:#000000;fill-opacity:1;fill-rule:nonzero;stroke:#000000;stroke-width:0.5;stroke-linecap:butt;stroke-linejoin:round;stroke-miterlimit:10;stroke-dasharray:none;stroke-opacity:1"
                 d="m 314.88239,43.02 0,4" />
              <text
                 id="text4692"
                 style="font-variant:normal;font-weight:normal;font-size:20px;font-family:BitstreamVeraSans;-inkscape-font-specification:BitstreamVeraSans-Roman;writing-mode:lr-tb;fill:#000000;fill-opacity:1;fill-rule:nonzero;stroke:none"
                 transform="matrix(1,0,0,-1,309.84333,23.816875)">
                <tspan
                   id="tspan4694"
                   y="0"
                   x="0">6</tspan>
              </text>
              <path
                 inkscape:connector-curvature="0"
                 id="path4696-8"
                 style="fill:#000000;fill-opacity:1;fill-rule:nonzero;stroke:#000000;stroke-width:0.5;stroke-linecap:butt;stroke-linejoin:round;stroke-miterlimit:10;stroke-dasharray:none;stroke-opacity:1"
                 d="m 394.51597,43.02 0,4" />
              <text
                 id="text4700"
                 style="font-variant:normal;font-weight:normal;font-size:20px;font-family:BitstreamVeraSans;-inkscape-font-specification:BitstreamVeraSans-Roman;writing-mode:lr-tb;fill:#000000;fill-opacity:1;fill-rule:nonzero;stroke:none"
                 transform="matrix(1,0,0,-1,389.51597,23.816875)">
                <tspan
                   id="tspan4702"
                   y="0"
                   x="0">8</tspan>
              </text>
              <path
                 inkscape:connector-curvature="0"
                 id="path4704"
                 style="fill:#000000;fill-opacity:1;fill-rule:nonzero;stroke:#000000;stroke-width:0.5;stroke-linecap:butt;stroke-linejoin:round;stroke-miterlimit:10;stroke-dasharray:none;stroke-opacity:1"
                 d="m 474.14954,43.02 0,4" />
              <text
                 id="text4708"
                 style="font-variant:normal;font-weight:normal;font-size:20px;font-family:BitstreamVeraSans;-inkscape-font-specification:BitstreamVeraSans-Roman;writing-mode:lr-tb;fill:#000000;fill-opacity:1;fill-rule:nonzero;stroke:none"
                 transform="matrix(1,0,0,-1,463.19641,23.816875)">
                <tspan
                   id="tspan4710"
                   sodipodi:role="line"
                   y="0"
                   x="0 12.72">10</tspan>
              </text>
              <path
                 inkscape:connector-curvature="0"
                 id="path4712"
                 style="fill:#000000;fill-opacity:1;fill-rule:nonzero;stroke:#000000;stroke-width:0.5;stroke-linecap:butt;stroke-linejoin:round;stroke-miterlimit:10;stroke-dasharray:none;stroke-opacity:1"
                 d="m 72,43.02 4,0" />
              <path
                 inkscape:connector-curvature="0"
                 id="path4714"
                 style="fill:#000000;fill-opacity:1;fill-rule:nonzero;stroke:#000000;stroke-width:0.5;stroke-linecap:butt;stroke-linejoin:round;stroke-miterlimit:10;stroke-dasharray:none;stroke-opacity:1"
                 d="m 518.4,43.02 -4,0" />
              <g
                 transform="translate(10.171875,37.496563)"
                 id="g4716">
                <g
                   transform="scale(0.02,0.02)"
                   id="g4722">
                  <g
                     id="g4724">
                    <g
                       clip-path="url(#clipPath4728-5)"
                       id="g4726" />
                  </g>
                </g>
              </g>
              <g
                 transform="translate(10.578125,123.53656)"
                 id="g4738">
                <g
                   transform="scale(0.02,0.02)"
                   id="g4744">
                  <g
                     id="g4746">
                    <g
                       clip-path="url(#clipPath4750)"
                       id="g4748" />
                  </g>
                </g>
              </g>
            </g>
          </g>
        </g>
      </g>
    </g>
  </g>
</svg>
