{
  "#spec": "service-manifest-src@1",
  "template": "builtin-lxc-docker",
  "docker_name": "registry.gitlab.com/pantacor/pv-platforms/wifi-connect",
  "docker_tag": "amd64",
  "docker_source": "remote,local",
  "args": {
    "PV_DRIVERS_OPTIONAL": [
      "wifi",
      "usbnet",
      "bluetooth"
    ],
    "PV_GROUP": "root"
  }
}
