<?xml version="1.0" encoding="utf-8"?>
<!-- Generator: Adobe Illustrator 25.4.1, SVG Export Plug-In . SVG Version: 6.00 Build 0)  -->
<svg version="1.1" id="Layer_1" xmlns="http://www.w3.org/2000/svg" xmlns:xlink="http://www.w3.org/1999/xlink" x="0px" y="0px"
	 viewBox="0 0 836.5 144" style="enable-background:new 0 0 836.5 144;" xml:space="preserve">
<style type="text/css">
	.st0{fill:#2A2F38;}
</style>
<rect x="48" y="32" class="st0" width="16" height="16"/>
<rect x="64" y="48" class="st0" width="16" height="16"/>
<rect x="96" y="48" class="st0" width="16" height="16"/>
<rect x="112" y="16" class="st0" width="16" height="16"/>
<rect x="16" y="16" class="st0" width="16" height="16"/>
<rect x="16" y="112" class="st0" width="16" height="16"/>
<rect x="112" y="112" class="st0" width="16" height="16"/>
<rect x="32" y="48" class="st0" width="16" height="16"/>
<rect x="80" y="32" class="st0" width="16" height="16"/>
<rect x="48" y="64" class="st0" width="16" height="16"/>
<rect x="64" y="80" class="st0" width="16" height="16"/>
<rect x="96" y="80" class="st0" width="16" height="16"/>
<rect x="32" y="80" class="st0" width="16" height="16"/>
<rect x="80" y="64" class="st0" width="16" height="16"/>
<rect x="48" y="96" class="st0" width="16" height="16"/>
<rect x="80" y="96" class="st0" width="16" height="16"/>
<rect x="64" y="0" class="st0" width="16" height="16"/>
<rect x="64" y="128" class="st0" width="16" height="16"/>
<rect x="128" y="64" class="st0" width="16" height="16"/>
<rect y="64" class="st0" width="16" height="16"/>
<path class="st0" d="M228.2,42.4c-4.2-2.7-9.1-4.1-14.1-4c-3.4-0.1-6.7,0.6-9.8,2c-2.3,1.1-4.2,2.7-5.8,4.7
	c-1.2,1.5-2.3,3.1-3.2,4.7h-1.1V39.2h-12.4v90h12.7V94.5h0.8c1,1.7,2.1,3.3,3.3,4.8c1.6,2,3.6,3.6,5.9,4.7c3,1.4,6.4,2.1,9.7,2
	c5,0.1,9.9-1.4,14.1-4.1c4.3-2.9,7.6-6.9,9.7-11.6c2.4-5,3.5-11.1,3.5-18.2s-1.2-13.1-3.6-18.2C235.9,49.2,232.5,45.2,228.2,42.4z
	 M226.7,83.8c-1.1,3.2-3.1,6.1-5.8,8.3c-2.7,2.1-6.1,3.1-9.5,3c-3.3,0.1-6.6-0.9-9.3-2.9c-2.6-2.1-4.7-4.9-5.8-8.1
	c-1.4-3.9-2.1-8-2-12.1c-0.1-4.1,0.6-8.1,2-11.9c1.1-3.2,3.1-6,5.8-8c5.7-3.9,13.3-3.9,19,0.1c2.7,2.1,4.7,4.9,5.8,8.1
	c1.3,3.7,2,7.6,1.9,11.6C228.8,76,228.1,80,226.7,83.8z"/>
<path class="st0" d="M293,42.7c-2.5-1.6-5.4-2.7-8.3-3.3c-2.7-0.6-5.5-0.9-8.3-0.9c-3.8,0-7.6,0.6-11.3,1.7
	c-3.5,1.1-6.8,2.9-9.5,5.4c-2.8,2.7-5,6-6.2,9.7l12,2.7c1.1-2.5,2.8-4.7,5.1-6.3c2.5-1.9,5.8-2.8,10.1-2.8c4.1,0,7.2,1,9.3,3.1
	c2.1,2,3.1,4.9,3.1,8.7V61c0.1,1.3-0.6,2.6-1.7,3.3c-1.6,0.9-3.4,1.4-5.3,1.5c-2.4,0.3-5.6,0.7-9.5,1.1c-3.1,0.4-6.1,0.9-9.1,1.6
	c-2.8,0.7-5.6,1.7-8.1,3.2c-2.4,1.4-4.4,3.3-5.8,5.7c-1.5,2.8-2.2,5.9-2.1,9.1c-0.1,3.8,0.9,7.6,2.9,10.9c1.9,3,4.7,5.3,7.9,6.8
	c3.5,1.5,7.3,2.3,11.2,2.3c3.2,0.1,6.3-0.5,9.3-1.6c2.3-0.9,4.5-2.3,6.3-4c1.5-1.4,2.8-3.1,3.7-4.9h0.5v8.9h12.4V61.2
	c0-4.8-0.8-8.7-2.5-11.7C297.8,46.7,295.6,44.3,293,42.7z M289.1,81.1c0,2.6-0.7,5.1-2,7.3c-1.4,2.4-3.4,4.3-5.8,5.5
	c-2.8,1.5-5.9,2.2-9.1,2.1c-3.1,0.1-6.2-0.7-8.9-2.4c-3.9-3-4.7-8.6-1.7-12.6c1.3-1.5,3-2.6,4.9-3.2c2.2-0.8,4.5-1.3,6.8-1.6
	c1.1-0.1,2.4-0.3,3.9-0.5c1.6-0.2,3.2-0.5,4.8-0.7c1.5-0.3,3-0.6,4.4-1c1-0.2,1.9-0.6,2.6-1.3v8.4H289.1z"/>
<path class="st0" d="M357.4,41.2c-3.6-1.9-7.6-2.9-11.7-2.8c-4.3-0.2-8.5,1-12.2,3.2c-3.2,2-5.6,5-7.1,8.4h-0.8V39.2h-12.2v65.5
	h12.7V65.8c-0.1-3.1,0.6-6.1,2-8.9c1.2-2.4,3.1-4.3,5.4-5.6c2.4-1.3,5.1-2,7.9-1.9c4.3,0,7.7,1.3,10.2,4s3.7,6.4,3.7,11.1v40.1H368
	V63.1c0-5.4-0.9-9.9-2.8-13.6C363.6,46,360.8,43,357.4,41.2z"/>
<path class="st0" d="M407.3,94c-0.9,0.1-1.8,0.2-2.7,0.2c-1.3,0-2.7-0.2-3.9-0.7c-1.2-0.5-2.2-1.4-2.9-2.5c-0.8-1.7-1.2-3.7-1.1-5.6
	v-36h13.4V39.2h-13.4V23.6H384v15.7h-9.6v10.2h9.6v38.6c-0.1,3.5,0.8,6.9,2.7,9.8c1.7,2.6,4.2,4.6,7,5.8c3,1.2,6.2,1.8,9.4,1.8
	c1.7,0,3.4-0.1,5.1-0.5c1.1-0.2,2.2-0.5,3.2-0.9l-2.3-10.5C408.5,93.8,407.9,94,407.3,94z"/>
<path class="st0" d="M461.4,42.7c-2.5-1.6-5.4-2.7-8.3-3.3c-2.7-0.6-5.5-0.9-8.3-0.9c-3.8,0-7.6,0.6-11.3,1.7
	c-3.5,1.1-6.8,2.9-9.5,5.4c-2.8,2.7-5,6-6.2,9.7l12,2.7c1.1-2.5,2.8-4.7,5.1-6.3c2.5-1.9,5.8-2.8,10.1-2.8c4.1,0,7.2,1,9.3,3.1
	c2.1,2,3.1,4.9,3.1,8.7V61c0.1,1.3-0.6,2.6-1.7,3.3c-1.6,0.9-3.4,1.4-5.3,1.5c-2.4,0.3-5.6,0.7-9.5,1.1c-3.1,0.4-6.1,0.9-9.1,1.6
	c-2.8,0.7-5.6,1.7-8.1,3.2c-2.4,1.4-4.4,3.3-5.8,5.7c-1.5,2.8-2.2,5.9-2.1,9.1c-0.1,3.8,0.9,7.6,2.9,10.9c1.9,3,4.7,5.3,7.9,6.8
	c3.5,1.5,7.3,2.3,11.2,2.3c3.2,0.1,6.3-0.5,9.3-1.6c2.3-0.9,4.5-2.3,6.3-4c1.5-1.4,2.8-3.1,3.7-4.9h0.5v8.9H470V61.2
	c0-4.8-0.8-8.7-2.5-11.7C466.2,46.7,464,44.3,461.4,42.7z M457.5,81.1c0,2.6-0.7,5.1-2,7.3c-1.4,2.4-3.4,4.3-5.8,5.5
	c-2.8,1.5-5.9,2.2-9.1,2.1c-3.1,0.1-6.2-0.7-8.9-2.4c-3.9-3-4.7-8.6-1.7-12.6c1.3-1.5,3-2.6,4.9-3.2c2.2-0.8,4.5-1.3,6.8-1.6
	c1.1-0.1,2.4-0.3,3.9-0.5c1.6-0.2,3.2-0.5,4.8-0.7c1.5-0.3,3-0.6,4.4-1c1-0.2,1.9-0.6,2.6-1.3v8.4H457.5z"/>
<polygon class="st0" points="505.2,89.6 504.5,89.6 487.9,39.2 474.2,39.2 498,104.7 511.6,104.7 535.4,39.2 521.7,39.2 "/>
<rect x="542" y="39.2" class="st0" width="12.7" height="65.5"/>
<path class="st0" d="M548.4,13.9c-2.1,0-4.2,0.7-5.7,2.2c-1.5,1.4-2.4,3.3-2.4,5.4c0,2,0.8,4,2.4,5.3c3.2,2.9,8.2,2.9,11.4,0
	c3-2.6,3.2-7.2,0.6-10.1c-0.2-0.2-0.4-0.4-0.6-0.6C552.5,14.7,550.5,13.9,548.4,13.9z"/>
<path class="st0" d="M598.9,68.1l-10.4-2.4c-3.6-0.9-6.2-1.9-7.8-3.3c-1.6-1.3-2.5-3.3-2.4-5.3c0-2.6,1.4-4.9,3.6-6.2
	c2.7-1.7,5.8-2.5,9-2.4c2.3-0.1,4.5,0.4,6.6,1.3c1.7,0.7,3.1,1.9,4.2,3.3c1,1.3,1.8,2.7,2.3,4.2l11.5-2c-1.2-4.9-4-9.3-8.1-12.3
	c-4.1-3.1-9.6-4.6-16.7-4.6c-4.5-0.1-9,0.8-13.1,2.5c-3.5,1.4-6.6,3.8-8.9,6.8c-2.2,2.9-3.3,6.5-3.2,10.1c-0.1,4.3,1.4,8.4,4.4,11.5
	c2.9,3,7.4,5.3,13.5,6.6l11.1,2.4c2.6,0.5,5,1.6,7,3.2c1.5,1.3,2.3,3.2,2.3,5.2c0,2.7-1.5,5.1-3.8,6.4c-3,1.8-6.5,2.8-10,2.6
	c-3.8,0-6.9-0.8-9.3-2.5c-2.5-1.7-4.2-4.3-4.7-7.3l-12.3,1.9c0.9,5.5,3.9,10.3,8.5,13.4c4.6,3.1,10.6,4.7,17.9,4.7
	c4.8,0.1,9.6-0.8,14-2.6c3.7-1.5,7-4,9.4-7.2c2.3-3,3.5-6.7,3.4-10.5c0.1-4.2-1.4-8.3-4.4-11.3C609.4,71.6,604.9,69.4,598.9,68.1z"
	/>
<path class="st0" d="M669,42.6c-10-5.6-22.2-5.6-32.2,0c-4.6,2.9-8.3,6.9-10.7,11.8c-2.6,5.6-3.9,11.7-3.8,17.8
	c-0.1,6.1,1.2,12.2,3.8,17.7c2.3,4.9,6.1,9,10.7,11.8c10,5.6,22.2,5.6,32.2,0c4.6-2.8,8.3-6.9,10.7-11.8c2.6-5.5,3.9-11.6,3.8-17.7
	c0.1-6.1-1.2-12.2-3.8-17.8C677.3,49.6,673.6,45.5,669,42.6z M668.6,83.8c-1.1,3.3-3.1,6.2-5.8,8.4c-2.8,2.2-6.3,3.3-9.9,3.2
	c-3.6,0.1-7.1-1-10-3.2c-2.7-2.2-4.7-5.1-5.8-8.4c-1.3-3.7-2-7.6-1.9-11.5c-0.1-3.9,0.6-7.8,1.9-11.5c1.2-3.3,3.2-6.2,5.8-8.5
	c5.9-4.3,14-4.3,19.9,0c2.7,2.2,4.7,5.2,5.8,8.5c1.3,3.7,2,7.6,1.9,11.5C670.6,76.2,669.9,80.1,668.6,83.8z"/>
<path class="st0" d="M727.2,38.6c-0.9-0.1-1.7-0.2-2.6-0.2c-1.1-0.1-2-0.1-2.8-0.1c-3.7-0.1-7.2,1-10.3,3c-3,2-5.2,4.9-6.3,8.3h-0.7
	V39.2h-12.3v65.5h12.7v-40c0-2.7,0.7-5.3,2-7.6c1.3-2.2,3.3-4,5.6-5.2c2.5-1.3,5.2-2,8-1.9c1.3,0,2.6,0.1,3.9,0.3
	c0.9,0.1,1.8,0.3,2.7,0.5C727.1,50.8,727.2,38.6,727.2,38.6z"/>
<path class="st0" d="M733.8,88.5c-4.7,0-8.5,3.8-8.5,8.5c-0.1,2.3,0.8,4.5,2.5,6c1.6,1.6,3.7,2.5,6,2.5c1.5,0,3-0.4,4.3-1.2
	c1.3-0.8,2.3-1.8,3.1-3.1c0.8-1.3,1.2-2.8,1.2-4.3c0-2.3-0.9-4.4-2.5-6C738.2,89.4,736.1,88.5,733.8,88.5z"/>
<rect x="754" y="39.2" class="st0" width="12.7" height="65.5"/>
<path class="st0" d="M760.4,13.9c-2.1,0-4.2,0.7-5.7,2.2c-1.5,1.4-2.4,3.3-2.4,5.4c0,2,0.8,4,2.4,5.3c3.2,2.9,8.2,2.9,11.4,0
	c3-2.6,3.2-7.2,0.6-10.1c-0.2-0.2-0.4-0.4-0.6-0.6C764.5,14.7,762.5,13.9,760.4,13.9z"/>
<path class="st0" d="M832.7,54.5c-2.3-4.9-6.1-9-10.7-11.8c-10-5.6-22.2-5.6-32.2,0c-4.6,2.9-8.3,6.9-10.7,11.8
	c-2.6,5.6-3.9,11.7-3.8,17.8c-0.1,6.1,1.2,12.2,3.8,17.7c2.3,4.9,6.1,9,10.7,11.8c10,5.6,22.2,5.6,32.2,0c4.6-2.8,8.3-6.9,10.7-11.8
	c2.6-5.5,3.9-11.6,3.8-17.7C836.5,65.5,835.3,59.5,832.7,54.5z M821.8,83.8c-1.1,3.3-3.1,6.2-5.8,8.4c-2.8,2.2-6.3,3.3-9.9,3.2
	c-3.6,0.1-7.1-1-10-3.2c-2.7-2.2-4.7-5.1-5.8-8.4c-1.3-3.7-2-7.6-1.9-11.5c-0.1-3.9,0.6-7.8,1.9-11.5c1.2-3.3,3.2-6.2,5.8-8.5
	c5.9-4.3,14-4.3,19.9,0c2.7,2.2,4.7,5.2,5.8,8.5c1.3,3.7,2,7.6,1.9,11.5C823.7,76.2,823.1,80.1,821.8,83.8z"/>
</svg>
