{
  "#spec": "service-manifest-src@1",
  "template": "builtin-lxc-docker",
  "args": {
    "PV_GROUP": "platform",
    "PV_LXC_EXTRA_CONF": "lxc.mount.entry = /volumes/_pv/addons/plymouth/text-io var/run/plymouth-io-sockets none bind,rw,optional,create=dir 0 0",
    "PV_RESTART_POLICY": "system",
    "PV_ROLES": [
      "mgmt"
    ],
    "PV_SECURITY_WITH_STORAGE": "yes",
    "PV_STATUS_GOAL": "STARTED"
  },
  "dm_enabled": {
    "root.squashfs": true
  },
  "persistence": {
    "/var/dmcrypt/volume": "permanent@dm-versatile"
  },
  "docker_name": "registry.gitlab.com/pantacor/pv-platforms/pvr-sdk",
  "docker_tag": "arm32v6",
  "docker_source": "remote,local"
}