{
  "info": {
    "_postman_id": "6471d38d-b94f-40fa-abc7-8c800259d482",
    "name": "Zoral_INT_CIF_initial_corp_trans",
    "schema": "https://schema.getpostman.com/json/collection/v2.0.0/collection.json"
  },
  "item": [
    {
      "name": "Get Zoral Token",
      "event": [
        {
          "listen": "test",
          "script": {
            "id": "e268c499-36fb-45d1-b3c8-6f3f5d2d91c9",
            "exec": [
              "var jsonData = pm.response.json();",
              "pm.environment.set(\"apiKey\", jsonData.access_token);",
              "",
              "pm.test(\"Response status code is 200\", function () {",
              "    pm.expect(pm.response.code).to.equal(200);",
              "});",
              "",
              "// Test to validate the response schema",
              "pm.test(\"Response schema is valid\", function () {",
              "  var schema = {",
              "    type: \"object\",",
              "    properties: {",
              "      access_token: { type: \"string\" },",
              "      expires_in: { type: \"number\" },",
              "      token_type: { type: \"string\" },",
              "      scope: { type: \"string\" }",
              "    },",
              "    required: [\"access_token\", \"expires_in\", \"token_type\", \"scope\"]",
              "  };",
              "",
              "  pm.expect(tv4.validate(pm.response.json(), schema)).to.be.true;",
              "});",
              "",
              "",
              "pm.test(\"Content-Type is application/json\", function () {",
              "    pm.expect(pm.response.headers.get(\"Content-Type\")).to.include(\"application/json\");",
              "});",
              "",
              "",
              "pm.test(\"Access token is a non-empty string\", function () {",
              "    const responseData = pm.response.json();",
              "    pm.expect(responseData.access_token).to.be.a('string').and.to.have.lengthOf.at.least(1, \"Access token should not be empty\");",
              "});",
              "",
              "",
              "pm.test(\"Expires in is a non-negative number\", function () {",
              "    const responseData = pm.response.json();",
              "    pm.expect(responseData.expires_in).to.be.at.least(0);",
              "});",
              "",
              "",
              "pm.test(\"Token type is a non-empty string\", function () {",
              "    const responseData = pm.response.json();",
              "",
              "    pm.expect(responseData).to.be.an('object');",
              "    pm.expect(responseData.token_type).to.be.a('string').and.to.have.lengthOf.at.least(1, \"Token type should not be empty\");",
              "});"
            ],
            "type": "text/javascript",
            "packages": {}
          }
        },
        {
          "listen": "prerequest",
          "script": {
            "id": "90a720b8-f1bc-4dd7-89ba-2cc71dcc5e77",
            "exec": [
              ""
            ],
            "type": "text/javascript",
            "packages": {}
          }
        }
      ],
      "id": "5b8dd722-f7ef-4bd2-a6cd-cdf5d1a54c81",
      "protocolProfileBehavior": {
        "disableBodyPruning": true
      },
      "request": {
        "method": "POST",
        "header": [],
        "body": {
          "mode": "urlencoded",
          "urlencoded": [
            {
              "key": "grant_type",
              "value": "client_credentials",
              "type": "text"
            },
            {
              "key": "scope",
              "value": "runtimeApi",
              "type": "text"
            },
            {
              "key": "client_id",
              "value": "runtimeClient",
              "type": "text"
            },
            {
              "key": "client_secret",
              "value": "{{ZORAL_CLIENT_SECRET}}",
              "type": "text"
            }
          ]
        },
        "url": "{{URL_ZORAL_AUTH}}/connect/token"
      },
      "response": []
    },
    {
      "name": "Call Flow 2 with cif Case",
      "event": [
        {
          "listen": "prerequest",
          "script": {
            "id": "8eb57350-16c3-46d0-b525-52478c5ffab0",
            "exec": [
              ""
            ],
            "type": "text/javascript",
            "packages": {}
          }
        },
        {
          "listen": "test",
          "script": {
            "id": "87030067-6018-48cc-864d-bd64925ea39a",
            "exec": [
              "pm.test(\"Response status code is 200\", function () {",
              "    pm.expect(pm.response.code).to.equal(200);",
              "});",
              "",
              "pm.test(\"Validate response schema\", function () {",
              "    var schema = {",
              "        type: \"object\",",
              "        properties: {",
              "            CompletedEndEventName: { type: \"string\" },",
              "            ErrorDescription: { type: [\"string\", \"null\"] },",
              "            EventName: { type: \"string\" },",
              "            IsChildResponse: { type: \"boolean\" },",
              "            IsCompleted: { type: \"boolean\" },",
              "            IsFailed: { type: \"boolean\" },",
              "            IsLightweight: { type: \"boolean\" },",
              "            Exception: { type: [\"object\", \"null\"] },",
              "            DataContextRevision: { type: \"number\" },",
              "            Headers: { type: \"object\" },",
              "            RequestId: { type: \"string\" },",
              "            SettingsProfile: { type: [\"object\", \"null\"] },",
              "            StatusCode: { type: [\"number\", \"null\"] },",
              "            WorkflowName: { type: \"string\" },",
              "            WorkflowOutput: {",
              "                type: \"object\",",
              "                properties: {",
              "                    status: {",
              "                        type: \"object\",",
              "                        properties: {",
              "                            code: { type: \"number\" },",
              "                            header: { type: \"string\" },",
              "                            description: { type: \"string\" }",
              "                        }",
              "                    },",
              "                    data: {",
              "                        type: \"object\",",
              "                        properties: {",
              "                            applicationId: { type: \"string\" },",
              "                            cifNo: { type: \"string\" },",
              "                            juristicName: { type: \"string\" }",
              "                        }",
              "                    }",
              "                }",
              "            },",
              "            WorkflowRevision: { type: \"number\" },",
              "            WorkflowVersion: { type: \"number\" }",
              "        },",
              "        required: [\"CompletedEndEventName\", \"EventName\", \"IsChildResponse\", \"IsCompleted\", \"IsFailed\", \"IsLightweight\", \"DataContextRevision\", \"Headers\", \"RequestId\", \"WorkflowOutput\", \"WorkflowRevision\", \"WorkflowVersion\"]",
              "    };",
              "",
              "    pm.expect(tv4.validate(pm.response.json(), schema)).to.be.true;",
              "});",
              "",
              "",
              "pm.test(\"Verify that the WorkflowOutput status code is a non-negative integer\", function () {",
              "    const responseData = pm.response.json();",
              "    ",
              "    pm.expect(responseData.WorkflowOutput.status.code).to.be.a('number');",
              "    pm.expect(responseData.WorkflowOutput.status.code).to.be.at.least(0);",
              "});",
              "",
              "",
              "pm.test(\"Ensure non-empty strings for WorkflowOutput data\", function () {",
              "    const responseData = pm.response.json();",
              "    ",
              "    pm.expect(responseData.WorkflowOutput).to.exist.and.to.be.an('object');",
              "    ",
              "    pm.expect(responseData.WorkflowOutput.data).to.exist.and.to.be.an('object');",
              "    ",
              "    pm.expect(responseData.WorkflowOutput.data.applicationId).to.exist.and.to.be.a('string').and.to.have.lengthOf.at.least(1, \"Value should not be empty\");",
              "    ",
              "    pm.expect(responseData.WorkflowOutput.data.cifNo).to.exist.and.to.be.a('string').and.to.have.lengthOf.at.least(1, \"Value should not be empty\");",
              "    ",
              "    pm.expect(responseData.WorkflowOutput.data.juristicName).to.exist.and.to.be.a('string').and.to.have.lengthOf.at.least(1, \"Value should not be empty\");",
              "});",
              "",
              "",
              "pm.test(\"IsCompleted, IsFailed, and IsLightweight are boolean values\", function () {",
              "    const responseData = pm.response.json();",
              "    ",
              "    pm.expect(responseData).to.be.an('object');",
              "    pm.expect(responseData.IsCompleted).to.be.a('boolean');",
              "    pm.expect(responseData.IsFailed).to.be.a('boolean');",
              "    pm.expect(responseData.IsLightweight).to.be.a('boolean');",
              "});",
              "",
              "",
              "pm.test(\"CompletedEndEventName, EventName, and WorkflowName are non-empty strings\", function () {",
              "    const responseData = pm.response.json();",
              "    ",
              "    pm.expect(responseData.CompletedEndEventName).to.be.a('string').and.to.have.lengthOf.at.least(1, \"Value should not be empty\");",
              "    pm.expect(responseData.EventName).to.be.a('string').and.to.have.lengthOf.at.least(1, \"Value should not be empty\");",
              "    pm.expect(responseData.WorkflowName).to.be.a('string').and.to.have.lengthOf.at.least(1, \"Value should not be empty\");",
              "});"
            ],
            "type": "text/javascript",
            "packages": {}
          }
        }
      ],
      "id": "5911bd58-fd87-4542-85d8-46aa06a6c097",
      "protocolProfileBehavior": {
        "disableBodyPruning": true
      },
      "request": {
        "auth": {
          "type": "bearer",
          "bearer": {
            "token": "{{apiKey}}"
          }
        },
        "method": "POST",
        "header": [
          {
            "key": "staffId",
            "value": "{{STAFF_ID}}"
          },
          {
            "key": "",
            "value": "",
            "disabled": true
          }
        ],
        "body": {
          "mode": "raw",
          "raw": "{\n    \"header\": {\n        \"staffId\":  \"{{staffId}}\"\n    },\n    \"payload\": {\n        \"cif\": \"315744761113\",\n        \"flow\": \"2\",\n        \"moduleCode\": \"CIF\",\n        \"workflowId\": \"{{workflowId}}\",\n        \"applicationData\": {\n            \"bankruptResult\": \"1\",\n            \"cddResult\": \"5\",\n            \"titleThCodeDesc\": \"กองทุนหมู่บ้าน\",\n            \"nameTh\": \"dss\",\n            \"bankBranchCode\": \"5\",\n            \"customerCode\": \"201\",\n            \"titleCode\": \"2901\",\n            \"taxId\": \"dds\"\n        }\n    }\n}",
          "options": {
            "raw": {
              "language": "json"
            }
          }
        },
        "url": {
          "raw": "{{URL_ZORAL}}/api/process/{{$randomUUID}}?workflowName=INT_CIF_initial_corp_trans",
          "host": [
            "{{URL_ZORAL}}"
          ],
          "path": [
            "api",
            "process",
            "{{$randomUUID}}"
          ],
          "query": [
            {
              "key": "workflowName",
              "value": "INT_CIF_initial_corp_trans"
            }
          ]
        }
      },
      "response": []
    },
    {
      "name": "Call Flow 2 with cif Case Copy",
      "event": [
        {
          "listen": "prerequest",
          "script": {
            "id": "8eb57350-16c3-46d0-b525-52478c5ffab0",
            "exec": [
              ""
            ],
            "type": "text/javascript",
            "packages": {}
          }
        },
        {
          "listen": "test",
          "script": {
            "id": "87030067-6018-48cc-864d-bd64925ea39a",
            "exec": [
              "pm.test(\"Response status code is 200\", function () {",
              "    pm.expect(pm.response.code).to.equal(200);",
              "});",
              "",
              "",
              "pm.test(\"Response has the required fields\", function () {",
              "    const responseData = pm.response.json();",
              "    ",
              "    const requiredFields = [",
              "        \"CompletedEndEventName\",",
              "        \"IsChildResponse\",",
              "        \"IsCompleted\",",
              "        \"IsFailed\",",
              "        \"IsLightweight\",",
              "        \"Exception\",",
              "        \"DataContextRevision\",",
              "        \"RequestId\",",
              "        \"StatusCode\",",
              "        \"WorkflowName\",",
              "        \"WorkflowOutput\",",
              "        \"WorkflowRevision\",",
              "        \"WorkflowVersion\"",
              "    ];",
              "    ",
              "    requiredFields.forEach(field => {",
              "        pm.expect(responseData).to.have.property(field);",
              "    });",
              "});",
              "",
              "",
              "pm.test(\"Validate the structure and content of WorkflowOutput\", function () {",
              "  const responseData = pm.response.json();",
              "",
              "  pm.expect(responseData.WorkflowOutput).to.exist.and.to.be.an('object');",
              "  pm.expect(responseData.WorkflowOutput.status).to.exist.and.to.be.an('object');",
              "  pm.expect(responseData.WorkflowOutput.status.code).to.exist.and.to.be.a('number');",
              "  pm.expect(responseData.WorkflowOutput.status.description).to.exist.and.to.be.a('string');",
              "  pm.expect(responseData.WorkflowOutput.status.header).to.exist.and.to.be.a('string');",
              "  pm.expect(responseData.WorkflowOutput.data).to.exist.and.to.be.an('object');",
              "  pm.expect(responseData.WorkflowOutput.data.applicationId).to.exist.and.to.be.a('string');",
              "  pm.expect(responseData.WorkflowOutput.data.cifNo).to.exist.and.to.be.a('string');",
              "  pm.expect(responseData.WorkflowOutput.data.juristicName).to.exist.and.to.be.a('string');",
              "});",
              "",
              "",
              "pm.test(\"Check if the WorkflowOutput status code is a non-negative integer\", function () {",
              "  const responseData = pm.response.json();",
              "",
              "  pm.expect(responseData.WorkflowOutput.status.code).to.be.a('number').and.to.be.at.least(0);",
              "});",
              "",
              "",
              "pm.test(\"Verify WorkflowOutput data contains applicationId, cifNo, and juristicName\", function () {",
              "  const responseData = pm.response.json();",
              "  ",
              "  pm.expect(responseData.WorkflowOutput).to.exist.and.to.be.an('object');",
              "  pm.expect(responseData.WorkflowOutput.data.applicationId).to.exist;",
              "  pm.expect(responseData.WorkflowOutput.data.cifNo).to.exist;",
              "  pm.expect(responseData.WorkflowOutput.data.juristicName).to.exist;",
              "});",
              ""
            ],
            "type": "text/javascript",
            "packages": {}
          }
        }
      ],
      "id": "20c9d546-57e2-47d4-8bdd-4f0977bdb7e1",
      "protocolProfileBehavior": {
        "disableBodyPruning": true
      },
      "request": {
        "auth": {
          "type": "bearer",
          "bearer": {
            "token": "{{apiKey}}"
          }
        },
        "method": "POST",
        "header": [
          {
            "key": "staffId",
            "value": "{{STAFF_ID}}"
          },
          {
            "key": "",
            "value": "",
            "disabled": true
          }
        ],
        "body": {
          "mode": "raw",
          "raw": "{\n    \"header\": {\n        \"staffId\":  \"{{staffId}}\"\n    },\n    \"payload\": {\n        \"cif\": \"315744761113315744761113\",\n        \"flow\": \"2\",\n        \"moduleCode\": \"CIF\",\n        \"workflowId\": \"{{workflowId}}\",\n        \"applicationData\": {\n            \"bankruptResult\": \"1\",\n            \"cddResult\": \"5\",\n            \"titleThCodeDesc\": \"กองทุนหมู่บ้าน\",\n            \"nameTh\": \"dss\",\n            \"bankBranchCode\": \"5\",\n            \"customerCode\": \"201\",\n            \"titleCode\": \"2901\",\n            \"taxId\": \"dds\"\n        }\n    }\n}",
          "options": {
            "raw": {
              "language": "json"
            }
          }
        },
        "url": {
          "raw": "{{URL_ZORAL}}/api/process/{{$randomUUID}}?workflowName=INT_CIF_initial_corp_trans",
          "host": [
            "{{URL_ZORAL}}"
          ],
          "path": [
            "api",
            "process",
            "{{$randomUUID}}"
          ],
          "query": [
            {
              "key": "workflowName",
              "value": "INT_CIF_initial_corp_trans"
            }
          ]
        }
      },
      "response": []
    },
    {
      "name": "Call Flow 2 with cif and cid  Case",
      "event": [
        {
          "listen": "test",
          "script": {
            "id": "629963f2-32fd-4963-bdca-8f2bc93e7720",
            "exec": [
              "pm.test(\"Response schema is valid\", function () {",
              "  var schema = {",
              "    type: \"object\",",
              "    properties: {",
              "      CompletedEndEventName: { type: [\"string\", \"null\"] },",
              "      ErrorDescription: { type: [\"string\", \"null\"] },",
              "      EventName: { type: \"string\" },",
              "      IsChildResponse: { type: \"boolean\" },",
              "      IsCompleted: { type: \"boolean\" },",
              "      IsFailed: { type: \"boolean\" },",
              "      IsLightweight: { type: \"boolean\" },",
              "      Exception: { type: [\"object\", \"null\"] },",
              "      DataContextRevision: { type: \"number\" },",
              "      Headers: { type: \"object\" },",
              "      RequestId: { type: \"string\" },",
              "      SettingsProfile: { type: [\"object\", \"null\"] },",
              "      StatusCode: { type: [\"number\", \"null\"] },",
              "      WorkflowName: { type: \"string\" },",
              "      WorkflowOutput: {",
              "        type: \"object\",",
              "        properties: {",
              "          status: {",
              "            type: \"object\",",
              "            properties: {",
              "              code: { type: \"number\" },",
              "              header: { type: \"string\" },",
              "              description: { type: \"string\" },",
              "            },",
              "            required: [\"code\", \"header\", \"description\"],",
              "          },",
              "          data: {",
              "            type: \"object\",",
              "            properties: {",
              "              applicationId: { type: \"string\" },",
              "              cifNo: { type: \"string\" },",
              "              juristicName: { type: \"string\" },",
              "            },",
              "            required: [\"applicationId\", \"cifNo\", \"juristicName\"],",
              "          },",
              "        },",
              "        required: [\"status\", \"data\"],",
              "      },",
              "      WorkflowRevision: { type: \"number\" },",
              "      WorkflowVersion: { type: \"number\" },",
              "    },",
              "    required: [",
              "      \"EventName\",",
              "      \"IsChildResponse\",",
              "      \"IsCompleted\",",
              "      \"IsFailed\",",
              "      \"IsLightweight\",",
              "      \"DataContextRevision\",",
              "      \"Headers\",",
              "      \"RequestId\",",
              "      \"WorkflowName\",",
              "      \"WorkflowOutput\",",
              "      \"WorkflowRevision\",",
              "      \"WorkflowVersion\",",
              "    ],",
              "  };",
              "",
              "  var response = pm.response.json();",
              "  pm.expect(tv4.validate(response, schema)).to.be.true;",
              "});",
              "",
              "",
              "pm.test(\"Response status code is 200\", function () {",
              "    pm.expect(pm.response.code).to.equal(200);",
              "});",
              "",
              "",
              "pm.test(\"Content-Type header is application/json\", function () {",
              "    pm.expect(pm.response.headers.get(\"Content-Type\")).to.include(\"application/json\");",
              "});",
              "",
              "",
              "pm.test(\"Validate the structure of the WorkflowOutput object\", function () {",
              "    const responseData = pm.response.json();",
              "    ",
              "    pm.expect(responseData.WorkflowOutput).to.exist.and.to.be.an('object');",
              "    pm.expect(responseData.WorkflowOutput.status).to.exist.and.to.be.an('object');",
              "    pm.expect(responseData.WorkflowOutput.data).to.exist.and.to.be.an('object');",
              "});",
              "",
              "",
              "pm.test(\"Ensure that the WorkflowOutput status code is a non-negative number\", function () {",
              "    const responseData = pm.response.json();",
              "    ",
              "    pm.expect(responseData.WorkflowOutput.status.code).to.be.a('number');",
              "    pm.expect(responseData.WorkflowOutput.status.code).to.be.at.least(0);",
              "});",
              "",
              "",
              "pm.test(\"WorkflowOutput data contains non-empty strings for applicationId, cifNo, and juristicName\", function () {",
              "    const responseData = pm.response.json();",
              "    ",
              "    pm.expect(responseData.WorkflowOutput.data.applicationId).to.be.a('string').and.to.have.lengthOf.at.least(1, \"Value should not be empty\");",
              "    pm.expect(responseData.WorkflowOutput.data.cifNo).to.be.a('string').and.to.have.lengthOf.at.least(1, \"Value should not be empty\");",
              "    pm.expect(responseData.WorkflowOutput.data.juristicName).to.be.a('string').and.to.have.lengthOf.at.least(1, \"Value should not be empty\");",
              "});",
              "",
              ""
            ],
            "type": "text/javascript",
            "packages": {}
          }
        }
      ],
      "id": "04b63c02-cd03-4443-93d6-20bf4d52ff41",
      "protocolProfileBehavior": {
        "disableBodyPruning": true
      },
      "request": {
        "auth": {
          "type": "bearer",
          "bearer": {
            "token": "{{apiKey}}"
          }
        },
        "method": "POST",
        "header": [
          {
            "key": "staffId",
            "value": "{{STAFF_ID}}"
          },
          {
            "key": "",
            "value": "",
            "disabled": true
          }
        ],
        "body": {
          "mode": "raw",
          "raw": "{\n    \"header\": {\n        \"staffId\":  \"{{staffId}}\"\n    },\n    \"payload\": {\n        \"cid\": \"315744761113\",\n        \"cif\": \"315744761113\",\n        \"flow\": \"2\",\n        \"moduleCode\": \"CIF\",\n        \"workflowId\": \"{{workflowId}}\",\n        \"applicationData\": {\n            \"bankruptResult\": \"1\",\n            \"cddResult\": \"5\",\n            \"titleThCodeDesc\": \"กองทุนหมู่บ้าน\",\n            \"nameTh\": \"dss\",\n            \"bankBranchCode\": \"5\",\n            \"customerCode\": \"201\",\n            \"titleCode\": \"2901\",\n            \"taxId\": \"dds\"\n        }\n    }\n}",
          "options": {
            "raw": {
              "language": "json"
            }
          }
        },
        "url": {
          "raw": "{{URL_ZORAL}}/api/process/{{$randomUUID}}?workflowName=INT_CIF_initial_corp_trans",
          "host": [
            "{{URL_ZORAL}}"
          ],
          "path": [
            "api",
            "process",
            "{{$randomUUID}}"
          ],
          "query": [
            {
              "key": "workflowName",
              "value": "INT_CIF_initial_corp_trans"
            }
          ]
        }
      },
      "response": []
    },
    {
      "name": "Call Flow 2 with cid and CBS mock empty value  Case",
      "event": [
        {
          "listen": "test",
          "script": {
            "id": "6782ef96-07c3-4c3a-99d6-dfed8fbe298d",
            "exec": [
              "pm.test(\"Response schema is valid\", function () {",
              "    var schema = {",
              "        type: \"object\",",
              "        properties: {",
              "            CompletedEndEventName: { type: [\"string\", \"null\"] },",
              "            ErrorDescription: { type: [\"string\", \"null\"] },",
              "            EventName: { type: \"string\" },",
              "            IsChildResponse: { type: \"boolean\" },",
              "            IsCompleted: { type: \"boolean\" },",
              "            IsFailed: { type: \"boolean\" },",
              "            IsLightweight: { type: \"boolean\" },",
              "            Exception: { type: [\"object\", \"null\"] },",
              "            DataContextRevision: { type: \"number\" },",
              "            Headers: { type: \"object\" },",
              "            RequestId: { type: \"string\" },",
              "            SettingsProfile: { type: [\"object\", \"null\"] },",
              "            StatusCode: { type: [\"number\", \"null\"] },",
              "            WorkflowName: { type: \"string\" },",
              "            WorkflowOutput: {",
              "                type: \"object\",",
              "                properties: {",
              "                    status: {",
              "                        type: \"object\",",
              "                        properties: {",
              "                            code: { type: \"number\" },",
              "                            header: { type: \"string\" },",
              "                            description: { type: \"string\" },",
              "                        },",
              "                        required: [\"code\", \"header\", \"description\"],",
              "                    },",
              "                    data: { type: [\"object\", \"null\"] }",
              "                },",
              "                required: [\"status\", \"data\"],",
              "            },",
              "            WorkflowRevision: { type: \"number\" },",
              "            WorkflowVersion: { type: \"number\" }",
              "        },",
              "        required: [",
              "            \"EventName\",",
              "            \"IsChildResponse\",",
              "            \"IsCompleted\",",
              "            \"IsFailed\",",
              "            \"IsLightweight\",",
              "            \"DataContextRevision\",",
              "            \"Headers\",",
              "            \"RequestId\",",
              "            \"WorkflowName\",",
              "            \"WorkflowOutput\",",
              "            \"WorkflowRevision\",",
              "            \"WorkflowVersion\"",
              "        ]",
              "    };",
              "",
              "    var response = pm.response.json();",
              "    pm.expect(tv4.validate(response, schema)).to.be.true;",
              "});",
              "",
              "pm.test(\"Response status code is 200\", function () {",
              "    pm.expect(pm.response.code).to.equal(200);",
              "});",
              "",
              "pm.test(\"Content-Type header is application/json\", function () {",
              "    pm.expect(pm.response.headers.get(\"Content-Type\")).to.include(\"application/json\");",
              "});",
              "",
              "pm.test(\"Validate the structure of the WorkflowOutput object\", function () {",
              "    const responseData = pm.response.json();",
              "    ",
              "    pm.expect(responseData.WorkflowOutput).to.exist.and.to.be.an('object');",
              "    pm.expect(responseData.WorkflowOutput.status).to.exist.and.to.be.an('object');",
              "    pm.expect(responseData.WorkflowOutput).to.have.property('data');",
              "});",
              "",
              "pm.test(\"Ensure that the WorkflowOutput status code is a non-negative number\", function () {",
              "    const responseData = pm.response.json();",
              "",
              "    pm.expect(responseData.WorkflowOutput.status.code).to.be.a('number');",
              "    pm.expect(responseData.WorkflowOutput.status.code).to.be.at.least(0);",
              "});",
              "",
              "pm.test(\"WorkflowOutput data can be null or should contain non-empty strings for applicationId, cifNo, and juristicName\", function () {",
              "    const responseData = pm.response.json();",
              "",
              "    if (responseData.WorkflowOutput.data !== null) {",
              "        pm.expect(responseData.WorkflowOutput.data.applicationId).to.be.a('string').and.to.have.lengthOf.at.least(1, \"Value should not be empty\");",
              "        pm.expect(responseData.WorkflowOutput.data.cifNo).to.be.a('string').and.to.have.lengthOf.at.least(1, \"Value should not be empty\");",
              "        pm.expect(responseData.WorkflowOutput.data.juristicName).to.be.a('string').and.to.have.lengthOf.at.least(1, \"Value should not be empty\");",
              "    }",
              "});"
            ],
            "type": "text/javascript",
            "packages": {}
          }
        }
      ],
      "id": "775953d9-d5e8-49a9-9e9e-2d21b80a73ce",
      "protocolProfileBehavior": {
        "disableBodyPruning": true
      },
      "request": {
        "auth": {
          "type": "bearer",
          "bearer": {
            "token": "{{apiKey}}"
          }
        },
        "method": "POST",
        "header": [
          {
            "key": "staffId",
            "value": "{{STAFF_ID}}"
          },
          {
            "key": "",
            "value": "",
            "disabled": true
          }
        ],
        "body": {
          "mode": "raw",
          "raw": "{\n  \"header\": {\n    \"staffId\":  \"{{staffId}}\",\n    \"branchCode\": \"5\",\n    \"workflowId\": \"{{workflowId}}\"\n  },\n  \"payload\": {\n    \"flow\": \"2\",\n    \"moduleCode\": \"CPL\",\n    \"cid\": \"1409901201998\"\n  }\n}",
          "options": {
            "raw": {
              "language": "json"
            }
          }
        },
        "url": {
          "raw": "{{URL_ZORAL}}/api/process/{{$randomUUID}}?workflowName=INT_CIF_initial_corp_trans",
          "host": [
            "{{URL_ZORAL}}"
          ],
          "path": [
            "api",
            "process",
            "{{$randomUUID}}"
          ],
          "query": [
            {
              "key": "workflowName",
              "value": "INT_CIF_initial_corp_trans"
            }
          ]
        }
      },
      "response": []
    },
    {
      "name": "Call with applicationID  Case",
      "event": [
        {
          "listen": "test",
          "script": {
            "id": "1ac87d43-3d27-46a5-8b5f-6334b57d2540",
            "exec": [
              "pm.test(\"Response schema is valid\", function () {",
              "    var schema = {",
              "        type: \"object\",",
              "        properties: {",
              "            CompletedEndEventName: { type: [\"string\", \"null\"] },",
              "            ErrorDescription: { type: [\"string\", \"null\"] },",
              "            EventName: { type: \"string\" },",
              "            IsChildResponse: { type: \"boolean\" },",
              "            IsCompleted: { type: \"boolean\" },",
              "            IsFailed: { type: \"boolean\" },",
              "            IsLightweight: { type: \"boolean\" },",
              "            Exception: { type: [\"object\", \"null\"] },",
              "            DataContextRevision: { type: \"number\" },",
              "            Headers: { type: \"object\" },",
              "            RequestId: { type: \"string\" },",
              "            SettingsProfile: { type: [\"object\", \"null\"] },",
              "            StatusCode: { type: [\"number\", \"null\"] },",
              "            WorkflowName: { type: \"string\" },",
              "            WorkflowOutput: {",
              "                type: \"object\",",
              "                properties: {",
              "                    status: {",
              "                        type: \"object\",",
              "                        properties: {",
              "                            code: { type: \"number\" },",
              "                            header: { type: \"string\" },",
              "                            description: { type: \"string\" },",
              "                        },",
              "                        required: [\"code\", \"header\", \"description\"],",
              "                    },",
              "                    data: {",
              "                        type: \"object\",",
              "                        properties: {",
              "                            applicationId: { type: \"string\" },",
              "                            juristicName: { type: \"string\" },",
              "                        },",
              "                        required: [\"applicationId\", \"juristicName\"],",
              "                    },",
              "                },",
              "                required: [\"status\", \"data\"],",
              "            },",
              "            WorkflowRevision: { type: \"number\" },",
              "            WorkflowVersion: { type: \"number\" },",
              "        },",
              "        required: [",
              "            \"EventName\",",
              "            \"IsChildResponse\",",
              "            \"IsCompleted\",",
              "            \"IsFailed\",",
              "            \"IsLightweight\",",
              "            \"DataContextRevision\",",
              "            \"Headers\",",
              "            \"RequestId\",",
              "            \"WorkflowName\",",
              "            \"WorkflowOutput\",",
              "            \"WorkflowRevision\",",
              "            \"WorkflowVersion\",",
              "        ],",
              "    };",
              "",
              "    var response = pm.response.json();",
              "    pm.expect(tv4.validate(response, schema)).to.be.true;",
              "});",
              "",
              "pm.test(\"Response status code is 200\", function () {",
              "    pm.expect(pm.response.code).to.equal(200);",
              "});",
              "",
              "pm.test(\"Content-Type header is application/json\", function () {",
              "    pm.expect(pm.response.headers.get(\"Content-Type\")).to.include(\"application/json\");",
              "});",
              "",
              "pm.test(\"Validate the structure of the WorkflowOutput object\", function () {",
              "    const responseData = pm.response.json();",
              "    ",
              "    pm.expect(responseData.WorkflowOutput).to.exist.and.to.be.an('object');",
              "    pm.expect(responseData.WorkflowOutput.status).to.exist.and.to.be.an('object');",
              "    pm.expect(responseData.WorkflowOutput.data).to.exist.and.to.be.an('object');",
              "});",
              "",
              "pm.test(\"Ensure that the WorkflowOutput status code is a non-negative number\", function () {",
              "    const responseData = pm.response.json();",
              "",
              "    pm.expect(responseData.WorkflowOutput.status.code).to.be.a('number');",
              "    pm.expect(responseData.WorkflowOutput.status.code).to.be.at.least(0);",
              "});",
              "",
              "pm.test(\"WorkflowOutput data contains non-empty strings for applicationId and juristicName\", function () {",
              "    const responseData = pm.response.json();",
              "    ",
              "    pm.expect(responseData.WorkflowOutput.data.applicationId).to.be.a('string').and.to.have.lengthOf.at.least(1, \"Value should not be empty\");",
              "    pm.expect(responseData.WorkflowOutput.data.juristicName).to.be.a('string').and.to.have.lengthOf.at.least(1, \"Value should not be empty\");",
              "});"
            ],
            "type": "text/javascript",
            "packages": {}
          }
        }
      ],
      "id": "2cffdb43-209f-41de-a20e-d07d6a75124c",
      "protocolProfileBehavior": {
        "disableBodyPruning": true
      },
      "request": {
        "auth": {
          "type": "bearer",
          "bearer": {
            "token": "{{apiKey}}"
          }
        },
        "method": "POST",
        "header": [
          {
            "key": "staffId",
            "value": "{{STAFF_ID}}"
          },
          {
            "key": "",
            "value": "",
            "disabled": true
          }
        ],
        "body": {
          "mode": "raw",
          "raw": "{\n    \"header\": {\n        \"staffId\": \"{{staffId}}\"\n    },\n    \"payload\": {\n        \"workflowId\": \"{{workflowId}}\",\n        \"flow\":\"0\",\n        \"applicationId\": \"CPL2406090000004\",\n        \"applicationData\": {\n            \"bankruptResult\": \"1\",\n            \"cddResult\": \"5\",\n            \"titleThCodeDesc\": \"กองทุนหมู่บ้าน\",\n            \"nameTh\": \"dss\",\n            \"bankBranchCode\": \"5\",\n            \"customerCode\": \"201\",\n            \"titleCode\": \"2901\",\n            \"taxId\": \"dds\"\n        }\n    }\n}",
          "options": {
            "raw": {
              "language": "json"
            }
          }
        },
        "url": {
          "raw": "{{URL_ZORAL}}/api/process/{{$randomUUID}}?workflowName=INT_CIF_initial_corp_trans",
          "host": [
            "{{URL_ZORAL}}"
          ],
          "path": [
            "api",
            "process",
            "{{$randomUUID}}"
          ],
          "query": [
            {
              "key": "workflowName",
              "value": "INT_CIF_initial_corp_trans"
            }
          ]
        }
      },
      "response": []
    }
  ],
  "auth": {
    "type": "oauth2",
    "oauth2": {
      "tokenType": "Bearer",
      "accessToken": "eyJhbGciOiJSUzI1NiIsImtpZCI6IjZCNTlBOUVDOTRFRkMzNzIwQzAyREM2MTMyMDk2NTM0MDg0RTE0RTkiLCJ0eXAiOiJhdCtqd3QiLCJ4NXQiOiJhMW1wN0pUdnczSU1BdHhoTWdsbE5BaE9GT2sifQ.eyJuYmYiOjE3MTk3NDYxMjIsImV4cCI6MTcxOTc0OTcyMiwiaXNzIjoiaHR0cHM6Ly9hdXRoLmRldi56b3JhbC5ucC5iYWFjLmFlbGxhLnRlY2giLCJhdWQiOiJydW50aW1lQXBpIiwiY2xpZW50X2lkIjoicnVudGltZUNsaWVudCIsInJvbGUiOlsiRGVjaXNpb25FbmdpbmVXb3JrZmxvd1ZpZXdlciIsIkRlY2lzaW9uRW5naW5lV29ya2Zsb3dFZGl0b3IiXSwic2NvcGUiOlsicnVudGltZUFwaSJdfQ.QA43V3enJk6HOh0GvLa_AetxckQdx0u-1DVLlQcfSjqagnPXffGcUPUk8La29eFL-z6IvR5mmaJr1xA8tZsz-XLb0L3C4X-8N4_FgmlLX6M5EJqR7eNKQkL1KkYB50nchx1ZHOLyM-9kXGifyntXrDX-aVAxDLPzxBKWhGsNPLA-K5h7xfIIEORQ-hMFB1kddlDVlf45DPQ1bnsILaLwPCsGKwc7lPfelrtFnaOQDm4hJtX6mk40WUpTyTKCN0eVUt_0nIFMLLpcMxnD1bQ_kgCk57OVmFBjjO8Cz-YBxc1tiY0zxRgW31oHhHNVkthQKoggmD-eKHf9ivwXPn9G1A",
      "refreshRequestParams": [],
      "tokenRequestParams": [],
      "authRequestParams": [],
      "tokenName": "apiKey",
      "challengeAlgorithm": "S256",
      "scope": "runtimeApi",
      "grant_type": "client_credentials",
      "clientSecret": "{{ZORAL_CLIENT_SECRET}}",
      "clientId": "runtimeClient",
      "addTokenTo": "header",
      "client_authentication": "header",
      "accessTokenUrl": "{{URL_ZORAL_AUTH}}/connect/token"
    }
  },
  "event": [
    {
      "listen": "prerequest",
      "script": {
        "id": "cdbf3543-ca07-405a-9a2e-749362796f25",
        "type": "text/javascript",
        "packages": {},
        "exec": [
          ""
        ]
      }
    },
    {
      "listen": "test",
      "script": {
        "id": "de67eece-6799-4fd9-a979-e6fed759f97c",
        "type": "text/javascript",
        "packages": {},
        "exec": [
          ""
        ]
      }
    }
  ]
}