<svg xmlns="http://www.w3.org/2000/svg" version="1.0" width="512.000000pt" height="512.000000pt" viewBox="0 0 512.000000 512.000000" preserveAspectRatio="xMidYMid meet">

<g transform="translate(0.000000,512.000000) scale(0.100000,-0.100000)" fill="#4945fe" stroke="none">
<path d="M2285 4675 c-811 -106 -1495 -672 -1749 -1446 -75 -229 -106 -422 -106 -669 0 -247 31 -440 106 -669 105 -319 274 -592 518 -837 183 -182 348 -300 571 -410 588 -287 1288 -287 1870 0 967 478 1426 1577 1084 2601 -258 775 -967 1345 -1781 1434 -128 14 -388 12 -513 -4z m1110 -1485 c63 -39 88 -138 52 -205 -8 -16 -249 -263 -534 -547 -570 -569 -554 -555 -645 -529 -36 11 -86 55 -311 279 -148 147 -276 281 -284 297 -23 42 -21 114 3 156 37 63 122 94 191 69 15 -6 121 -104 236 -218 l207 -207 458 458 c298 298 468 461 487 467 40 12 102 3 140 -20z" fill="#4945fe"/>
</g>
</svg>