<svg xmlns="http://www.w3.org/2000/svg" width="43" height="35" viewBox="0 0 43 35">
    <text fill="#1D1D1D" fill-rule="evenodd" font-family="FontAwesome" font-size="48" transform="translate(-902 -1541)">
        <tspan x="901" y="1576"></tspan>
    </text>
</svg>
