{
	"credit": "Made with Blockbench",
	"textures": {
		"0": "item/sparmask",
		"particle": "item/sparmask"
	},
	"elements": [
		{
			"from": [9, 3, 7],
			"to": [12, 5, 8],
			"rotation": {"angle": 0, "axis": "y", "origin": [16, 10, 15]},
			"faces": {
				"north": {"uv": [9, 13, 12, 16], "texture": "#0"},
				"east": {"uv": [6, 11, 7, 13], "texture": "#0"},
				"south": {"uv": [0, 0, 3, 2], "texture": "#missing"},
				"west": {"uv": [6, 12, 7, 14], "texture": "#0"},
				"up": {"uv": [4, 0, 7, 1], "texture": "#0"},
				"down": {"uv": [12, 9, 15, 10], "texture": "#0"}
			}
		},
		{
			"from": [9, 2, 8],
			"to": [12, 7, 9],
			"rotation": {"angle": 0, "axis": "y", "origin": [16, 10, 16]},
			"faces": {
				"north": {"uv": [13, 4, 16, 16], "texture": "#0"},
				"east": {"uv": [6, 0, 7, 8], "texture": "#0"},
				"south": {"uv": [12, 5, 15, 8], "texture": "#0"},
				"west": {"uv": [15, 8, 16, 16], "texture": "#0"},
				"up": {"uv": [0, 0, 3, 1], "texture": "#missing"},
				"down": {"uv": [6, 6, 7, 7], "texture": "#0"}
			}
		},
		{
			"from": [9, 7, 7.5],
			"to": [12, 10, 9],
			"rotation": {"angle": 0, "axis": "y", "origin": [16, 17, 16]},
			"faces": {
				"north": {"uv": [4, 1, 7, 4], "texture": "#0"},
				"east": {"uv": [6, 12, 7.5, 15], "texture": "#0"},
				"south": {"uv": [12, 3, 15, 6], "texture": "#0"},
				"west": {"uv": [4, 12, 5.5, 15], "texture": "#0"},
				"up": {"uv": [5, 1, 8, 2.5], "texture": "#0"},
				"down": {"uv": [12, 3, 15, 4.5], "texture": "#0"}
			}
		},
		{
			"from": [12, 8, 8.5],
			"to": [13, 11, 9],
			"rotation": {"angle": 0, "axis": "y", "origin": [19, 17, 16]},
			"faces": {
				"north": {"uv": [3, 0, 4, 10], "texture": "#0"},
				"east": {"uv": [2.5, 0, 3.5, 5], "texture": "#0"},
				"south": {"uv": [14, 3, 15, 6], "texture": "#0"},
				"west": {"uv": [3, 0, 3.5, 1.5], "texture": "#0"},
				"up": {"uv": [3, 0, 4, 0.5], "texture": "#0"},
				"down": {"uv": [0, 0, 1, 0.5], "texture": "#missing"}
			}
		},
		{
			"from": [9, 10, 8.5],
			"to": [10, 12, 9],
			"rotation": {"angle": 0, "axis": "y", "origin": [16, 18, 16]},
			"faces": {
				"north": {"uv": [3, 0, 4, 11], "texture": "#0"},
				"east": {"uv": [3, 12, 3.5, 13.5], "texture": "#0"},
				"south": {"uv": [13, 5, 14, 7], "texture": "#0"},
				"west": {"uv": [3, 14, 3.5, 16], "texture": "#0"},
				"up": {"uv": [3, 0, 4, 0.5], "texture": "#0"},
				"down": {"uv": [0, 0, 1, 0.5], "texture": "#missing"}
			}
		},
		{
			"from": [10.5, 10, 8.5],
			"to": [11.5, 11.5, 9],
			"rotation": {"angle": 0, "axis": "y", "origin": [18, 18, 16]},
			"faces": {
				"north": {"uv": [3, 0, 4, 10.5], "texture": "#0"},
				"east": {"uv": [3, 12, 3.5, 13.5], "texture": "#0"},
				"south": {"uv": [13, 5, 14, 7], "texture": "#0"},
				"west": {"uv": [3, 0, 3.5, 1.5], "texture": "#0"},
				"up": {"uv": [3, 0, 4, 0.5], "texture": "#0"},
				"down": {"uv": [0, 0, 1, 0.5], "texture": "#missing"}
			}
		},
		{
			"from": [9, 6, 7.5],
			"to": [10, 7, 8],
			"rotation": {"angle": 0, "axis": "y", "origin": [15, 16, 15]},
			"faces": {
				"north": {"uv": [6, 7, 7, 8], "texture": "#0"},
				"east": {"uv": [11, 5, 11.5, 6], "texture": "#0"},
				"south": {"uv": [0, 0, 1, 1], "texture": "#missing"},
				"west": {"uv": [11, 8, 11.5, 9], "texture": "#0"},
				"up": {"uv": [0, 0, 1, 0.5], "texture": "#missing"},
				"down": {"uv": [0, 0, 1, 0.5], "texture": "#missing"}
			}
		},
		{
			"from": [8.5, 5, 8],
			"to": [9.1, 8, 8.5],
			"rotation": {"angle": 0, "axis": "y", "origin": [14, 15, 15]},
			"faces": {
				"north": {"uv": [8, 11, 8.6, 14], "texture": "#0"},
				"east": {"uv": [0, 0, 0.5, 3], "texture": "#missing"},
				"south": {"uv": [10, 4, 10.6, 7], "texture": "#0"},
				"west": {"uv": [11, 13, 11.5, 16], "texture": "#0"},
				"up": {"uv": [0, 0, 0.6, 0.5], "texture": "#missing"},
				"down": {"uv": [0, 0, 0.6, 0.5], "texture": "#missing"}
			}
		},
		{
			"from": [8.5, 8, 8],
			"to": [12.5, 10.5, 8.5],
			"rotation": {"angle": 0, "axis": "y", "origin": [15, 18, 15]},
			"faces": {
				"north": {"uv": [4, 0, 8, 2.5], "texture": "#0"},
				"east": {"uv": [4, 9, 4.5, 11.5], "texture": "#0"},
				"south": {"uv": [8, 4, 10, 6.5], "texture": "#0"},
				"west": {"uv": [3, 13, 3.5, 15.5], "texture": "#0"},
				"up": {"uv": [4, 0, 8, 0.5], "texture": "#0"},
				"down": {"uv": [0, 0, 4, 0.5], "texture": "#missing"}
			}
		},
		{
			"from": [8, 7, 8],
			"to": [8.5, 9.5, 8.5],
			"rotation": {"angle": 0, "axis": "y", "origin": [14, 17, 15]},
			"faces": {
				"north": {"uv": [13, 0, 13.5, 2.5], "texture": "#0"},
				"east": {"uv": [0, 0, 0.5, 2.5], "texture": "#missing"},
				"south": {"uv": [9, 5, 9.5, 7.5], "texture": "#0"},
				"west": {"uv": [12, 9, 12.5, 11.5], "texture": "#0"},
				"up": {"uv": [6, 0, 6.5, 0.5], "texture": "#0"},
				"down": {"uv": [9, 9, 9.5, 9.5], "texture": "#0"}
			}
		},
		{
			"from": [12, 6, 7.5],
			"to": [13, 8, 8],
			"rotation": {"angle": 0, "axis": "y", "origin": [18, 16, 15]},
			"faces": {
				"north": {"uv": [5, 2, 6, 4], "texture": "#0"},
				"east": {"uv": [0, 0, 0.5, 2], "texture": "#missing"},
				"south": {"uv": [0, 0, 1, 2], "texture": "#missing"},
				"west": {"uv": [11, 5, 11.5, 7], "texture": "#0"},
				"up": {"uv": [0, 0, 1, 0.5], "texture": "#missing"},
				"down": {"uv": [0, 0, 1, 0.5], "texture": "#missing"}
			}
		},
		{
			"from": [9, 5, 7.5],
			"to": [12, 6, 8],
			"rotation": {"angle": 0, "axis": "y", "origin": [15, 15, 15]},
			"faces": {
				"north": {"uv": [4, 7, 7, 8], "texture": "#0"},
				"east": {"uv": [0, 0, 0.5, 1], "texture": "#missing"},
				"south": {"uv": [0, 0, 3, 1], "texture": "#missing"},
				"west": {"uv": [13, 8, 13.5, 9], "texture": "#0"},
				"up": {"uv": [12, 4, 15, 4.5], "texture": "#0"},
				"down": {"uv": [0, 0, 3, 0.5], "texture": "#missing"}
			}
		},
		{
			"from": [8, 2.5, 7.5],
			"to": [9, 5.5, 8.5],
			"rotation": {"angle": 0, "axis": "y", "origin": [15, 10, 16]},
			"faces": {
				"north": {"uv": [9, 13, 10, 16], "texture": "#0"},
				"east": {"uv": [8, 1, 9, 4], "texture": "#0"},
				"south": {"uv": [9, 4, 10, 7], "texture": "#0"},
				"west": {"uv": [11, 12, 12, 15], "texture": "#0"},
				"up": {"uv": [5, 8, 7, 10], "texture": "#0"},
				"down": {"uv": [6, 6, 7, 7], "texture": "#0"}
			}
		},
		{
			"from": [12, 2.5, 8],
			"to": [13, 8, 9],
			"rotation": {"angle": 0, "axis": "y", "origin": [19, 10, 16]},
			"faces": {
				"north": {"uv": [5, 9, 6, 15.5], "texture": "#0"},
				"east": {"uv": [3, 8, 4, 14.5], "texture": "#0"},
				"south": {"uv": [15, 3, 16, 7.5], "texture": "#0"},
				"west": {"uv": [0, 0, 1, 6.5], "texture": "#missing"},
				"up": {"uv": [0, 0, 1, 1], "texture": "#missing"},
				"down": {"uv": [6, 6, 7, 7], "texture": "#0"}
			}
		},
		{
			"from": [12, 8, 7],
			"to": [13, 9, 8],
			"rotation": {"angle": 0, "axis": "y", "origin": [19, 10, 15]},
			"faces": {
				"north": {"uv": [4, 2, 5, 3], "texture": "#0"},
				"east": {"uv": [6, 11, 7, 12], "texture": "#0"},
				"south": {"uv": [0, 0, 1, 1], "texture": "#missing"},
				"west": {"uv": [6, 10, 7, 11], "texture": "#0"},
				"up": {"uv": [4, 1, 5, 2], "texture": "#0"},
				"down": {"uv": [9, 9, 9.5, 9.5], "texture": "#0"}
			}
		},
		{
			"from": [12, 8.5, 7.5],
			"to": [13.5, 9.5, 8.5],
			"rotation": {"angle": 0, "axis": "y", "origin": [19, 10, 15]},
			"faces": {
				"north": {"uv": [5, 2, 6.5, 3], "texture": "#0"},
				"east": {"uv": [5, 12, 6, 13], "texture": "#0"},
				"south": {"uv": [14, 4, 15.5, 5], "texture": "#0"},
				"west": {"uv": [0, 0, 1, 1], "texture": "#missing"},
				"up": {"uv": [4, 13, 6.5, 15], "texture": "#0"},
				"down": {"uv": [0, 0, 1.5, 1], "texture": "#missing"}
			}
		},
		{
			"from": [13, 4.5, 7],
			"to": [13.5, 8.5, 9],
			"rotation": {"angle": 0, "axis": "y", "origin": [20, 10, 15]},
			"faces": {
				"north": {"uv": [10, 11, 10.5, 15], "texture": "#0"},
				"east": {"uv": [5, 9, 8, 14], "texture": "#0"},
				"south": {"uv": [15, 3, 15.5, 7], "texture": "#0"},
				"west": {"uv": [6, 10, 8, 14], "texture": "#0"},
				"up": {"uv": [15, 2, 15.5, 4], "texture": "#0"},
				"down": {"uv": [13, 11, 13.5, 13], "texture": "#0"}
			}
		},
		{
			"from": [12, 4, 7],
			"to": [13, 6, 8],
			"rotation": {"angle": 0, "axis": "y", "origin": [19, 10, 15]},
			"faces": {
				"north": {"uv": [9, 13, 10, 15], "texture": "#0"},
				"east": {"uv": [6, 5, 7, 7], "texture": "#0"},
				"south": {"uv": [0, 0, 1, 2], "texture": "#missing"},
				"west": {"uv": [6, 9, 7, 11], "texture": "#0"},
				"up": {"uv": [5, 8, 7, 10], "texture": "#0"},
				"down": {"uv": [9, 11, 10, 12], "texture": "#0"}
			}
		}
	],
	"display": {
		"head": {
			"rotation": [-0.5, -6, 0],
			"translation": [-2, 2.25, -8.25],
			"scale": [2, 2, 2]
		}
	}
}