{
	"credit": "Made with Blockbench",
	"textures": {
		"0": "item/light_gray_dye",
		"particle": "item/cyan_dye"
	},
	"elements": [
		{
			"from": [11, 0, 6],
			"to": [12, 5, 7],
			"rotation": {"angle": 0, "axis": "y", "origin": [19, 8, 14]},
			"faces": {
				"north": {"uv": [0, 0, 1, 5], "texture": "#0"},
				"east": {"uv": [0, 0, 1, 5], "texture": "#0"},
				"south": {"uv": [15, 0, 16, 5], "texture": "#0"},
				"west": {"uv": [5, 2, 6, 7], "texture": "#0"},
				"up": {"uv": [0, 0, 1, 1], "texture": "#0"},
				"down": {"uv": [9, 11, 14, 12], "texture": "#0"}
			}
		},
		{
			"from": [4, 0, 6],
			"to": [5, 5, 7],
			"rotation": {"angle": 0, "axis": "y", "origin": [12, 8, 14]},
			"faces": {
				"north": {"uv": [0, 0, 1, 5], "texture": "#0"},
				"east": {"uv": [9, 2, 10, 7], "texture": "#0"},
				"south": {"uv": [15, 0, 16, 5], "texture": "#0"},
				"west": {"uv": [0, 0, 1, 5], "texture": "#0"},
				"up": {"uv": [0, 0, 1, 1], "texture": "#0"},
				"down": {"uv": [9, 11, 14, 12], "texture": "#0"}
			}
		},
		{
			"from": [4, 2, 5],
			"to": [5, 5, 6],
			"rotation": {"angle": 0, "axis": "y", "origin": [12, 10, 13]},
			"faces": {
				"north": {"uv": [6, 7, 7, 12], "texture": "#0"},
				"east": {"uv": [9, 8, 10, 13], "texture": "#0"},
				"south": {"uv": [0, 0, 1, 5], "texture": "#0"},
				"west": {"uv": [7, 9, 8, 14], "texture": "#0"},
				"up": {"uv": [0, 0, 1, 1], "texture": "#0"},
				"down": {"uv": [9, 11, 14, 12], "texture": "#0"}
			}
		},
		{
			"from": [11, 2, 5],
			"to": [12, 5, 6],
			"rotation": {"angle": 0, "axis": "y", "origin": [19, 10, 13]},
			"faces": {
				"north": {"uv": [7, 8, 8, 13], "texture": "#0"},
				"east": {"uv": [6, 7, 7, 12], "texture": "#0"},
				"south": {"uv": [0, 0, 1, 5], "texture": "#0"},
				"west": {"uv": [8, 9, 9, 14], "texture": "#0"},
				"up": {"uv": [0, 0, 1, 1], "texture": "#0"},
				"down": {"uv": [9, 11, 14, 12], "texture": "#0"}
			}
		},
		{
			"from": [10, 5, 5],
			"to": [12, 7, 6],
			"rotation": {"angle": 0, "axis": "y", "origin": [19, 13, 13]},
			"faces": {
				"north": {"uv": [7, 7, 8, 12], "texture": "#0"},
				"east": {"uv": [8, 9, 9, 14], "texture": "#0"},
				"south": {"uv": [0, 0, 1, 5], "texture": "#0"},
				"west": {"uv": [10, 9, 11, 14], "texture": "#0"},
				"up": {"uv": [0, 0, 1, 1], "texture": "#0"},
				"down": {"uv": [9, 11, 14, 12], "texture": "#0"}
			}
		},
		{
			"from": [4, 5, 5],
			"to": [6, 7, 6],
			"rotation": {"angle": 0, "axis": "y", "origin": [13, 13, 13]},
			"faces": {
				"north": {"uv": [9, 8, 10, 13], "texture": "#0"},
				"east": {"uv": [7, 8, 8, 13], "texture": "#0"},
				"south": {"uv": [0, 0, 1, 5], "texture": "#0"},
				"west": {"uv": [6, 9, 7, 14], "texture": "#0"},
				"up": {"uv": [0, 0, 1, 1], "texture": "#0"},
				"down": {"uv": [9, 11, 14, 12], "texture": "#0"}
			}
		},
		{
			"from": [9, 5, 6],
			"to": [13, 7, 8],
			"rotation": {"angle": 0, "axis": "y", "origin": [19, 9, 14]},
			"faces": {
				"north": {"uv": [8, 9, 13, 11], "texture": "#0"},
				"east": {"uv": [3, 7, 4, 9], "texture": "#0"},
				"south": {"uv": [6, 10, 11, 12], "texture": "#0"},
				"west": {"uv": [6, 9, 7, 11], "texture": "#0"},
				"up": {"uv": [0, 0, 5, 1], "texture": "#0"},
				"down": {"uv": [9, 11, 14, 12], "texture": "#0"}
			}
		},
		{
			"from": [2, 7, 6],
			"to": [14, 10, 8],
			"rotation": {"angle": 0, "axis": "y", "origin": [19, 11, 14]},
			"faces": {
				"north": {"uv": [6, 8, 11, 10], "texture": "#0"},
				"east": {"uv": [9, 9, 10, 11], "texture": "#0"},
				"south": {"uv": [9, 10, 14, 12], "texture": "#0"},
				"west": {"uv": [5, 8, 6, 10], "texture": "#0"},
				"up": {"uv": [9, 9, 14, 10], "texture": "#0"},
				"down": {"uv": [9, 11, 14, 12], "texture": "#0"}
			}
		},
		{
			"from": [3, 7, 5],
			"to": [13, 9, 6],
			"rotation": {"angle": 0, "axis": "y", "origin": [19, 11, 13]},
			"faces": {
				"north": {"uv": [6, 8, 11, 10], "texture": "#0"},
				"east": {"uv": [9, 9, 10, 11], "texture": "#0"},
				"south": {"uv": [9, 10, 14, 12], "texture": "#0"},
				"west": {"uv": [5, 8, 6, 10], "texture": "#0"},
				"up": {"uv": [9, 9, 14, 10], "texture": "#0"},
				"down": {"uv": [9, 11, 14, 12], "texture": "#0"}
			}
		},
		{
			"from": [2, 9, 5],
			"to": [14, 10, 6],
			"rotation": {"angle": 0, "axis": "y", "origin": [19, 12, 13]},
			"faces": {
				"north": {"uv": [6, 8, 11, 10], "texture": "#0"},
				"east": {"uv": [9, 9, 10, 11], "texture": "#0"},
				"south": {"uv": [9, 10, 14, 12], "texture": "#0"},
				"west": {"uv": [5, 8, 6, 10], "texture": "#0"},
				"up": {"uv": [9, 9, 14, 10], "texture": "#0"},
				"down": {"uv": [9, 11, 14, 12], "texture": "#0"}
			}
		},
		{
			"from": [12, 10, 6],
			"to": [15, 12, 8],
			"rotation": {"angle": 0, "axis": "y", "origin": [19, 14, 14]},
			"faces": {
				"north": {"uv": [6, 9, 11, 11], "texture": "#0"},
				"east": {"uv": [7, 9, 8, 11], "texture": "#0"},
				"south": {"uv": [7, 8, 12, 10], "texture": "#0"},
				"west": {"uv": [8, 8, 9, 10], "texture": "#0"},
				"up": {"uv": [0, 0, 5, 1], "texture": "#0"},
				"down": {"uv": [9, 11, 14, 12], "texture": "#0"}
			}
		},
		{
			"from": [0, 12, 6],
			"to": [16, 14, 8],
			"rotation": {"angle": 0, "axis": "y", "origin": [19, 16, 14]},
			"faces": {
				"north": {"uv": [3, 8, 8, 10], "texture": "#0"},
				"east": {"uv": [7, 10, 8, 12], "texture": "#0"},
				"south": {"uv": [6, 8, 11, 10], "texture": "#0"},
				"west": {"uv": [9, 7, 10, 9], "texture": "#0"},
				"up": {"uv": [5, 9, 10, 10], "texture": "#0"},
				"down": {"uv": [9, 11, 14, 12], "texture": "#0"}
			}
		},
		{
			"from": [1, 10, 6],
			"to": [4, 12, 8],
			"rotation": {"angle": 0, "axis": "y", "origin": [9, 14, 14]},
			"faces": {
				"north": {"uv": [7, 8, 12, 10], "texture": "#0"},
				"east": {"uv": [7, 10, 8, 12], "texture": "#0"},
				"south": {"uv": [5, 8, 10, 10], "texture": "#0"},
				"west": {"uv": [8, 8, 9, 10], "texture": "#0"},
				"up": {"uv": [0, 0, 5, 1], "texture": "#0"},
				"down": {"uv": [9, 11, 14, 12], "texture": "#0"}
			}
		},
		{
			"from": [7, 10, 6],
			"to": [9, 12, 7],
			"rotation": {"angle": 0, "axis": "y", "origin": [13, 14, 14]},
			"faces": {
				"north": {"uv": [4, 7, 9, 9], "texture": "#0"},
				"east": {"uv": [6, 9, 7, 11], "texture": "#0"},
				"south": {"uv": [4, 9, 9, 11], "texture": "#0"},
				"west": {"uv": [6, 7, 7, 9], "texture": "#0"},
				"up": {"uv": [0, 0, 5, 1], "texture": "#0"},
				"down": {"uv": [9, 11, 14, 12], "texture": "#0"}
			}
		},
		{
			"from": [4, 10, 7],
			"to": [12, 12, 8],
			"rotation": {"angle": 0, "axis": "y", "origin": [13, 14, 14]},
			"faces": {
				"north": {"uv": [9, 14, 14, 16], "texture": "#0"},
				"east": {"uv": [6, 9, 7, 11], "texture": "#0"},
				"south": {"uv": [4, 9, 9, 11], "texture": "#0"},
				"west": {"uv": [6, 7, 7, 9], "texture": "#0"},
				"up": {"uv": [0, 0, 5, 1], "texture": "#0"},
				"down": {"uv": [9, 11, 14, 12], "texture": "#0"}
			}
		},
		{
			"from": [3, 5, 6],
			"to": [7, 7, 8],
			"rotation": {"angle": 0, "axis": "y", "origin": [10, 9, 14]},
			"faces": {
				"north": {"uv": [8, 8, 13, 10], "texture": "#0"},
				"east": {"uv": [9, 11, 10, 13], "texture": "#0"},
				"south": {"uv": [8, 10, 13, 12], "texture": "#0"},
				"west": {"uv": [10, 12, 11, 14], "texture": "#0"},
				"up": {"uv": [0, 0, 5, 1], "texture": "#0"},
				"down": {"uv": [9, 11, 14, 12], "texture": "#0"}
			}
		},
		{
			"from": [11, 2, 6],
			"to": [13, 5, 8],
			"rotation": {"angle": 0, "axis": "y", "origin": [20, 10, 14]},
			"faces": {
				"north": {"uv": [4, 11, 5, 14], "texture": "#0"},
				"east": {"uv": [7, 9, 8, 12], "texture": "#0"},
				"south": {"uv": [8, 10, 9, 13], "texture": "#0"},
				"west": {"uv": [8, 10, 9, 13], "texture": "#0"},
				"up": {"uv": [0, 0, 1, 1], "texture": "#0"},
				"down": {"uv": [9, 11, 14, 12], "texture": "#0"}
			}
		},
		{
			"from": [15, 11, 5],
			"to": [16, 18, 6],
			"rotation": {"angle": 0, "axis": "y", "origin": [23, 19, 13]},
			"faces": {
				"north": {"uv": [0, 8, 1, 11], "texture": "#0"},
				"east": {"uv": [0, 0, 1, 3], "texture": "#0"},
				"south": {"uv": [0, 0, 1, 3], "texture": "#0"},
				"west": {"uv": [0, 0, 1, 3], "texture": "#0"},
				"up": {"uv": [0, 0, 1, 1], "texture": "#0"},
				"down": {"uv": [0, 9, 1, 10], "texture": "#0"}
			}
		},
		{
			"from": [0, 11, 5],
			"to": [1, 18, 6],
			"rotation": {"angle": 0, "axis": "y", "origin": [8, 19, 13]},
			"faces": {
				"north": {"uv": [0, 0, 1, 3], "texture": "#0"},
				"east": {"uv": [0, 0, 1, 3], "texture": "#0"},
				"south": {"uv": [0, 0, 1, 3], "texture": "#0"},
				"west": {"uv": [0, 0, 1, 3], "texture": "#0"},
				"up": {"uv": [0, 0, 1, 1], "texture": "#0"},
				"down": {"uv": [0, 0, 1, 1], "texture": "#0"}
			}
		},
		{
			"from": [11, 12, 5],
			"to": [12, 16, 6],
			"rotation": {"angle": 0, "axis": "y", "origin": [19, 20, 13]},
			"faces": {
				"north": {"uv": [0, 0, 1, 3], "texture": "#0"},
				"east": {"uv": [0, 0, 1, 3], "texture": "#0"},
				"south": {"uv": [0, 0, 1, 3], "texture": "#0"},
				"west": {"uv": [0, 0, 1, 3], "texture": "#0"},
				"up": {"uv": [0, 0, 1, 1], "texture": "#0"},
				"down": {"uv": [0, 13, 1, 14], "texture": "#0"}
			}
		},
		{
			"from": [4, 12, 5],
			"to": [5, 16, 6],
			"rotation": {"angle": 0, "axis": "y", "origin": [12, 20, 13]},
			"faces": {
				"north": {"uv": [0, 0, 1, 3], "texture": "#0"},
				"east": {"uv": [0, 0, 1, 3], "texture": "#0"},
				"south": {"uv": [0, 0, 1, 3], "texture": "#0"},
				"west": {"uv": [0, 0, 1, 3], "texture": "#0"},
				"up": {"uv": [0, 0, 1, 1], "texture": "#0"},
				"down": {"uv": [0, 12, 1, 13], "texture": "#0"}
			}
		},
		{
			"from": [5, 12, 5],
			"to": [11, 13, 6],
			"rotation": {"angle": 0, "axis": "y", "origin": [13, 20, 13]},
			"faces": {
				"north": {"uv": [0, 0, 1, 3], "texture": "#0"},
				"east": {"uv": [0, 0, 1, 3], "texture": "#0"},
				"south": {"uv": [0, 0, 1, 3], "texture": "#0"},
				"west": {"uv": [0, 0, 1, 3], "texture": "#0"},
				"up": {"uv": [0, 0, 1, 1], "texture": "#0"},
				"down": {"uv": [0, 10, 2, 11], "texture": "#0"}
			}
		},
		{
			"from": [1, 9, 5],
			"to": [2, 12, 6],
			"rotation": {"angle": 0, "axis": "y", "origin": [9, 16, 13]},
			"faces": {
				"north": {"uv": [0, 0, 1, 3], "texture": "#0"},
				"east": {"uv": [0, 0, 1, 3], "texture": "#0"},
				"south": {"uv": [0, 0, 1, 3], "texture": "#0"},
				"west": {"uv": [0, 0, 1, 3], "texture": "#0"},
				"up": {"uv": [0, 0, 1, 1], "texture": "#0"},
				"down": {"uv": [0, 1, 1, 2], "texture": "#0"}
			}
		},
		{
			"from": [14, 9, 5],
			"to": [15, 12, 6],
			"rotation": {"angle": 0, "axis": "y", "origin": [22, 16, 13]},
			"faces": {
				"north": {"uv": [0, 0, 1, 3], "texture": "#0"},
				"east": {"uv": [0, 0, 1, 3], "texture": "#0"},
				"south": {"uv": [0, 0, 1, 3], "texture": "#0"},
				"west": {"uv": [0, 0, 1, 3], "texture": "#0"},
				"up": {"uv": [0, 0, 1, 1], "texture": "#0"},
				"down": {"uv": [0, 0, 1, 1], "texture": "#0"}
			}
		},
		{
			"from": [3, 2, 6],
			"to": [5, 5, 8],
			"rotation": {"angle": 0, "axis": "y", "origin": [11, 10, 14]},
			"faces": {
				"north": {"uv": [6, 7, 7, 10], "texture": "#0"},
				"east": {"uv": [8, 11, 9, 14], "texture": "#0"},
				"south": {"uv": [8, 11, 9, 14], "texture": "#0"},
				"west": {"uv": [6, 10, 7, 13], "texture": "#0"},
				"up": {"uv": [0, 0, 1, 1], "texture": "#0"},
				"down": {"uv": [9, 11, 14, 12], "texture": "#0"}
			}
		},
		{
			"from": [5, 3, 6],
			"to": [6, 5, 8],
			"rotation": {"angle": 0, "axis": "y", "origin": [13, 10, 14]},
			"faces": {
				"north": {"uv": [7, 10, 8, 11], "texture": "#0"},
				"east": {"uv": [7, 11, 8, 12], "texture": "#0"},
				"south": {"uv": [7, 10, 8, 11], "texture": "#0"},
				"west": {"uv": [0, 0, 1, 1], "texture": "#0"},
				"up": {"uv": [0, 0, 1, 1], "texture": "#0"},
				"down": {"uv": [9, 11, 14, 12], "texture": "#0"}
			}
		},
		{
			"from": [10, 3, 6],
			"to": [11, 5, 8],
			"rotation": {"angle": 0, "axis": "y", "origin": [18, 10, 14]},
			"faces": {
				"north": {"uv": [7, 9, 8, 10], "texture": "#0"},
				"east": {"uv": [0, 0, 0, 1], "texture": "#0"},
				"south": {"uv": [7, 12, 8, 13], "texture": "#0"},
				"west": {"uv": [8, 12, 8, 13], "texture": "#0"},
				"up": {"uv": [0, 0, 1, 0], "texture": "#0"},
				"down": {"uv": [9, 11, 14, 12], "texture": "#0"}
			}
		}
	],
	"display": {
		"head": {
			"rotation": [-1.5, 0, 0],
			"translation": [0, -0.5, -6.25]
		}
	}
}