<?xml version="1.0" encoding="UTF-8" standalone="no"?>
<!-- Created with Inkscape (http://www.inkscape.org/) -->

<svg
   version="1.1"
   id="svg2075"
   xml:space="preserve"
   width="214.60933"
   height="172.524"
   viewBox="0 0 214.60933 172.524"
   sodipodi:docname="unitvector1.svg"
   inkscape:version="1.1 (c68e22c387, 2021-05-23)"
   xmlns:inkscape="http://www.inkscape.org/namespaces/inkscape"
   xmlns:sodipodi="http://sodipodi.sourceforge.net/DTD/sodipodi-0.dtd"
   xmlns="http://www.w3.org/2000/svg"
   xmlns:svg="http://www.w3.org/2000/svg"><defs
     id="defs2079"><clipPath
       clipPathUnits="userSpaceOnUse"
       id="clipPath2085"><path
         d="M 0,0 H 619 V 742 H 0 Z"
         id="path2083" /></clipPath><linearGradient
       x1="0"
       y1="0"
       x2="1"
       y2="0"
       gradientUnits="userSpaceOnUse"
       gradientTransform="matrix(-30.278,19.198395,46.3479,73.095795,311.83681,524.85069)"
       spreadMethod="pad"
       id="linearGradient2127"><stop
         style="stop-opacity:1;stop-color:#f2fbfe"
         offset="0"
         id="stop2123" /><stop
         style="stop-opacity:1;stop-color:#66cef5"
         offset="1"
         id="stop2125" /></linearGradient><linearGradient
       x1="0"
       y1="0"
       x2="1"
       y2="0"
       gradientUnits="userSpaceOnUse"
       gradientTransform="matrix(0,27.9077,113.9077,0,221.2914,583.47369)"
       spreadMethod="pad"
       id="linearGradient2147"><stop
         style="stop-opacity:1;stop-color:#f2fbfe"
         offset="0"
         id="stop2143" /><stop
         style="stop-opacity:1;stop-color:#d9f3fd"
         offset="1"
         id="stop2145" /></linearGradient><linearGradient
       x1="0"
       y1="0"
       x2="1"
       y2="0"
       gradientUnits="userSpaceOnUse"
       gradientTransform="matrix(0,52.906692,87.149902,0,221.2914,530.8956)"
       spreadMethod="pad"
       id="linearGradient2167"><stop
         style="stop-opacity:1;stop-color:#f2fbfe"
         offset="0"
         id="stop2163" /><stop
         style="stop-opacity:1;stop-color:#99def9"
         offset="1"
         id="stop2165" /></linearGradient></defs><sodipodi:namedview
     id="namedview2077"
     pagecolor="#ffffff"
     bordercolor="#666666"
     borderopacity="1.0"
     inkscape:pageshadow="2"
     inkscape:pageopacity="0.0"
     inkscape:pagecheckerboard="0"
     showgrid="false"
     fit-margin-top="0"
     fit-margin-left="0"
     fit-margin-right="0"
     fit-margin-bottom="0"
     inkscape:zoom="1.2771688"
     inkscape:cx="129.97499"
     inkscape:cy="86.519494"
     inkscape:window-width="1360"
     inkscape:window-height="739"
     inkscape:window-x="-9"
     inkscape:window-y="247"
     inkscape:window-maximized="1"
     inkscape:current-layer="g2081" /><g
     id="g2081"
     inkscape:groupmode="layer"
     inkscape:label="Pages from EMT"
     transform="matrix(1.3333333,0,0,-1.3333333,-265.44799,848.7773)"
     clip-path="url(#clipPath2085)"><g
       id="g2111"><g
         id="g2113"><g
           id="g2119"><g
             id="g2121"><path
               d="m 306.441,583.292 26.861,28.064 v -52.653 l -26.861,-28.064 v 52.653"
               style="fill:url(#linearGradient2127);fill-rule:evenodd;stroke:none"
               id="path2129" /></g></g></g></g><g
       id="g2131"><g
         id="g2133"><g
           id="g2139"><g
             id="g2141"><path
               d="m 250.049,611.204 h 83.15 l -26.758,-27.907 h -83.15 l 26.758,27.907"
               style="fill:url(#linearGradient2147);fill-rule:evenodd;stroke:none"
               id="path2149" /></g></g></g></g><g
       id="g2151"><g
         id="g2153"><g
           id="g2159"><g
             id="g2161"><path
               d="m 223.291,583.292 h 83.15 V 530.64 h -83.15 z"
               style="fill:url(#linearGradient2167);fill-rule:evenodd;stroke:none"
               id="path2169" /></g></g></g></g><g
       id="g2171"
       transform="translate(200.754,510.81799)"><path
         d="m 0,0 c 0.127,-0.136 0.224,-0.272 0.289,-0.407 0.047,-0.093 0.124,-0.34 0.23,-0.738 l 0.345,0.517 c 0.09,0.124 0.201,0.243 0.332,0.356 0.129,0.113 0.244,0.191 0.342,0.232 C 1.601,-0.013 1.67,0 1.746,0 c 0.112,0 0.2,-0.031 0.267,-0.091 0.067,-0.059 0.1,-0.133 0.1,-0.218 0,-0.099 -0.02,-0.167 -0.059,-0.203 C 1.981,-0.577 1.898,-0.61 1.805,-0.61 1.75,-0.61 1.692,-0.599 1.629,-0.575 1.506,-0.533 1.423,-0.512 1.382,-0.512 1.319,-0.512 1.246,-0.549 1.161,-0.621 0.998,-0.756 0.806,-1.019 0.582,-1.407 l 0.32,-1.343 c 0.049,-0.206 0.091,-0.33 0.125,-0.37 0.034,-0.04 0.067,-0.06 0.102,-0.06 0.055,0 0.118,0.03 0.19,0.089 0.144,0.12 0.266,0.276 0.369,0.47 l 0.135,-0.07 C 1.66,-3 1.452,-3.254 1.198,-3.457 1.056,-3.572 0.934,-3.628 0.836,-3.628 c -0.146,0 -0.262,0.081 -0.349,0.244 -0.054,0.101 -0.167,0.54 -0.339,1.313 -0.406,-0.705 -0.731,-1.16 -0.976,-1.364 -0.159,-0.128 -0.312,-0.193 -0.462,-0.193 -0.104,0 -0.198,0.036 -0.285,0.112 -0.062,0.057 -0.093,0.133 -0.093,0.231 0,0.085 0.029,0.157 0.086,0.214 0.056,0.058 0.127,0.087 0.211,0.087 0.083,0 0.172,-0.042 0.265,-0.126 0.068,-0.06 0.12,-0.09 0.156,-0.09 0.032,0 0.072,0.021 0.122,0.063 0.122,0.098 0.289,0.312 0.5,0.64 0.21,0.328 0.349,0.565 0.414,0.712 -0.162,0.633 -0.249,0.967 -0.262,1.002 -0.06,0.17 -0.138,0.29 -0.235,0.361 -0.096,0.07 -0.237,0.106 -0.425,0.106 -0.06,0 -0.13,-0.003 -0.207,-0.009 v 0.141 L 0,0"
         style="fill:#b2b2b2;fill-opacity:1;fill-rule:evenodd;stroke:none"
         id="path2173" /></g><g
       id="g2175"
       transform="translate(357.812,560.05499)"><path
         d="M 0,0 C 0.088,-0.151 0.149,-0.292 0.184,-0.423 0.218,-0.554 0.251,-0.814 0.285,-1.198 L 0.457,-3.12 c 0.156,0.186 0.383,0.484 0.681,0.891 0.142,0.197 0.319,0.467 0.53,0.807 0.128,0.208 0.205,0.355 0.235,0.438 0.014,0.041 0.022,0.085 0.022,0.129 0,0.029 -0.008,0.053 -0.026,0.072 -0.019,0.016 -0.066,0.037 -0.143,0.064 -0.076,0.023 -0.141,0.07 -0.192,0.135 -0.05,0.066 -0.076,0.143 -0.076,0.229 0,0.107 0.032,0.192 0.095,0.258 C 1.644,-0.032 1.723,0 1.816,0 1.932,0 2.028,-0.047 2.109,-0.143 2.191,-0.237 2.231,-0.367 2.231,-0.534 2.231,-0.74 2.16,-0.976 2.02,-1.24 1.879,-1.504 1.608,-1.908 1.207,-2.456 0.808,-3.004 0.32,-3.6 -0.249,-4.245 c -0.394,-0.446 -0.686,-0.726 -0.876,-0.843 -0.19,-0.115 -0.352,-0.173 -0.487,-0.173 -0.08,0 -0.153,0.03 -0.215,0.091 -0.061,0.062 -0.09,0.133 -0.09,0.214 0,0.101 0.041,0.194 0.126,0.278 0.084,0.083 0.177,0.124 0.275,0.124 0.052,0 0.096,-0.011 0.129,-0.036 0.023,-0.013 0.045,-0.049 0.069,-0.111 0.025,-0.06 0.048,-0.101 0.069,-0.122 0.013,-0.014 0.028,-0.019 0.046,-0.019 0.015,0 0.043,0.011 0.082,0.039 0.144,0.087 0.31,0.229 0.5,0.42 0.25,0.256 0.434,0.464 0.555,0.625 l -0.219,2.476 c -0.035,0.41 -0.091,0.659 -0.163,0.748 -0.075,0.088 -0.196,0.133 -0.368,0.133 -0.055,0 -0.153,-0.008 -0.293,-0.024 L -1.144,-0.282 0,0"
         style="fill:#b2b2b2;fill-opacity:1;fill-rule:evenodd;stroke:none"
         id="path2177" /></g><g
       id="g2179"
       transform="translate(249.953,636.58299)"><path
         d="m 0,0 h 2.48 v -0.099 l -2.703,-2.812 h 1.144 c 0.271,0 0.443,0.01 0.516,0.031 0.074,0.021 0.14,0.065 0.202,0.133 0.061,0.067 0.129,0.19 0.205,0.367 h 0.144 l -0.34,-1.063 h -2.543 v 0.115 l 2.703,2.812 H 0.684 c -0.237,0 -0.381,-0.008 -0.431,-0.02 C 0.181,-0.552 0.108,-0.593 0.037,-0.66 -0.035,-0.724 -0.108,-0.835 -0.184,-0.989 H -0.332 L 0,0"
         style="fill:#b2b2b2;fill-opacity:1;fill-rule:evenodd;stroke:none"
         id="path2181" /></g><g
       id="g2183"
       transform="translate(328.14301,558.86099)"><path
         d="M 0,0 H -77.54 V 46.467"
         style="fill:none;stroke:#b2b2b2;stroke-width:0.85;stroke-linecap:butt;stroke-linejoin:miter;stroke-miterlimit:2.613;stroke-dasharray:none;stroke-opacity:1"
         id="path2185" /></g><g
       id="g2187"
       transform="translate(332.54601,558.86099)"><path
         d="m 0,0 -5.641,-1.698 c 0.806,1.133 0.806,2.264 0,3.396 L 0,0"
         style="fill:#b2b2b2;fill-opacity:1;fill-rule:evenodd;stroke:none"
         id="path2189" /></g><g
       id="g2191"
       transform="translate(250.603,609.731)"><path
         d="m 0,0 -1.698,-5.642 c 1.132,0.807 2.264,0.807 3.396,0 L 0,0"
         style="fill:#b2b2b2;fill-opacity:1;fill-rule:evenodd;stroke:none"
         id="path2193" /></g><g
       id="g2195"
       transform="translate(250.664,559.14999)"><path
         d="M 0,0 -22.495,-23.038"
         style="fill:none;stroke:#b2b2b2;stroke-width:0.85;stroke-linecap:butt;stroke-linejoin:miter;stroke-miterlimit:2.613;stroke-dasharray:none;stroke-opacity:1"
         id="path2197" /></g><g
       id="g2199"
       transform="translate(225.09399,532.964)"><path
         d="M 0,0 5.156,2.849 C 3.783,3.063 2.973,3.854 2.726,5.221 L 0,0"
         style="fill:#b2b2b2;fill-opacity:1;fill-rule:evenodd;stroke:none"
         id="path2201" /></g><g
       id="g2203"
       transform="translate(250.603,612.952)"><path
         d="M 0,0 V 13.832"
         style="fill:none;stroke:#b2b2b2;stroke-width:0.567;stroke-linecap:butt;stroke-linejoin:miter;stroke-miterlimit:2.613;stroke-dasharray:none;stroke-opacity:1"
         id="path2205" /></g><g
       id="g2207"
       transform="translate(250.603,630.42799)"><path
         d="m 0,0 -1.241,-4.124 c 0.827,0.589 1.655,0.589 2.482,0 L 0,0"
         style="fill:#b2b2b2;fill-opacity:1;fill-rule:evenodd;stroke:none"
         id="path2209" /></g><g
       id="g2211"
       transform="translate(336.119,558.8)"><path
         d="M 0,0 H 13.833"
         style="fill:none;stroke:#b2b2b2;stroke-width:0.567;stroke-linecap:butt;stroke-linejoin:miter;stroke-miterlimit:2.613;stroke-dasharray:none;stroke-opacity:1"
         id="path2213" /></g><g
       id="g2215"
       transform="translate(353.595,558.8)"><path
         d="m 0,0 -4.124,1.242 c 0.589,-0.828 0.589,-1.656 0,-2.483 L 0,0"
         style="fill:#b2b2b2;fill-opacity:1;fill-rule:evenodd;stroke:none"
         id="path2217" /></g><g
       id="g2219"
       transform="translate(221.608,528.87801)"><path
         d="M 0,0 -13.673,-13.56"
         style="fill:none;stroke:#b2b2b2;stroke-width:0.567;stroke-linecap:butt;stroke-linejoin:miter;stroke-miterlimit:2.613;stroke-dasharray:none;stroke-opacity:1"
         id="path2221" /></g><g
       id="g2223"
       transform="translate(205.34801,512.75301)"><path
         d="M 0,0 3.801,2.021 C 2.8,2.194 2.218,2.782 2.053,3.784 L 0,0"
         style="fill:#b2b2b2;fill-opacity:1;fill-rule:evenodd;stroke:none"
         id="path2225" /></g><g
       id="g2227"
       transform="translate(250.603,559.14999)"><path
         d="M 0,0 49.749,21.28"
         style="fill:none;stroke:#000000;stroke-width:1.417;stroke-linecap:butt;stroke-linejoin:miter;stroke-miterlimit:2.613;stroke-dasharray:none;stroke-opacity:1"
         id="path2229" /></g><g
       id="g2231"
       transform="translate(306.03,582.85899)"><path
         d="m 0,0 -8.213,-0.921 c 1.664,-1.016 2.289,-2.477 1.874,-4.382 L 0,0"
         style="fill:#000000;fill-opacity:1;fill-rule:evenodd;stroke:none"
         id="path2233" /></g><g
       id="g2371"
       transform="translate(257.373,604.927)"><path
         d="m 0,0 h -3.179 v 0.085 l 2.007,3.329 H -1.758 C -2.011,3.414 -2.191,3.391 -2.3,3.346 -2.41,3.3 -2.499,3.226 -2.567,3.126 -2.634,3.026 -2.704,2.849 -2.778,2.589 H -2.914 V 3.652 H 0.16 V 3.546 L -1.832,0.25 h 0.25 c 0.5,0 0.86,0.072 1.082,0.215 C -0.279,0.608 -0.112,0.87 0,1.25 H 0.109 L 0,0"
         style="fill:#000000;fill-opacity:1;fill-rule:evenodd;stroke:none"
         id="path2373" /></g><g
       id="g2375"
       transform="translate(284.646,570.571)"><path
         d="M 0,0 V -0.828 C 0.242,-0.45 0.454,-0.2 0.636,-0.076 0.818,0.048 0.994,0.11 1.164,0.11 1.309,0.11 1.426,0.066 1.513,-0.024 1.601,-0.113 1.644,-0.241 1.644,-0.404 1.644,-0.58 1.602,-0.715 1.517,-0.812 1.433,-0.908 1.33,-0.957 1.21,-0.957 c -0.137,0 -0.257,0.045 -0.358,0.133 -0.103,0.091 -0.163,0.139 -0.18,0.149 C 0.645,-0.66 0.616,-0.652 0.581,-0.652 0.507,-0.652 0.435,-0.68 0.367,-0.736 0.26,-0.826 0.18,-0.953 0.125,-1.117 0.041,-1.369 0,-1.648 0,-1.953 v -0.839 l 0.004,-0.22 c 0,-0.148 0.009,-0.241 0.026,-0.283 0.032,-0.071 0.078,-0.123 0.139,-0.155 0.062,-0.033 0.166,-0.053 0.311,-0.062 v -0.14 h -1.972 v 0.14 c 0.159,0.014 0.265,0.058 0.321,0.133 0.056,0.073 0.084,0.269 0.084,0.587 v 2.019 c 0,0.208 -0.009,0.341 -0.03,0.399 -0.027,0.074 -0.064,0.126 -0.114,0.16 -0.049,0.034 -0.137,0.057 -0.261,0.07 V 0 H 0"
         style="fill:#000000;fill-opacity:1;fill-rule:evenodd;stroke:none"
         id="path2377" /></g><g
       id="g2379"
       transform="translate(328.57001,562.77901)"><path
         d="M 0,0 -1.18,2.707 C -1.357,3.117 -1.488,3.368 -1.572,3.46 -1.657,3.556 -1.758,3.621 -1.878,3.656 V 3.8 H 0.063 V 3.656 C -0.065,3.651 -0.154,3.625 -0.206,3.582 -0.258,3.539 -0.285,3.484 -0.285,3.422 c 0,-0.099 0.065,-0.295 0.196,-0.586 l 0.624,-1.43 0.427,1.106 c 0.153,0.392 0.23,0.667 0.23,0.82 0,0.097 -0.032,0.174 -0.096,0.231 C 1.032,3.621 0.919,3.651 0.757,3.656 V 3.8 H 1.98 V 3.656 C 1.862,3.643 1.763,3.597 1.688,3.518 1.612,3.438 1.486,3.168 1.308,2.707 L 0.266,0 C 0.003,-0.677 -0.193,-1.094 -0.32,-1.25 -0.5,-1.469 -0.725,-1.578 -0.996,-1.578 c -0.216,0 -0.392,0.061 -0.525,0.185 -0.135,0.124 -0.201,0.273 -0.201,0.449 0,0.15 0.046,0.275 0.138,0.375 0.092,0.097 0.207,0.147 0.342,0.147 0.13,0 0.235,-0.042 0.314,-0.123 0.08,-0.084 0.122,-0.215 0.123,-0.389 0.003,-0.099 0.014,-0.163 0.036,-0.191 0.02,-0.028 0.05,-0.043 0.089,-0.043 0.063,0 0.13,0.038 0.2,0.114 0.104,0.11 0.227,0.359 0.367,0.749 L 0,0"
         style="fill:#000000;fill-opacity:1;fill-rule:evenodd;stroke:none"
         id="path2381" /></g><g
       id="g2383"
       transform="translate(220.554,535.605)"><path
         d="m 0,0 0.633,-1.204 c 0.219,-0.419 0.392,-0.684 0.521,-0.795 0.069,-0.06 0.166,-0.095 0.288,-0.1 v -0.14 h -2.035 v 0.14 c 0.159,0.013 0.257,0.036 0.294,0.063 0.038,0.029 0.058,0.068 0.058,0.118 0,0.072 -0.043,0.188 -0.125,0.343 l -0.316,0.594 -0.271,-0.395 c -0.121,-0.179 -0.191,-0.286 -0.207,-0.321 -0.02,-0.049 -0.03,-0.093 -0.03,-0.131 0,-0.06 0.012,-0.11 0.037,-0.15 0.024,-0.041 0.057,-0.072 0.101,-0.092 0.043,-0.018 0.122,-0.029 0.236,-0.029 v -0.14 h -1.429 v 0.14 c 0.177,0 0.339,0.049 0.485,0.147 0.148,0.099 0.362,0.353 0.643,0.769 l 0.301,0.444 -0.629,1.164 c -0.205,0.38 -0.359,0.613 -0.46,0.7 -0.103,0.085 -0.216,0.133 -0.34,0.145 v 0.143 h 2.023 V 1.27 L -0.328,1.265 -0.53,1.194 C -0.552,1.177 -0.563,1.147 -0.563,1.106 c 0,-0.039 0.007,-0.081 0.021,-0.122 0.008,-0.019 0.044,-0.088 0.109,-0.211 L -0.148,0.241 0,0.453 c 0.21,0.285 0.313,0.488 0.313,0.601 0,0.055 -0.022,0.1 -0.069,0.139 C 0.199,1.231 0.118,1.255 0,1.27 V 1.413 H 1.294 V 1.27 C 1.135,1.264 0.987,1.214 0.848,1.122 0.709,1.03 0.555,0.85 0.383,0.585 L 0,0"
         style="fill:#000000;fill-opacity:1;fill-rule:evenodd;stroke:none"
         id="path2385" /></g><g
       id="g3767"
       transform="translate(-124.872,25.44)"><path
         d="m 431.536,588.198 -0.223,-30.341 h 29.626"
         style="fill:none;stroke:#ff0000;stroke-width:1.134;stroke-linecap:butt;stroke-linejoin:miter;stroke-miterlimit:2.613;stroke-dasharray:none;stroke-opacity:1"
         id="path2237" /><path
         d="m 431.573,593.13 1.855,-6.333 c -1.261,0.912 -2.53,0.921 -3.804,0.027 l 1.949,6.306"
         style="fill:#ff0000;fill-opacity:1;fill-rule:evenodd;stroke:none"
         id="path2241" /><path
         d="m 465.89101,557.85699 -6.346,1.91 c 0.907,-1.273 0.907,-2.547 0,-3.82 l 6.346,1.91"
         style="fill:#ff0000;fill-opacity:1;fill-rule:evenodd;stroke:none"
         id="path2245" /><path
         d="M 431.549,557.621 420.737,546.385"
         style="fill:none;stroke:#ff0000;stroke-width:1.134;stroke-linecap:butt;stroke-linejoin:miter;stroke-miterlimit:2.613;stroke-dasharray:none;stroke-opacity:1"
         id="path2249" /><path
         d="m 417.312,542.826 5.763,3.239 c -1.542,0.231 -2.458,1.11 -2.747,2.644 l -3.016,-5.883"
         style="fill:#ff0000;fill-opacity:1;fill-rule:evenodd;stroke:none"
         id="path2253" /><path
         d="m 436.746,589.44299 c -0.446,-0.394 -0.846,-0.59 -1.2,-0.59 -0.208,0 -0.382,0.069 -0.519,0.206 -0.139,0.136 -0.207,0.308 -0.207,0.513 0,0.279 0.119,0.529 0.359,0.752 0.24,0.223 0.761,0.519 1.567,0.889 v 0.367 c 0,0.277 -0.015,0.449 -0.045,0.521 -0.03,0.072 -0.087,0.135 -0.169,0.189 -0.084,0.053 -0.179,0.079 -0.283,0.079 -0.168,0 -0.309,-0.039 -0.418,-0.113 -0.067,-0.046 -0.101,-0.101 -0.101,-0.164 0,-0.055 0.037,-0.123 0.109,-0.204 0.099,-0.112 0.15,-0.219 0.15,-0.323 0,-0.129 -0.049,-0.237 -0.144,-0.328 -0.096,-0.089 -0.219,-0.134 -0.373,-0.134 -0.164,0 -0.301,0.05 -0.412,0.15 -0.11,0.098 -0.166,0.214 -0.166,0.346 0,0.188 0.074,0.366 0.223,0.537 0.149,0.171 0.355,0.302 0.622,0.393 0.264,0.091 0.541,0.137 0.826,0.137 0.348,0 0.62,-0.074 0.823,-0.221 0.202,-0.148 0.332,-0.306 0.393,-0.478 0.037,-0.11 0.054,-0.361 0.054,-0.754 v -1.418 c 0,-0.167 0.006,-0.272 0.02,-0.314 0.014,-0.043 0.032,-0.076 0.059,-0.097 0.025,-0.02 0.055,-0.031 0.089,-0.031 0.069,0 0.137,0.048 0.208,0.145 l 0.117,-0.094 c -0.13,-0.193 -0.265,-0.333 -0.405,-0.42 -0.138,-0.086 -0.297,-0.131 -0.474,-0.131 -0.208,0 -0.371,0.05 -0.489,0.148 -0.117,0.096 -0.189,0.244 -0.214,0.442 z m 0,0.285 v 1.223 c -0.315,-0.186 -0.549,-0.383 -0.703,-0.594 -0.103,-0.141 -0.154,-0.282 -0.154,-0.425 0,-0.119 0.043,-0.224 0.13,-0.317 0.065,-0.071 0.156,-0.106 0.273,-0.106 0.131,0 0.282,0.075 0.454,0.219"
         style="fill:#000000;fill-opacity:1;fill-rule:evenodd;stroke:none"
         id="path2389" /><path
         d="m 438.964,589.38499 h 1.861 v -0.072 l -2.028,-2.111 h 0.859 c 0.202,0 0.331,0.009 0.386,0.024 0.055,0.016 0.105,0.05 0.151,0.099 0.047,0.052 0.097,0.143 0.154,0.276 h 0.109 l -0.255,-0.797 h -1.908 v 0.085 l 2.027,2.11 h -0.843 c -0.178,0 -0.286,-0.006 -0.322,-0.015 -0.055,-0.012 -0.11,-0.042 -0.162,-0.093 -0.055,-0.049 -0.11,-0.132 -0.166,-0.247 h -0.112 l 0.249,0.741"
         style="fill:#000000;fill-opacity:1;fill-rule:evenodd;stroke:none"
         id="path2393" /><path
         d="m 461.511,551.61 c -0.445,-0.393 -0.845,-0.588 -1.2,-0.588 -0.208,0 -0.381,0.067 -0.518,0.204 -0.138,0.136 -0.207,0.308 -0.207,0.514 0,0.278 0.12,0.529 0.36,0.752 0.239,0.222 0.76,0.518 1.565,0.888 v 0.369 c 0,0.276 -0.014,0.448 -0.045,0.52 -0.029,0.072 -0.087,0.134 -0.169,0.189 -0.085,0.052 -0.177,0.079 -0.282,0.079 -0.169,0 -0.309,-0.038 -0.418,-0.113 -0.066,-0.046 -0.101,-0.102 -0.101,-0.165 0,-0.054 0.038,-0.122 0.109,-0.203 0.099,-0.112 0.149,-0.22 0.149,-0.324 0,-0.127 -0.048,-0.236 -0.143,-0.327 -0.096,-0.088 -0.22,-0.134 -0.372,-0.134 -0.164,0 -0.302,0.05 -0.412,0.15 -0.112,0.097 -0.167,0.213 -0.167,0.345 0,0.188 0.074,0.367 0.222,0.538 0.15,0.17 0.357,0.302 0.621,0.393 0.266,0.091 0.542,0.137 0.828,0.137 0.347,0 0.621,-0.074 0.824,-0.221 0.2,-0.148 0.331,-0.307 0.391,-0.479 0.037,-0.108 0.055,-0.361 0.055,-0.754 v -1.418 c 0,-0.165 0.006,-0.272 0.021,-0.314 0.012,-0.042 0.03,-0.075 0.057,-0.096 0.027,-0.02 0.056,-0.03 0.09,-0.03 0.068,0 0.138,0.047 0.207,0.144 l 0.117,-0.094 c -0.13,-0.194 -0.265,-0.334 -0.405,-0.42 -0.138,-0.087 -0.297,-0.13 -0.474,-0.13 -0.208,0 -0.371,0.048 -0.488,0.147 -0.118,0.096 -0.19,0.244 -0.215,0.441 z m 0,0.287 v 1.221 c -0.313,-0.185 -0.549,-0.382 -0.702,-0.592 -0.103,-0.142 -0.153,-0.284 -0.153,-0.426 0,-0.119 0.043,-0.225 0.13,-0.318 0.064,-0.069 0.155,-0.105 0.272,-0.105 0.131,0 0.281,0.074 0.453,0.22"
         style="fill:#000000;fill-opacity:1;fill-rule:evenodd;stroke:none"
         id="path2397" /><path
         d="m 464.18401,551.62399 c 0.066,-0.114 0.112,-0.22 0.139,-0.318 0.024,-0.098 0.049,-0.293 0.075,-0.582 l 0.129,-1.441 c 0.117,0.14 0.287,0.364 0.51,0.668 0.107,0.148 0.24,0.35 0.398,0.606 0.097,0.157 0.154,0.266 0.176,0.328 0.011,0.032 0.017,0.064 0.017,0.097 0,0.021 -0.006,0.04 -0.02,0.053 -0.014,0.013 -0.049,0.03 -0.107,0.049 -0.058,0.017 -0.106,0.052 -0.144,0.101 -0.038,0.05 -0.057,0.108 -0.057,0.172 0,0.081 0.025,0.145 0.072,0.193 0.045,0.049 0.104,0.074 0.174,0.074 0.086,0 0.16,-0.035 0.22,-0.108 0.062,-0.071 0.091,-0.169 0.091,-0.294 0,-0.154 -0.053,-0.331 -0.157,-0.529 -0.107,-0.198 -0.31,-0.502 -0.611,-0.912 -0.3,-0.411 -0.665,-0.858 -1.092,-1.341 -0.294,-0.334 -0.514,-0.546 -0.657,-0.633 -0.141,-0.086 -0.263,-0.13 -0.366,-0.13 -0.06,0 -0.114,0.023 -0.16,0.069 -0.046,0.047 -0.067,0.099 -0.067,0.16 0,0.076 0.03,0.145 0.094,0.208 0.064,0.062 0.132,0.094 0.206,0.094 0.039,0 0.073,-0.009 0.097,-0.027 0.017,-0.009 0.033,-0.038 0.052,-0.084 0.018,-0.045 0.035,-0.075 0.051,-0.092 0.009,-0.01 0.021,-0.014 0.036,-0.014 0.01,0 0.031,0.01 0.06,0.03 0.109,0.065 0.234,0.172 0.375,0.315 0.189,0.192 0.326,0.348 0.416,0.469 l -0.164,1.857 c -0.027,0.307 -0.068,0.494 -0.123,0.56 -0.055,0.066 -0.145,0.1 -0.274,0.1 -0.041,0 -0.116,-0.006 -0.221,-0.018 l -0.025,0.108 0.857,0.212"
         style="fill:#000000;fill-opacity:1;fill-rule:evenodd;stroke:none"
         id="path2401" /><path
         d="m 426.56599,542.95 c -0.445,-0.393 -0.846,-0.589 -1.199,-0.589 -0.208,0 -0.382,0.068 -0.52,0.205 -0.138,0.136 -0.207,0.309 -0.207,0.513 0,0.28 0.119,0.53 0.359,0.753 0.241,0.222 0.761,0.518 1.567,0.887 v 0.368 c 0,0.276 -0.015,0.449 -0.046,0.522 -0.028,0.071 -0.086,0.134 -0.169,0.188 -0.084,0.053 -0.177,0.081 -0.281,0.081 -0.17,0 -0.31,-0.039 -0.419,-0.115 -0.067,-0.047 -0.101,-0.101 -0.101,-0.164 0,-0.053 0.037,-0.122 0.11,-0.203 0.098,-0.113 0.148,-0.221 0.148,-0.325 0,-0.128 -0.048,-0.235 -0.142,-0.327 -0.096,-0.089 -0.219,-0.134 -0.374,-0.134 -0.163,0 -0.3,0.051 -0.411,0.149 -0.111,0.1 -0.167,0.215 -0.167,0.348 0,0.187 0.075,0.366 0.222,0.536 0.15,0.172 0.356,0.302 0.622,0.393 0.266,0.092 0.541,0.137 0.828,0.137 0.346,0 0.62,-0.074 0.822,-0.22 0.202,-0.148 0.332,-0.306 0.392,-0.479 0.038,-0.109 0.056,-0.361 0.056,-0.755 v -1.417 c 0,-0.167 0.006,-0.272 0.019,-0.315 0.014,-0.043 0.032,-0.074 0.059,-0.096 0.025,-0.02 0.056,-0.03 0.09,-0.03 0.067,0 0.136,0.047 0.208,0.144 l 0.115,-0.094 c -0.129,-0.193 -0.264,-0.333 -0.403,-0.42 -0.14,-0.087 -0.297,-0.13 -0.476,-0.13 -0.208,0 -0.37,0.049 -0.487,0.146 -0.117,0.099 -0.19,0.246 -0.215,0.443 z m 0,0.285 v 1.224 c -0.315,-0.186 -0.55,-0.384 -0.702,-0.594 -0.104,-0.142 -0.154,-0.282 -0.154,-0.425 0,-0.121 0.042,-0.226 0.129,-0.318 0.066,-0.071 0.156,-0.106 0.273,-0.106 0.132,0 0.282,0.074 0.454,0.219"
         style="fill:#000000;fill-opacity:1;fill-rule:evenodd;stroke:none"
         id="path2405" /><path
         d="m 429.32001,542.96201 c 0.096,-0.101 0.169,-0.203 0.217,-0.304 0.036,-0.071 0.093,-0.255 0.173,-0.553 l 0.258,0.386 c 0.068,0.094 0.152,0.183 0.249,0.268 0.097,0.085 0.183,0.144 0.257,0.174 0.047,0.021 0.1,0.029 0.156,0.029 0.084,0 0.151,-0.021 0.201,-0.066 0.049,-0.046 0.076,-0.101 0.076,-0.164 0,-0.075 -0.017,-0.125 -0.046,-0.153 -0.055,-0.049 -0.116,-0.074 -0.187,-0.074 -0.041,0 -0.085,0.009 -0.132,0.027 -0.091,0.033 -0.154,0.047 -0.185,0.047 -0.046,0 -0.102,-0.028 -0.167,-0.082 -0.121,-0.101 -0.265,-0.297 -0.433,-0.589 l 0.24,-1.007 c 0.038,-0.154 0.068,-0.247 0.094,-0.276 0.026,-0.032 0.05,-0.047 0.076,-0.047 0.041,0 0.089,0.023 0.144,0.068 0.108,0.089 0.199,0.208 0.275,0.351 l 0.102,-0.053 c -0.123,-0.23 -0.278,-0.421 -0.469,-0.574 -0.107,-0.086 -0.198,-0.129 -0.271,-0.129 -0.11,0 -0.197,0.061 -0.262,0.184 -0.041,0.077 -0.126,0.405 -0.254,0.985 -0.305,-0.53 -0.549,-0.869 -0.732,-1.023 -0.119,-0.096 -0.235,-0.146 -0.346,-0.146 -0.079,0 -0.15,0.028 -0.214,0.085 -0.047,0.044 -0.071,0.1 -0.071,0.174 0,0.064 0.022,0.118 0.065,0.16 0.042,0.043 0.095,0.064 0.158,0.064 0.062,0 0.129,-0.03 0.2,-0.094 0.05,-0.044 0.089,-0.066 0.116,-0.066 0.024,0 0.055,0.015 0.092,0.046 0.091,0.074 0.216,0.234 0.375,0.48 0.157,0.246 0.261,0.424 0.31,0.535 -0.122,0.473 -0.185,0.724 -0.197,0.752 -0.044,0.126 -0.103,0.217 -0.176,0.27 -0.072,0.052 -0.178,0.078 -0.319,0.078 -0.045,0 -0.097,-0.002 -0.154,-0.006 v 0.106 l 0.781,0.137"
         style="fill:#000000;fill-opacity:1;fill-rule:evenodd;stroke:none"
         id="path2409" /></g><g
       id="g2541"
       transform="translate(247.662,525.286)"><path
         d="m 0,0 v -0.827 c 0.243,0.377 0.455,0.627 0.636,0.752 0.183,0.124 0.359,0.186 0.528,0.186 0.145,0 0.263,-0.045 0.35,-0.136 0.087,-0.089 0.13,-0.216 0.13,-0.38 0,-0.174 -0.041,-0.311 -0.126,-0.407 -0.084,-0.096 -0.187,-0.145 -0.307,-0.145 -0.137,0 -0.258,0.046 -0.359,0.133 -0.102,0.09 -0.162,0.139 -0.18,0.149 -0.026,0.016 -0.056,0.023 -0.09,0.023 -0.075,0 -0.147,-0.027 -0.215,-0.085 C 0.26,-0.825 0.18,-0.952 0.125,-1.117 0.042,-1.368 0,-1.647 0,-1.952 v -0.84 L 0.004,-3.01 c 0,-0.148 0.01,-0.244 0.027,-0.286 0.032,-0.069 0.077,-0.122 0.139,-0.154 0.061,-0.033 0.165,-0.054 0.31,-0.062 v -0.14 h -1.972 v 0.14 c 0.159,0.014 0.266,0.059 0.321,0.133 0.057,0.074 0.085,0.269 0.085,0.587 v 2.019 c 0,0.208 -0.01,0.342 -0.031,0.399 -0.027,0.073 -0.064,0.126 -0.113,0.16 -0.05,0.035 -0.138,0.058 -0.262,0.07 V 0 H 0"
         style="fill:#000000;fill-opacity:1;fill-rule:evenodd;stroke:none"
         id="path2543" /></g><g
       id="g2545"
       transform="translate(260.369,523.87399)"><path
         d="M 0,0 0.633,-1.205 C 0.852,-1.623 1.025,-1.889 1.153,-2 1.222,-2.06 1.32,-2.094 1.441,-2.1 v -0.14 h -2.034 v 0.14 c 0.158,0.014 0.257,0.035 0.294,0.063 0.037,0.029 0.058,0.068 0.058,0.117 0,0.074 -0.043,0.188 -0.126,0.344 l -0.316,0.594 -0.27,-0.395 c -0.122,-0.179 -0.191,-0.285 -0.207,-0.32 -0.02,-0.049 -0.031,-0.092 -0.031,-0.132 0,-0.06 0.012,-0.111 0.037,-0.151 0.025,-0.039 0.058,-0.07 0.102,-0.09 0.042,-0.019 0.121,-0.03 0.236,-0.03 v -0.14 h -1.429 v 0.14 c 0.177,0 0.338,0.05 0.485,0.148 0.148,0.099 0.361,0.354 0.642,0.768 l 0.302,0.445 -0.63,1.163 c -0.205,0.38 -0.358,0.614 -0.459,0.699 -0.103,0.088 -0.216,0.135 -0.34,0.145 v 0.144 h 2.022 V 1.268 L -0.328,1.264 -0.531,1.194 C -0.552,1.176 -0.563,1.147 -0.563,1.105 c 0,-0.039 0.007,-0.08 0.02,-0.122 0.008,-0.018 0.044,-0.088 0.109,-0.209 L -0.148,0.24 0,0.452 C 0.209,0.738 0.313,0.94 0.313,1.054 0.313,1.108 0.29,1.154 0.244,1.192 0.199,1.231 0.117,1.256 0,1.268 V 1.412 H 1.293 V 1.268 C 1.135,1.263 0.987,1.215 0.848,1.122 0.709,1.03 0.555,0.85 0.383,0.585 L 0,0"
         style="fill:#000000;fill-opacity:1;fill-rule:evenodd;stroke:none"
         id="path2547" /></g><g
       id="g2549"
       transform="translate(272.397,521.48599)"><path
         d="M 0,0 -1.18,2.707 C -1.358,3.116 -1.488,3.368 -1.572,3.46 -1.657,3.556 -1.759,3.621 -1.879,3.656 V 3.8 H 0.063 V 3.656 C -0.066,3.651 -0.155,3.626 -0.207,3.582 -0.259,3.539 -0.286,3.485 -0.286,3.422 c 0,-0.099 0.066,-0.295 0.197,-0.585 L 0.535,1.406 0.961,2.511 C 1.114,2.904 1.192,3.178 1.192,3.332 1.192,3.428 1.16,3.506 1.096,3.563 1.032,3.621 0.918,3.651 0.757,3.656 V 3.8 H 1.98 V 3.656 C 1.861,3.644 1.762,3.597 1.688,3.519 1.612,3.438 1.485,3.168 1.308,2.707 L 0.265,0 C 0.002,-0.677 -0.193,-1.094 -0.32,-1.25 -0.5,-1.469 -0.725,-1.578 -0.996,-1.578 c -0.216,0 -0.392,0.061 -0.525,0.185 -0.135,0.124 -0.202,0.274 -0.202,0.449 0,0.151 0.047,0.276 0.139,0.375 0.092,0.098 0.207,0.148 0.341,0.148 0.131,0 0.236,-0.042 0.315,-0.125 0.08,-0.083 0.121,-0.213 0.123,-0.388 0.002,-0.099 0.014,-0.163 0.036,-0.191 0.019,-0.028 0.05,-0.043 0.089,-0.043 0.063,0 0.129,0.039 0.2,0.114 0.104,0.11 0.226,0.36 0.367,0.749 L 0,0"
         style="fill:#000000;fill-opacity:1;fill-rule:evenodd;stroke:none"
         id="path2551" /></g><g
       id="g2553"
       transform="translate(286.22501,521.634)"><path
         d="m 0,0 h -3.179 v 0.086 l 2.007,3.329 H -1.758 C -2.011,3.415 -2.191,3.392 -2.3,3.347 -2.409,3.301 -2.499,3.227 -2.567,3.127 -2.634,3.027 -2.704,2.848 -2.778,2.59 H -2.913 V 3.652 H 0.16 V 3.547 L -1.832,0.251 h 0.251 c 0.499,0 0.859,0.072 1.081,0.215 0.221,0.142 0.388,0.405 0.5,0.785 H 0.109 L 0,0"
         style="fill:#000000;fill-opacity:1;fill-rule:evenodd;stroke:none"
         id="path2555" /></g><path
       d="m 251.572,525.085 h 4.216 v -0.32 h -4.216 z m 0,-1.275 h 4.216 v -0.32 h -4.216 z"
       style="fill:#000000;fill-opacity:1;fill-rule:evenodd;stroke:none"
       id="path2557" /><g
       id="g2559"
       transform="translate(266.02901,522.185)"><path
         d="m 0,0 v 1.949 h -1.945 v 0.32 H 0 V 4.212 H 0.313 V 2.269 H 2.267 V 1.949 H 0.313 V 0 H 0"
         style="fill:#000000;fill-opacity:1;fill-rule:evenodd;stroke:none"
         id="path2561" /></g><g
       id="g2563"
       transform="translate(278.541,522.185)"><path
         d="m 0,0 v 1.949 h -1.945 v 0.32 H 0 V 4.212 H 0.313 V 2.269 H 2.266 V 1.949 H 0.313 V 0 H 0"
         style="fill:#000000;fill-opacity:1;fill-rule:evenodd;stroke:none"
         id="path2565" /></g></g></svg>
