<?xml version="1.0" encoding="UTF-8" standalone="no"?>
<svg
   xmlns:dc="http://purl.org/dc/elements/1.1/"
   xmlns:cc="http://creativecommons.org/ns#"
   xmlns:rdf="http://www.w3.org/1999/02/22-rdf-syntax-ns#"
   xmlns:svg="http://www.w3.org/2000/svg"
   xmlns="http://www.w3.org/2000/svg"
   xmlns:sodipodi="http://sodipodi.sourceforge.net/DTD/sodipodi-0.dtd"
   xmlns:inkscape="http://www.inkscape.org/namespaces/inkscape"
   version="1.1"
   id="Layer_1"
   x="0px"
   y="0px"
   width="100px"
   height="100px"
   viewBox="5.0 -10.0 100.0 135.0"
   enable-background="new 0 0 100 100"
   xml:space="preserve"
   inkscape:version="0.48.5 r10040"
   sodipodi:docname="Fire Danger.svg"><metadata
   id="metadata25"><rdf:RDF><cc:Work
       rdf:about=""><dc:format>image/svg+xml</dc:format><dc:type
         rdf:resource="http://purl.org/dc/dcmitype/StillImage" /></cc:Work></rdf:RDF></metadata><defs
   id="defs23" /><sodipodi:namedview
   pagecolor="#ffffff"
   bordercolor="#666666"
   borderopacity="1"
   objecttolerance="10"
   gridtolerance="10"
   guidetolerance="10"
   inkscape:pageopacity="0"
   inkscape:pageshadow="2"
   inkscape:window-width="640"
   inkscape:window-height="480"
   id="namedview21"
   showgrid="false"
   inkscape:zoom="2.36"
   inkscape:cx="50"
   inkscape:cy="50"
   inkscape:window-x="0"
   inkscape:window-y="0"
   inkscape:window-maximized="0"
   inkscape:current-layer="Layer_1" />
<path
   fill="#000000"
   d="M82.833,28.043c-0.512,0-1.012-0.267-1.283-0.744c-4.307-7.546-11.171-13.306-19.329-16.218  c-0.768-0.274-1.168-1.119-0.894-1.887c0.273-0.768,1.118-1.169,1.886-0.894c8.822,3.15,16.246,9.377,20.901,17.536  c0.403,0.708,0.157,1.61-0.551,2.013C83.332,27.981,83.081,28.043,82.833,28.043z"
   id="path3" />
<path
   fill="#000000"
   d="M9.61,28.043c-0.249,0-0.5-0.062-0.731-0.194c-0.708-0.403-0.954-1.305-0.55-2.013  c4.649-8.147,12.061-14.365,20.868-17.509c0.768-0.275,1.612,0.125,1.887,0.894c0.274,0.768-0.126,1.613-0.894,1.887  c-8.145,2.907-14.998,8.657-19.298,16.192C10.621,27.776,10.123,28.043,9.61,28.043z"
   id="path5" />
<path
   fill="#000000"
   d="M90.444,23.709c-0.512,0-1.011-0.267-1.283-0.744c-5.347-9.369-13.869-16.52-23.995-20.134  c-0.768-0.274-1.168-1.119-0.894-1.887c0.272-0.768,1.12-1.17,1.886-0.894c10.791,3.852,19.87,11.47,25.567,21.452  c0.404,0.708,0.157,1.609-0.551,2.013C90.944,23.647,90.692,23.709,90.444,23.709z"
   id="path7" />
<path
   fill="#000000"
   d="M2.01,23.717c-0.249,0-0.5-0.062-0.73-0.194c-0.708-0.404-0.955-1.306-0.55-2.014  C6.417,11.542,15.484,3.936,26.258,0.089c0.767-0.273,1.612,0.126,1.887,0.894c0.274,0.768-0.126,1.613-0.894,1.887  C17.141,6.479,8.632,13.618,3.293,22.972C3.021,23.45,2.523,23.717,2.01,23.717z"
   id="path9" />
<path
   fill="#000000"
   d="M96.079,63.229c0.868-1.161,1.39-2.599,1.39-4.16c0-3.844-3.113-6.958-6.956-6.958s-6.959,3.114-6.959,6.958  c0,3.843,3.116,6.957,6.959,6.957c0.338,0,0.668-0.032,0.993-0.079c3.055,5.809,3.477,11.133,1.166,15.037  c-1.667,2.815-4.623,4.597-8.265,5.069c-0.305-1.135-1.275-1.99-2.473-2.123v-1.547c0-2.608-2.115-4.724-4.724-4.724H75.92  c-7.321,8.118-17.921,13.224-29.714,13.224c-11.793,0-22.392-5.105-29.714-13.224h-1.292c-2.609,0-4.724,2.115-4.724,4.724v12.931  c0,2.608,2.115,4.724,4.724,4.724h62.01c2.608,0,4.724-2.115,4.724-4.724v-1.547c1.283-0.142,2.314-1.111,2.535-2.368  c5.506-0.554,10.191-3.344,12.775-7.709C100.567,78.075,100.146,70.82,96.079,63.229z"
   id="path11" />
<path
   fill="#000000"
   d="M46.206,15.146c-19.733,0-35.729,15.997-35.729,35.729c0,19.733,15.996,35.729,35.729,35.729  c19.732,0,35.729-15.995,35.729-35.729C81.935,31.142,65.938,15.146,46.206,15.146z M46.206,60.214  c-5.149,0-9.338-4.189-9.338-9.338c0-5.149,4.189-9.339,9.338-9.339c5.149,0,9.339,4.189,9.339,9.339  C55.545,56.024,51.355,60.214,46.206,60.214z"
   id="path13" />
<path
   fill="#000000"
   d="M46.206,44.489c-3.521,0-6.386,2.865-6.386,6.386c0,3.521,2.865,6.386,6.386,6.386  c3.521,0,6.386-2.865,6.386-6.386C52.592,47.354,49.728,44.489,46.206,44.489z"
   id="path15" />
</svg>