<?xml version="1.0" encoding="UTF-8" standalone="no"?>
<svg
   xmlns:dc="http://purl.org/dc/elements/1.1/"
   xmlns:cc="http://creativecommons.org/ns#"
   xmlns:rdf="http://www.w3.org/1999/02/22-rdf-syntax-ns#"
   xmlns:svg="http://www.w3.org/2000/svg"
   xmlns="http://www.w3.org/2000/svg"
   xmlns:sodipodi="http://sodipodi.sourceforge.net/DTD/sodipodi-0.dtd"
   xmlns:inkscape="http://www.inkscape.org/namespaces/inkscape"
   version="1.1"
   id="Layer_1"
   x="0px"
   y="0px"
   width="48px"
   height="100px"
   viewBox="2.4 -10.0 48.0 135.0"
   enable-background="new 0 0 48 100"
   xml:space="preserve"
   inkscape:version="0.48.5 r10040"
   sodipodi:docname="Mobile Devices Theft.svg"><metadata
   id="metadata13"><rdf:RDF><cc:Work
       rdf:about=""><dc:format>image/svg+xml</dc:format><dc:type
         rdf:resource="http://purl.org/dc/dcmitype/StillImage" /></cc:Work></rdf:RDF></metadata><defs
   id="defs11" /><sodipodi:namedview
   pagecolor="#ffffff"
   bordercolor="#666666"
   borderopacity="1"
   objecttolerance="10"
   gridtolerance="10"
   guidetolerance="10"
   inkscape:pageopacity="0"
   inkscape:pageshadow="2"
   inkscape:window-width="640"
   inkscape:window-height="480"
   id="namedview9"
   showgrid="false"
   inkscape:zoom="2.36"
   inkscape:cx="24"
   inkscape:cy="50"
   inkscape:window-x="0"
   inkscape:window-y="0"
   inkscape:window-maximized="0"
   inkscape:current-layer="Layer_1" />
<path
   d="M41.6,1H6.4C2.865,1,0,3.865,0,7.4v76.033c0,3.535,2.865,6.4,6.4,6.4h35.2c3.535,0,6.4-2.865,6.4-6.4V7.4  C48,3.865,45.135,1,41.6,1z M24,86.999c-2.302,0-4.167-1.865-4.167-4.166c0-2.302,1.865-4.167,4.167-4.167  c2.3,0,4.166,1.865,4.166,4.167C28.166,85.134,26.301,86.999,24,86.999z M44,73.433c0,1.323-1.077,2.4-2.4,2.4H6.4  c-1.323,0-2.4-1.077-2.4-2.4V7.4C4,6.077,5.077,5,6.4,5h35.2C42.923,5,44,6.077,44,7.4V73.433z"
   id="path3" />
</svg>