<svg xmlns="http://www.w3.org/2000/svg" xmlns:xlink="http://www.w3.org/1999/xlink" version="1.1" id="Layer_1" x="0px" y="0px" viewBox="0 0 100 100" enable-background="new 0 0 100 100" xml:space="preserve" height="100px" width="100px">
<path d="M77.7,9.8c1.1,0,2-0.9,2-2V7.2c0-1.1-0.9-2-2-2h-0.6H22.8h-0.6c-1.1,0-2,0.9-2,2v0.6c0,1.1,0.9,2,2,2h0.6v23.8h-0.6  c-1.1,0-2,0.9-2,2v0.6c0,1.1,0.9,2,2,2h0.6v23.8h-0.6c-1.1,0-2,0.9-2,2v0.6c0,1.1,0.9,2,2,2h0.6v23.8h-0.6c-1.1,0-2,0.9-2,2v0.6  c0,1.1,0.9,2,2,2h0.6h54.3h0.6c1.1,0,2-0.9,2-2v-0.6c0-1.1-0.9-2-2-2h-0.6V66.4h0.6c1.1,0,2-0.9,2-2v-0.6c0-1.1-0.9-2-2-2h-0.6V38.1  h0.6c1.1,0,2-0.9,2-2v-0.6c0-1.1-0.9-2-2-2h-0.6V9.8H77.7z M49.9,64.7c-8.1,0-14.7-6.6-14.7-14.7s6.6-14.7,14.7-14.7  S64.6,41.9,64.6,50S58.1,64.7,49.9,64.7z"/>
<path d="M49.9,39.9c-2,3.3-6.5,10.1-6.5,13.7s2.9,6.5,6.5,6.5c3.6,0,6.5-2.9,6.5-6.5S52,43.2,49.9,39.9z"/>
</svg>