{
 //database connection settings
    "dbConfig": {
      "host": "mongodb://localhost",
      "port": 27017,
      "databasename" : "nodewebappdb"
     // "database": "mongodb://localhost:27017/nodewebappdb"      
    },
    "tokenConfig" : {
      "secret" : "sharvee"
    },
    "uploadFilePath" : {
    	"studyfilepath" : "/home/teleray_app/uploads/studies/",
    	"studyhistoryfilepath" : "/home/teleray_app/uploads/history/",
    	"studyreportfilepath" : "/home/teleray_app/uploads/studyreport/"
    },
    "logfilepath" : "/home/teleray_app/logs/logs",
    "medirazerbaseurl" : "http://dev.radimazer.com/"
 
}