{  
   "dbConfig":{  
      "host":"mongodb://localhost",
      "port":27017,
      "databasename":"nodewebappdb"
   },
   "tokenConfig":{  
      "secret":"sharvee"
   },
   "logfilepath":"../teleray-token-service-logs/logs",
   "medirazerbaseurl":"http://127.0.0.1/",
   "medirazerbaseurlport" : "http://127.0.0.1/teleray-service/",
   "medirazerbaseurlemailport" : "http://127.0.0.1/teleray-email-service/",
   "medirazerbaseurlFileMgmtport" : "http://127.0.0.1/teleray-file-mgmt-service/",
   "medirazerbaseurltokenport" : "http://127.0.0.1/teleray-token-service/"
}