module github.com/ppal31/mygo

go 1.17

require (
	github.com/alecthomas/units v0.0.0-20210208195552-ff826a37aa15 // indirect
	github.com/bxcodec/faker/v3 v3.6.0
	github.com/go-chi/chi v1.5.4
	github.com/go-chi/chi/v5 v5.0.4
	github.com/go-chi/cors v1.2.0
	github.com/go-kit/kit v0.11.0
	github.com/go-kit/log v0.1.0
	github.com/jmoiron/sqlx v1.3.4
	github.com/joho/godotenv v1.3.0
	github.com/kelseyhightower/envconfig v1.4.0
	github.com/mattn/go-sqlite3 v1.14.6
	golang.org/x/sync v0.0.0-20210220032951-036812b2e83c
	gopkg.in/alecthomas/kingpin.v2 v2.2.6
)

require (
	github.com/alecthomas/template v0.0.0-20190718012654-fb15b899a751 // indirect
	github.com/go-logfmt/logfmt v0.5.0 // indirect
)
