<svg width="113" height="82" viewBox="0 0 113 82" fill="none" xmlns="http://www.w3.org/2000/svg">
<path d="M34.0762 1.63574V80H18.6074V19.4678L0.0234375 25.376V13.1836L32.4111 1.63574H34.0762ZM112.172 34.0234V47.5586C112.172 53.431 111.545 58.4977 110.292 62.7588C109.039 66.984 107.23 70.4574 104.867 73.1787C102.54 75.8643 99.7646 77.8516 96.542 79.1406C93.3193 80.4297 89.7386 81.0742 85.7998 81.0742C82.6488 81.0742 79.7126 80.6803 76.9912 79.8926C74.2699 79.069 71.8171 77.7979 69.6328 76.0791C67.4844 74.3604 65.6224 72.194 64.0469 69.5801C62.5072 66.9303 61.3255 63.7793 60.502 60.127C59.6784 56.4746 59.2666 52.2852 59.2666 47.5586V34.0234C59.2666 28.151 59.8932 23.1201 61.1465 18.9307C62.4355 14.7054 64.2438 11.25 66.5713 8.56445C68.9346 5.87891 71.7275 3.90951 74.9502 2.65625C78.1729 1.36719 81.7536 0.722656 85.6924 0.722656C88.8434 0.722656 91.7617 1.13444 94.4473 1.95801C97.1686 2.74577 99.6214 3.98112 101.806 5.66406C103.99 7.34701 105.852 9.51335 107.392 12.1631C108.931 14.777 110.113 17.9102 110.937 21.5625C111.76 25.179 112.172 29.3327 112.172 34.0234ZM96.6494 49.5996V31.9287C96.6494 29.0999 96.4883 26.6292 96.166 24.5166C95.8796 22.404 95.432 20.6136 94.8232 19.1455C94.2145 17.6416 93.4626 16.4242 92.5674 15.4932C91.6722 14.5622 90.6517 13.8818 89.5059 13.4521C88.36 13.0225 87.0889 12.8076 85.6924 12.8076C83.9378 12.8076 82.3802 13.1478 81.0195 13.8281C79.6947 14.5085 78.5667 15.6006 77.6357 17.1045C76.7048 18.5726 75.9886 20.542 75.4873 23.0127C75.0218 25.4476 74.7891 28.4196 74.7891 31.9287V49.5996C74.7891 52.4284 74.9323 54.917 75.2188 57.0654C75.541 59.2139 76.0065 61.0579 76.6152 62.5977C77.2598 64.1016 78.0117 65.3369 78.8711 66.3037C79.7663 67.2347 80.7868 67.915 81.9326 68.3447C83.1143 68.7744 84.4033 68.9893 85.7998 68.9893C87.5186 68.9893 89.0404 68.6491 90.3652 67.9688C91.7259 67.2526 92.8717 66.1426 93.8027 64.6387C94.7695 63.099 95.4857 61.0938 95.9512 58.623C96.4167 56.1523 96.6494 53.1445 96.6494 49.5996Z" fill="white"/>
<path d="M34.0762 1.63574H39.0762V-3.36426H34.0762V1.63574ZM34.0762 80V85H39.0762V80H34.0762ZM18.6074 80H13.6074V85H18.6074V80ZM18.6074 19.4678H23.6074V12.6316L17.0925 14.7028L18.6074 19.4678ZM0.0234375 25.376H-4.97656V32.2122L1.53832 30.141L0.0234375 25.376ZM0.0234375 13.1836L-1.65577 8.474L-4.97656 9.65803V13.1836H0.0234375ZM32.4111 1.63574V-3.36426H31.5464L30.7319 -3.07385L32.4111 1.63574ZM29.0762 1.63574V80H39.0762V1.63574H29.0762ZM34.0762 75H18.6074V85H34.0762V75ZM23.6074 80V19.4678H13.6074V80H23.6074ZM17.0925 14.7028L-1.49144 20.611L1.53832 30.141L20.1223 24.2328L17.0925 14.7028ZM5.02344 25.376V13.1836H-4.97656V25.376H5.02344ZM1.70265 17.8932L34.0903 6.34534L30.7319 -3.07385L-1.65577 8.474L1.70265 17.8932ZM32.4111 6.63574H34.0762V-3.36426H32.4111V6.63574ZM110.292 62.7588L115.086 64.1806L115.089 64.1696L110.292 62.7588ZM104.867 73.1787L101.092 69.9003L101.089 69.9041L104.867 73.1787ZM76.9912 79.8926L75.5429 84.6782L75.5719 84.687L75.6009 84.6954L76.9912 79.8926ZM69.6328 76.0791L66.5093 79.9834L66.525 79.996L66.5409 80.0085L69.6328 76.0791ZM64.0469 69.5801L59.7237 72.0922L59.7439 72.1268L59.7646 72.1612L64.0469 69.5801ZM60.502 60.127L55.6244 61.2268L60.502 60.127ZM61.1465 18.9307L56.3641 17.4716L56.3601 17.4846L56.3562 17.4977L61.1465 18.9307ZM66.5713 8.56445L62.8177 5.26131L62.8052 5.27551L62.7928 5.2898L66.5713 8.56445ZM74.9502 2.65625L76.7624 7.31627L76.7848 7.30756L76.8072 7.29863L74.9502 2.65625ZM94.4473 1.95801L92.9813 6.73828L93.0191 6.74985L93.057 6.76083L94.4473 1.95801ZM107.392 12.1631L103.068 14.6752L103.076 14.688L103.083 14.7008L107.392 12.1631ZM110.937 21.5625L106.059 22.6623L106.061 22.6727L110.937 21.5625ZM96.166 24.5166L91.2114 25.1884L91.2169 25.2296L91.2232 25.2706L96.166 24.5166ZM94.8232 19.1455L90.1885 21.0215L90.1964 21.0411L90.2045 21.0606L94.8232 19.1455ZM81.0195 13.8281L78.7835 9.35599L78.7594 9.36801L78.7355 9.38029L81.0195 13.8281ZM77.6357 17.1045L81.8583 19.7822L81.8728 19.7593L81.8871 19.7363L77.6357 17.1045ZM75.4873 23.0127L70.5872 22.0185L70.5815 22.0461L70.5762 22.0738L75.4873 23.0127ZM75.2188 57.0654L70.2626 57.7262L70.268 57.7667L70.2741 57.8071L75.2188 57.0654ZM76.6152 62.5977L71.9654 64.436L71.9915 64.502L72.0195 64.5673L76.6152 62.5977ZM78.8711 66.3037L75.134 69.6255L75.1991 69.6987L75.2669 69.7693L78.8711 66.3037ZM81.9326 68.3447L80.177 73.0264L80.2004 73.0351L80.2239 73.0437L81.9326 68.3447ZM90.3652 67.9688L92.6493 72.4166L92.6717 72.4051L92.694 72.3933L90.3652 67.9688ZM93.8027 64.6387L89.5683 61.9798L89.5598 61.9933L89.5514 62.0069L93.8027 64.6387ZM107.172 34.0234V47.5586H117.172V34.0234H107.172ZM107.172 47.5586C107.172 53.0973 106.578 57.6652 105.495 61.348L115.089 64.1696C116.512 59.3303 117.172 53.7647 117.172 47.5586H107.172ZM105.498 61.337C104.404 65.0268 102.895 67.8242 101.092 69.9003L108.642 76.4571C111.566 73.0905 113.674 68.9413 115.086 64.1806L105.498 61.337ZM101.089 69.9041C99.2706 72.0019 97.1492 73.5126 94.685 74.4982L98.3989 83.783C102.38 82.1905 105.809 79.7266 108.646 76.4534L101.089 69.9041ZM94.685 74.4982C92.1272 75.5214 89.1877 76.0742 85.7998 76.0742V86.0742C90.2895 86.0742 94.5115 85.338 98.3989 83.783L94.685 74.4982ZM85.7998 76.0742C83.0671 76.0742 80.6036 75.733 78.3815 75.0898L75.6009 84.6954C78.8216 85.6277 82.2305 86.0742 85.7998 86.0742V76.0742ZM78.4395 75.1069C76.3006 74.4596 74.4079 73.4742 72.7248 72.1497L66.5409 80.0085C69.2262 82.1215 72.2391 83.6784 75.5429 84.6782L78.4395 75.1069ZM72.7563 72.1748C71.117 70.8633 69.6328 69.1619 68.3292 66.999L59.7646 72.1612C61.612 75.2261 63.8518 77.8574 66.5093 79.9834L72.7563 72.1748ZM68.37 67.068C67.1352 64.9429 66.115 62.289 65.3795 59.0271L55.6244 61.2268C56.536 65.2695 57.8792 68.9178 59.7237 72.0922L68.37 67.068ZM65.3795 59.0271C64.6553 55.8153 64.2666 52.0068 64.2666 47.5586H54.2666C54.2666 52.5635 54.7015 57.1339 55.6244 61.2268L65.3795 59.0271ZM64.2666 47.5586V34.0234H54.2666V47.5586H64.2666ZM64.2666 34.0234C64.2666 28.4815 64.8609 23.96 65.9367 20.3636L56.3562 17.4977C54.9256 22.2802 54.2666 27.8206 54.2666 34.0234H64.2666ZM65.9289 20.3897C67.0621 16.6753 68.5772 13.8844 70.3497 11.8391L62.7928 5.2898C59.9105 8.61562 57.809 12.7355 56.3641 17.4716L65.9289 20.3897ZM70.3249 11.8676C72.178 9.76177 74.3125 8.26903 76.7624 7.31627L73.138 -2.00377C69.1426 -0.450018 65.6912 1.99604 62.8177 5.26131L70.3249 11.8676ZM76.8072 7.29863C79.365 6.2755 82.3045 5.72266 85.6924 5.72266V-4.27734C81.2026 -4.27734 76.9807 -3.54113 73.0932 -1.98613L76.8072 7.29863ZM85.6924 5.72266C88.4062 5.72266 90.8246 6.0769 92.9813 6.73828L95.9132 -2.82226C92.6988 -3.80802 89.2806 -4.27734 85.6924 -4.27734V5.72266ZM93.057 6.76083C95.1935 7.3793 97.0796 8.33467 98.754 9.62477L104.857 1.70336C102.163 -0.372433 99.1437 -1.88776 95.8376 -2.84481L93.057 6.76083ZM98.754 9.62477C100.37 10.87 101.818 12.5237 103.068 14.6752L111.715 9.651C109.885 6.50299 107.61 3.82399 104.857 1.70336L98.754 9.62477ZM103.083 14.7008C104.307 16.7775 105.324 19.4023 106.059 22.6623L115.814 20.4627C114.902 16.418 113.556 12.7766 111.7 9.62541L103.083 14.7008ZM106.061 22.6727C106.784 25.8441 107.172 29.613 107.172 34.0234H117.172C117.172 29.0524 116.737 24.514 115.812 20.4523L106.061 22.6727ZM101.649 49.5996V31.9287H91.6494V49.5996H101.649ZM101.649 31.9287C101.649 28.9231 101.479 26.1897 101.109 23.7626L91.2232 25.2706C91.4975 27.0687 91.6494 29.2768 91.6494 31.9287H101.649ZM101.121 23.8448C100.795 21.4403 100.261 19.2057 99.442 17.2304L90.2045 21.0606C90.6029 22.0215 90.9645 23.3676 91.2114 25.1884L101.121 23.8448ZM99.458 17.2695C98.6691 15.3206 97.6056 13.5191 96.1715 12.0276L88.9632 18.9587C89.3195 19.3292 89.7599 19.9626 90.1885 21.0215L99.458 17.2695ZM96.1715 12.0276C94.7881 10.5888 93.1452 9.4769 91.2615 8.7705L87.7502 18.1338C88.1582 18.2868 88.5563 18.5355 88.9632 18.9587L96.1715 12.0276ZM91.2615 8.7705C89.4809 8.1028 87.6048 7.80762 85.6924 7.80762V17.8076C86.573 17.8076 87.2391 17.9421 87.7502 18.1338L91.2615 8.7705ZM85.6924 7.80762C83.2808 7.80762 80.9377 8.27886 78.7835 9.35599L83.2556 18.3003C83.8227 18.0167 84.5948 17.8076 85.6924 17.8076V7.80762ZM78.7355 9.38029C76.4616 10.548 74.7034 12.342 73.3844 14.4727L81.8871 19.7363C82.4301 18.8591 82.9277 18.469 83.3036 18.276L78.7355 9.38029ZM73.4132 14.4268C72.0438 16.5862 71.1599 19.1958 70.5872 22.0185L80.3875 24.0069C80.8173 21.8882 81.3657 20.559 81.8583 19.7822L73.4132 14.4268ZM70.5762 22.0738C70.0329 24.9161 69.7891 28.223 69.7891 31.9287H79.7891C79.7891 28.6162 80.0108 25.9791 80.3984 23.9516L70.5762 22.0738ZM69.7891 31.9287V49.5996H79.7891V31.9287H69.7891ZM69.7891 49.5996C69.7891 52.5868 69.9397 55.3044 70.2626 57.7262L80.1749 56.4046C79.9249 54.5296 79.7891 52.27 79.7891 49.5996H69.7891ZM70.2741 57.8071C70.6363 60.2218 71.1816 62.4533 71.9654 64.436L81.265 60.7594C80.8314 59.6626 80.4458 58.2059 80.1634 56.3237L70.2741 57.8071ZM72.0195 64.5673C72.8223 66.4404 73.8375 68.1669 75.134 69.6255L82.6081 62.9819C82.186 62.507 81.6972 61.7627 81.211 60.6281L72.0195 64.5673ZM75.2669 69.7693C76.6504 71.208 78.2933 72.32 80.177 73.0264L83.6882 63.6631C83.2803 63.5101 82.8822 63.2614 82.4753 62.8382L75.2669 69.7693ZM80.2239 73.0437C82.0104 73.6933 83.8847 73.9893 85.7998 73.9893V63.9893C84.9219 63.9893 84.2181 63.8555 83.6413 63.6458L80.2239 73.0437ZM85.7998 73.9893C88.1902 73.9893 90.516 73.512 92.6493 72.4166L88.0812 63.5209C87.5647 63.7861 86.8469 63.9893 85.7998 63.9893V73.9893ZM92.694 72.3933C94.9563 71.2026 96.7253 69.417 98.0541 67.2704L89.5514 62.0069C89.0182 62.8682 88.4955 63.3026 88.0365 63.5442L92.694 72.3933ZM98.0372 67.2975C99.4378 65.0669 100.325 62.4154 100.865 59.5488L91.0376 57.6973C90.6467 59.7721 90.1013 61.131 89.5683 61.9798L98.0372 67.2975ZM100.865 59.5488C101.406 56.6772 101.649 53.3397 101.649 49.5996H91.6494C91.6494 52.9493 91.4276 55.6274 91.0376 57.6973L100.865 59.5488Z" fill="#053EAC"/>
</svg>
