<svg width="129" height="129" viewBox="0 0 129 129" fill="none" xmlns="http://www.w3.org/2000/svg">
<path d="M71.5833 30L70.0556 75.3302H58.9444L57.3704 30H71.5833ZM57 89.3641C57 87.4511 57.679 85.8668 59.037 84.6114C60.4259 83.3261 62.2469 82.6834 64.5 82.6834C66.784 82.6834 68.6049 83.3261 69.963 84.6114C71.321 85.8668 72 87.4511 72 89.3641C72 91.2174 71.321 92.7867 69.963 94.072C68.6049 95.3573 66.784 96 64.5 96C62.2469 96 60.4259 95.3573 59.037 94.072C57.679 92.7867 57 91.2174 57 89.3641Z" fill="#9B9999"/>
<circle cx="64.5" cy="64.5" r="61" stroke="#9B9999" stroke-width="7"/>
</svg>
